Diagnosed failure

Parameters/TestRpc.TestCallWithChainCertAndChainCA/SSL_TCP: /data0/somelongdirectorytoavoidrpathissues/src/kudu/src/kudu/rpc/rpc-test.cc:270: Failure
Failed
Bad status: Runtime error: could not verify certificate chain (error with cert: subject=CN = localhost, ST = sadfjas, C = AS, emailAddress = sdflkdsajf, O = lskdfjlsad, OU = sldfkja, issuer=C = AS, ST = ASDfkjdhf, L = lskdjf, O = saldfja, OU = skdjf, CN = localhost, emailAddress = sadjflkadsj): : certificate has expired
Google Test trace:
/data0/somelongdirectorytoavoidrpathissues/src/kudu/src/kudu/rpc/rpc-test.cc:267: Connecting to 0.0.0.0:38829
I20260926 13:40:59.156783   383 test_util.cc:175] -----------------------------------------------
I20260926 13:40:59.156869   383 test_util.cc:176] Had fatal failures, leaving test files at /tmp/dist-test-taskp3SlA0/test-tmp/rpc-test.5.Parameters_TestRpc.TestCallWithChainCertAndChainCA_SSL_TCP.1790430059077354-383-0

Full log

Note: This is test shard 6 of 8.
[==========] Running 21 tests from 2 test suites.
[----------] Global test environment set-up.
[----------] 20 tests from Parameters/TestRpc
[ RUN      ] Parameters/TestRpc.TestMessengerCreateDestroy/SSL_TCP
WARNING: Logging before InitGoogleLogging() is written to STDERR
I20260926 13:40:59.105580   383 rpc-test.cc:169] started messenger TestCreateDestroy
[       OK ] Parameters/TestRpc.TestMessengerCreateDestroy/SSL_TCP (23 ms)
[ RUN      ] Parameters/TestRpc.TestNegotiationDeadlock/SSL_TCP
I20260926 13:40:59.131691   403 acceptor_pool.cc:254] collecting diagnostics on the listening RPC socket 0.0.0.0:33831 every 8 connection(s)
I20260926 13:40:59.131742   404 acceptor_pool.cc:254] collecting diagnostics on the listening RPC socket 0.0.0.0:33831 every 8 connection(s)
[       OK ] Parameters/TestRpc.TestNegotiationDeadlock/SSL_TCP (36 ms)
[ RUN      ] Parameters/TestRpc.TestCallWithChainCertAndChainCA/SSL_TCP
I20260926 13:40:59.151432   419 acceptor_pool.cc:254] collecting diagnostics on the listening RPC socket 0.0.0.0:38829 every 8 connection(s)
I20260926 13:40:59.151476   420 acceptor_pool.cc:254] collecting diagnostics on the listening RPC socket 0.0.0.0:38829 every 8 connection(s)
/data0/somelongdirectorytoavoidrpathissues/src/kudu/src/kudu/rpc/rpc-test.cc:270: Failure
Failed
Bad status: Runtime error: could not verify certificate chain (error with cert: subject=CN = localhost, ST = sadfjas, C = AS, emailAddress = sdflkdsajf, O = lskdfjlsad, OU = sldfkja, issuer=C = AS, ST = ASDfkjdhf, L = lskdjf, O = saldfja, OU = skdjf, CN = localhost, emailAddress = sadjflkadsj): : certificate has expired
Google Test trace:
/data0/somelongdirectorytoavoidrpathissues/src/kudu/src/kudu/rpc/rpc-test.cc:267: Connecting to 0.0.0.0:38829
I20260926 13:40:59.156783   383 test_util.cc:175] -----------------------------------------------
I20260926 13:40:59.156869   383 test_util.cc:176] Had fatal failures, leaving test files at /tmp/dist-test-taskp3SlA0/test-tmp/rpc-test.5.Parameters_TestRpc.TestCallWithChainCertAndChainCA_SSL_TCP.1790430059077354-383-0
[  FAILED  ] Parameters/TestRpc.TestCallWithChainCertAndChainCA/SSL_TCP, where GetParam() = (true, false) (12 ms)
[ RUN      ] Parameters/TestRpc.TestCallWithPasswordProtectedKey/SSL_TCP
I20260926 13:40:59.189047   444 acceptor_pool.cc:254] collecting diagnostics on the listening RPC socket 0.0.0.0:44049 every 8 connection(s)
I20260926 13:40:59.189064   445 acceptor_pool.cc:254] collecting diagnostics on the listening RPC socket 0.0.0.0:44049 every 8 connection(s)
[       OK ] Parameters/TestRpc.TestCallWithPasswordProtectedKey/SSL_TCP (50 ms)
[ RUN      ] Parameters/TestRpc.TestCallToBadServer/SSL_TCP
I20260926 13:40:59.241597   383 rpc-test.cc:394] Status: Network error: Client connection negotiation failed: client connection to 0.0.0.0:0: connect: Connection refused (error 111)
I20260926 13:40:59.242137   383 rpc-test.cc:394] Status: Network error: Client connection negotiation failed: client connection to 0.0.0.0:0: connect: Connection refused (error 111)
I20260926 13:40:59.242552   383 rpc-test.cc:394] Status: Network error: Client connection negotiation failed: client connection to 0.0.0.0:0: connect: Connection refused (error 111)
I20260926 13:40:59.242944   383 rpc-test.cc:394] Status: Network error: Client connection negotiation failed: client connection to 0.0.0.0:0: connect: Connection refused (error 111)
I20260926 13:40:59.243325   383 rpc-test.cc:394] Status: Network error: Client connection negotiation failed: client connection to 0.0.0.0:0: connect: Connection refused (error 111)
[       OK ] Parameters/TestRpc.TestCallToBadServer/SSL_TCP (36 ms)
[ RUN      ] Parameters/TestRpc.TestWrongService/SSL_TCP
I20260926 13:40:59.254725   479 acceptor_pool.cc:254] collecting diagnostics on the listening RPC socket 0.0.0.0:46071 every 8 connection(s)
I20260926 13:40:59.254765   480 acceptor_pool.cc:254] collecting diagnostics on the listening RPC socket 0.0.0.0:46071 every 8 connection(s)
I20260926 13:40:59.269670   477 messenger.cc:345] service WrongServiceName not registered on TestServer
[       OK ] Parameters/TestRpc.TestWrongService/SSL_TCP (27 ms)
[ RUN      ] Parameters/TestRpc.TestConnectionKeepalive/SSL_TCP
I20260926 13:40:59.291103   502 acceptor_pool.cc:254] collecting diagnostics on the listening RPC socket 0.0.0.0:38185 every 8 connection(s)
I20260926 13:40:59.291134   503 acceptor_pool.cc:254] collecting diagnostics on the listening RPC socket 0.0.0.0:38185 every 8 connection(s)
I20260926 13:40:59.291453   383 rpc-test.cc:488] Connecting to 0.0.0.0:38185
[       OK ] Parameters/TestRpc.TestConnectionKeepalive/SSL_TCP (1051 ms)
[ RUN      ] Parameters/TestRpc.TestClientConnectionMetrics/SSL_TCP
I20260926 13:41:00.329998   527 acceptor_pool.cc:254] collecting diagnostics on the listening RPC socket 0.0.0.0:36755 every 8 connection(s)
I20260926 13:41:00.330166   528 acceptor_pool.cc:254] collecting diagnostics on the listening RPC socket 0.0.0.0:36755 every 8 connection(s)
I20260926 13:41:00.330426   383 rpc-test.cc:569] Connecting to 0.0.0.0:36755
[       OK ] Parameters/TestRpc.TestClientConnectionMetrics/SSL_TCP (14146 ms)
[ RUN      ] Parameters/TestRpc.TestCredentialsPolicy/SSL_TCP
I20260926 13:41:14.487648   550 acceptor_pool.cc:254] collecting diagnostics on the listening RPC socket 0.0.0.0:41343 every 8 connection(s)
I20260926 13:41:14.487758   551 acceptor_pool.cc:254] collecting diagnostics on the listening RPC socket 0.0.0.0:41343 every 8 connection(s)
I20260926 13:41:14.488202   383 rpc-test.cc:700] Connecting to 0.0.0.0:41343
[       OK ] Parameters/TestRpc.TestCredentialsPolicy/SSL_TCP (50 ms)
[ RUN      ] Parameters/TestRpc.TestCallLongerThanKeepalive/SSL_TCP
I20260926 13:41:14.542629   575 acceptor_pool.cc:254] collecting diagnostics on the listening RPC socket 0.0.0.0:44117 every 8 connection(s)
I20260926 13:41:14.542716   576 acceptor_pool.cc:254] collecting diagnostics on the listening RPC socket 0.0.0.0:44117 every 8 connection(s)
I20260926 13:41:14.556071   579 rpc-test-base.h:222] got call: sleep_micros: 3000000 deferred: true
I20260926 13:41:17.556911   579 rpcz_store.cc:275] Call kudu.rpc.GenericCalculatorService.Sleep from 127.0.0.1:48692 (request call id 0) took 3000 ms. Trace:
I20260926 13:41:17.557037   579 rpcz_store.cc:276] 0926 13:41:14.555987 (+     0us) service_pool.cc:170] Inserting onto call queue
0926 13:41:14.556037 (+    50us) service_pool.cc:227] Handling call
0926 13:41:17.556891 (+3000854us) inbound_call.cc:173] Queueing success response
Metrics: {}
[       OK ] Parameters/TestRpc.TestCallLongerThanKeepalive/SSL_TCP (3038 ms)
[ RUN      ] Parameters/TestRpc.TestRpcSidecar/SSL_TCP
I20260926 13:41:17.571900   600 acceptor_pool.cc:254] collecting diagnostics on the listening RPC socket 0.0.0.0:43071 every 8 connection(s)
I20260926 13:41:17.571913   601 acceptor_pool.cc:254] collecting diagnostics on the listening RPC socket 0.0.0.0:43071 every 8 connection(s)
[       OK ] Parameters/TestRpc.TestRpcSidecar/SSL_TCP (82 ms)
[ RUN      ] Parameters/TestRpc.TestRpcSidecarLimits/SSL_TCP
I20260926 13:41:19.464762   625 acceptor_pool.cc:254] collecting diagnostics on the listening RPC socket 0.0.0.0:36319 every 8 connection(s)
I20260926 13:41:19.464812   626 acceptor_pool.cc:254] collecting diagnostics on the listening RPC socket 0.0.0.0:36319 every 8 connection(s)
W20260926 13:41:19.487054   383 serialization.cc:72] Serialized kudu.rpc_test.PushStringsRequestPB (2147483654 bytes) is larger than the maximum configured RPC message size (52428800 bytes). Sending anyway, but peer may reject the data.
W20260926 13:41:19.491678   624 connection.cc:535] server connection from 127.0.0.1:48600 recv error: Network error: RPC frame had a length of 2147483714, but we only support messages up to 52428800 bytes long.
W20260926 13:41:19.491776   624 connection.cc:158] shutting down server connection from 127.0.0.1:48600 with pending inbound data: 4/2147483714 bytes received; last active 0 ns ago: status Network error: RPC frame had a length of 2147483714, but we only support messages up to 52428800 bytes long.
W20260926 13:41:19.492084   638 connection.cc:196] Error closing socket: Network error: TlsSocket::Close: Connection reset by peer
I20260926 13:41:19.512780   650 acceptor_pool.cc:254] collecting diagnostics on the listening RPC socket 0.0.0.0:41211 every 8 connection(s)
I20260926 13:41:19.512972   651 acceptor_pool.cc:254] collecting diagnostics on the listening RPC socket 0.0.0.0:41211 every 8 connection(s)
W20260926 13:41:23.969614   649 connection.cc:577] server connection from 127.0.0.1:45666: received bad data: 'Corruption: Invalid packet: message had a length of 2147483710, but we only support messages up to 2147483647 bytes
'
[       OK ] Parameters/TestRpc.TestRpcSidecarLimits/SSL_TCP (6330 ms)
[ RUN      ] Parameters/TestRpc.TestCallTimeoutDoesntAffectNegotiation/SSL_TCP
I20260926 13:41:23.982510   675 acceptor_pool.cc:254] collecting diagnostics on the listening RPC socket 0.0.0.0:38535 every 8 connection(s)
I20260926 13:41:23.982545   676 acceptor_pool.cc:254] collecting diagnostics on the listening RPC socket 0.0.0.0:38535 every 8 connection(s)
W20260926 13:41:24.009405   671 negotiation.cc:266] Injecting 500ms delay in negotiation
I20260926 13:41:24.059729   383 rpc-test-base.h:595] status: Timed out: connection negotiation to 0.0.0.0:38535 for RPC Sleep timed out after 0.050s (ON_OUTBOUND_QUEUE), seconds elapsed: 0.0509136
[       OK ] Parameters/TestRpc.TestCallTimeoutDoesntAffectNegotiation/SSL_TCP (548 ms)
[ RUN      ] Parameters/TestRpc.TestRpcHandlerLatencyMetric/SSL_TCP
I20260926 13:41:24.531304   700 acceptor_pool.cc:254] collecting diagnostics on the listening RPC socket 0.0.0.0:40989 every 8 connection(s)
I20260926 13:41:24.531438   701 acceptor_pool.cc:254] collecting diagnostics on the listening RPC socket 0.0.0.0:40989 every 8 connection(s)
I20260926 13:41:24.562435   383 rpc-test.cc:1236] Sleep() min lat: 20386
I20260926 13:41:24.562507   383 rpc-test.cc:1237] Sleep() mean lat: 20386
I20260926 13:41:24.562537   383 rpc-test.cc:1238] Sleep() max lat: 20386
I20260926 13:41:24.562551   383 rpc-test.cc:1239] Sleep() #calls: 1
[       OK ] Parameters/TestRpc.TestRpcHandlerLatencyMetric/SSL_TCP (43 ms)
[ RUN      ] Parameters/TestRpc.TimedOutOnResponseMetricServiceQueue/SSL_TCP
I20260926 13:41:24.579173   726 acceptor_pool.cc:254] collecting diagnostics on the listening RPC socket 0.0.0.0:45765 every 8 connection(s)
I20260926 13:41:24.579185   727 acceptor_pool.cc:254] collecting diagnostics on the listening RPC socket 0.0.0.0:45765 every 8 connection(s)
W20260926 13:41:24.648373   728 rpcz_store.cc:267] Call kudu.rpc_test.CalculatorService.Sleep from 127.0.0.1:47516 (request call id 2) took 20 ms (client timeout 20 ms). Trace:
W20260926 13:41:24.648515   728 rpcz_store.cc:269] 0926 13:41:24.627853 (+     0us) service_pool.cc:170] Inserting onto call queue
0926 13:41:24.648297 (+ 20444us) service_pool.cc:214] Skipping call since client already timed out
0926 13:41:24.648352 (+    55us) inbound_call.cc:173] Queueing failure response
Metrics: {}
[       OK ] Parameters/TestRpc.TimedOutOnResponseMetricServiceQueue/SSL_TCP (85 ms)
[ RUN      ] Parameters/TestRpc.RpcPendingConnectionsMetric/SSL_TCP
I20260926 13:41:24.652889   749 acceptor_pool.cc:254] collecting diagnostics on the listening RPC socket 0.0.0.0:35269 every 8 connection(s)
I20260926 13:41:24.652938   750 acceptor_pool.cc:254] collecting diagnostics on the listening RPC socket 0.0.0.0:35269 every 8 connection(s)
W20260926 13:41:24.662732   745 negotiation.cc:337] Failed RPC negotiation. Trace:
0926 13:41:24.662070 (+     0us) reactor.cc:625] Submitting negotiation task for server connection from 127.0.0.1:37490 (local address 127.0.0.1:35269)
0926 13:41:24.662262 (+   192us) server_negotiation.cc:206] Beginning negotiation
0926 13:41:24.662268 (+     6us) server_negotiation.cc:399] Waiting for connection header
0926 13:41:24.662433 (+   165us) negotiation.cc:327] Negotiation complete: Network error: Server connection negotiation failed: server connection from 127.0.0.1:37490: BlockingRecv error: recv got EOF from 127.0.0.1:37490 (error 108)
Metrics: {"server-negotiator.queue_time_us":68}
[       OK ] Parameters/TestRpc.RpcPendingConnectionsMetric/SSL_TCP (22 ms)
[ RUN      ] Parameters/TestRpc.TestRpcContextClientDeadline/SSL_TCP
I20260926 13:41:24.685667   765 acceptor_pool.cc:254] collecting diagnostics on the listening RPC socket 0.0.0.0:46355 every 8 connection(s)
I20260926 13:41:24.685678   766 acceptor_pool.cc:254] collecting diagnostics on the listening RPC socket 0.0.0.0:46355 every 8 connection(s)
[       OK ] Parameters/TestRpc.TestRpcContextClientDeadline/SSL_TCP (55 ms)
[ RUN      ] Parameters/TestRpc.TestApplicationFeatureFlagUnsupportedServer/SSL_TCP
I20260926 13:41:24.734532   790 acceptor_pool.cc:254] collecting diagnostics on the listening RPC socket 0.0.0.0:45017 every 8 connection(s)
I20260926 13:41:24.734582   791 acceptor_pool.cc:254] collecting diagnostics on the listening RPC socket 0.0.0.0:45017 every 8 connection(s)
[       OK ] Parameters/TestRpc.TestApplicationFeatureFlagUnsupportedServer/SSL_TCP (46 ms)
[ RUN      ] Parameters/TestRpc.TestCancellationAsync/SSL_TCP
I20260926 13:41:24.789989   815 acceptor_pool.cc:254] collecting diagnostics on the listening RPC socket 0.0.0.0:46499 every 8 connection(s)
I20260926 13:41:24.790031   816 acceptor_pool.cc:254] collecting diagnostics on the listening RPC socket 0.0.0.0:46499 every 8 connection(s)
I20260926 13:41:24.790328   383 rpc-test.cc:1716] Connecting to 0.0.0.0:46499
I20260926 13:41:24.809350   383 test_util.cc:268] Using random seed: -46972285
I20260926 13:41:24.829988   819 rpc-test-base.h:240] got call: sleep_micros: 500 pattern: 4294967295 num_repetitions: 2097152 sidecar_idx: 0
I20260926 13:41:24.850045   818 rpc-test-base.h:240] got call: sleep_micros: 500 pattern: 4294967295 num_repetitions: 2097152 sidecar_idx: 0
I20260926 13:41:24.867390   819 rpc-test-base.h:240] got call: sleep_micros: 500 pattern: 4294967295 num_repetitions: 2097152 sidecar_idx: 0
I20260926 13:41:24.885317   818 rpc-test-base.h:240] got call: sleep_micros: 500 pattern: 4294967295 num_repetitions: 2097152 sidecar_idx: 0
I20260926 13:41:24.902892   819 rpc-test-base.h:240] got call: sleep_micros: 500 pattern: 4294967295 num_repetitions: 2097152 sidecar_idx: 0
I20260926 13:41:24.924934   818 rpc-test-base.h:240] got call: sleep_micros: 500 pattern: 4294967295 num_repetitions: 2097152 sidecar_idx: 0
I20260926 13:41:24.942909   819 rpc-test-base.h:240] got call: sleep_micros: 500 pattern: 4294967295 num_repetitions: 2097152 sidecar_idx: 0
W20260926 13:41:24.949338   814 connection.cc:441] server connection from 127.0.0.1:45526 torn down before Call kudu.rpc.GenericCalculatorService.SleepWithSidecar from 127.0.0.1:45526 (request call id 8) could send its response
W20260926 13:41:24.960862   814 connection.cc:441] server connection from 127.0.0.1:45526 torn down before Call kudu.rpc.GenericCalculatorService.SleepWithSidecar from 127.0.0.1:45526 (request call id 9) could send its response
[       OK ] Parameters/TestRpc.TestCancellationAsync/SSL_TCP (186 ms)
[ RUN      ] Parameters/TestRpc.TestPerformanceBySocketType/SSL_TCP
I20260926 13:41:24.978329   840 acceptor_pool.cc:254] collecting diagnostics on the listening RPC socket 0.0.0.0:40157 every 8 connection(s)
I20260926 13:41:24.978336   841 acceptor_pool.cc:254] collecting diagnostics on the listening RPC socket 0.0.0.0:40157 every 8 connection(s)
I20260926 13:41:24.978741   383 rpc-test.cc:1846] Connecting to 0.0.0.0:40157
I20260926 13:41:27.312672   383 rpc-test.cc:1859] Sending 1024MB via ssl-enabled tcp socket: real 2.324s	user 2.371s	sys 1.709s
I20260926 13:41:29.663614   383 rpc-test.cc:1859] Sending 1024MB via ssl-enabled tcp socket: real 2.351s	user 2.461s	sys 1.658s
I20260926 13:41:32.167299   383 rpc-test.cc:1859] Sending 1024MB via ssl-enabled tcp socket: real 2.504s	user 2.555s	sys 1.876s
I20260926 13:41:34.520006   383 rpc-test.cc:1859] Sending 1024MB via ssl-enabled tcp socket: real 2.353s	user 2.447s	sys 1.689s
I20260926 13:41:36.785390   383 rpc-test.cc:1859] Sending 1024MB via ssl-enabled tcp socket: real 2.265s	user 2.294s	sys 1.662s
[       OK ] Parameters/TestRpc.TestPerformanceBySocketType/SSL_TCP (11827 ms)
[----------] 20 tests from Parameters/TestRpc (37705 ms total)

[----------] 1 test from Parameters/TestRpcSocketTxRxQueue
[ RUN      ] Parameters/TestRpcSocketTxRxQueue.OverCapacity/0
W20260926 13:41:37.066308   866 negotiation.cc:337] Failed RPC negotiation. Trace:
0926 13:41:36.793519 (+     0us) reactor.cc:625] Submitting negotiation task for client connection to 0.0.0.0:40173 (local address 127.0.0.1:54476)
0926 13:41:36.793642 (+   123us) negotiation.cc:107] Waiting for socket to connect
0926 13:41:36.793658 (+    16us) client_negotiation.cc:174] Beginning negotiation
0926 13:41:36.793747 (+    89us) client_negotiation.cc:252] Sending NEGOTIATE NegotiatePB request
0926 13:41:37.066189 (+272442us) negotiation.cc:327] Negotiation complete: Network error: Client connection negotiation failed: client connection to 0.0.0.0:40173: BlockingRecv error: recv error from unknown peer: Transport endpoint is not connected (error 107)
Metrics: {"client-negotiator.queue_time_us":32}
W20260926 13:41:37.066360   875 negotiation.cc:337] Failed RPC negotiation. Trace:
0926 13:41:36.795197 (+     0us) reactor.cc:625] Submitting negotiation task for client connection to 0.0.0.0:40173 (local address 127.0.0.1:54478)
0926 13:41:36.795294 (+    97us) negotiation.cc:107] Waiting for socket to connect
0926 13:41:36.795305 (+    11us) client_negotiation.cc:174] Beginning negotiation
0926 13:41:36.795410 (+   105us) client_negotiation.cc:252] Sending NEGOTIATE NegotiatePB request
0926 13:41:37.066242 (+270832us) negotiation.cc:327] Negotiation complete: Network error: Client connection negotiation failed: client connection to 0.0.0.0:40173: BlockingRecv error: recv error from unknown peer: Transport endpoint is not connected (error 107)
Metrics: {"client-negotiator.queue_time_us":36}
W20260926 13:41:37.066455   884 negotiation.cc:337] Failed RPC negotiation. Trace:
0926 13:41:36.797392 (+     0us) reactor.cc:625] Submitting negotiation task for client connection to 0.0.0.0:40173 (local address 127.0.0.1:54480)
0926 13:41:36.797546 (+   154us) negotiation.cc:107] Waiting for socket to connect
0926 13:41:36.797576 (+    30us) client_negotiation.cc:174] Beginning negotiation
0926 13:41:36.797662 (+    86us) client_negotiation.cc:252] Sending NEGOTIATE NegotiatePB request
0926 13:41:37.066392 (+268730us) negotiation.cc:327] Negotiation complete: Network error: Client connection negotiation failed: client connection to 0.0.0.0:40173: BlockingRecv error: recv error from unknown peer: Transport endpoint is not connected (error 107)
Metrics: {"client-negotiator.queue_time_us":31}
W20260926 13:41:37.066363   893 negotiation.cc:337] Failed RPC negotiation. Trace:
0926 13:41:36.798811 (+     0us) reactor.cc:625] Submitting negotiation task for client connection to 0.0.0.0:40173 (local address 127.0.0.1:54488)
0926 13:41:36.798991 (+   180us) negotiation.cc:107] Waiting for socket to connect
0926 13:41:36.799004 (+    13us) client_negotiation.cc:174] Beginning negotiation
0926 13:41:36.799148 (+   144us) client_negotiation.cc:252] Sending NEGOTIATE NegotiatePB request
0926 13:41:37.066215 (+267067us) negotiation.cc:327] Negotiation complete: Network error: Client connection negotiation failed: client connection to 0.0.0.0:40173: BlockingRecv error: recv error from unknown peer: Transport endpoint is not connected (error 107)
Metrics: {"client-negotiator.queue_time_us":56}
W20260926 13:41:37.066622   902 negotiation.cc:337] Failed RPC negotiation. Trace:
0926 13:41:36.800480 (+     0us) reactor.cc:625] Submitting negotiation task for client connection to 0.0.0.0:40173 (local address 127.0.0.1:54498)
0926 13:41:36.800582 (+   102us) negotiation.cc:107] Waiting for socket to connect
0926 13:41:36.800597 (+    15us) client_negotiation.cc:174] Beginning negotiation
0926 13:41:36.800681 (+    84us) client_negotiation.cc:252] Sending NEGOTIATE NegotiatePB request
0926 13:41:37.066554 (+265873us) negotiation.cc:327] Negotiation complete: Network error: Client connection negotiation failed: client connection to 0.0.0.0:40173: BlockingRecv error: recv error from unknown peer: Transport endpoint is not connected (error 107)
Metrics: {"client-negotiator.queue_time_us":30}
W20260926 13:41:37.066306   857 negotiation.cc:337] Failed RPC negotiation. Trace:
0926 13:41:36.792125 (+     0us) reactor.cc:625] Submitting negotiation task for client connection to 0.0.0.0:40173 (local address 127.0.0.1:54460)
0926 13:41:36.792243 (+   118us) negotiation.cc:107] Waiting for socket to connect
0926 13:41:36.792259 (+    16us) client_negotiation.cc:174] Beginning negotiation
0926 13:41:36.792364 (+   105us) client_negotiation.cc:252] Sending NEGOTIATE NegotiatePB request
0926 13:41:37.066171 (+273807us) negotiation.cc:327] Negotiation complete: Network error: Client connection negotiation failed: client connection to 0.0.0.0:40173: BlockingRecv error: recv error from unknown peer: Transport endpoint is not connected (error 107)
Metrics: {"client-negotiator.queue_time_us":36}
[       OK ] Parameters/TestRpcSocketTxRxQueue.OverCapacity/0 (1039 ms)
[----------] 1 test from Parameters/TestRpcSocketTxRxQueue (1039 ms total)

[----------] Global test environment tear-down
[==========] 21 tests from 2 test suites ran. (38744 ms total)
[  PASSED  ] 20 tests.
[  FAILED  ] 1 test, listed below:
[  FAILED  ] Parameters/TestRpc.TestCallWithChainCertAndChainCA/SSL_TCP, where GetParam() = (true, false)

 1 FAILED TEST