Diagnosed failure

Parameters/TestRpc.TestCallWithChainCertAndChainCA/SSL_UnixSocket: /data0/somelongdirectorytoavoidrpathissues/src/kudu/src/kudu/rpc/rpc-test.cc:270: Failure
Failed
Bad status: Runtime error: could not verify certificate chain (error with cert: subject=CN = localhost, ST = sadfjas, C = AS, emailAddress = sdflkdsajf, O = lskdfjlsad, OU = sldfkja, issuer=C = AS, ST = ASDfkjdhf, L = lskdjf, O = saldfja, OU = skdjf, CN = localhost, emailAddress = sadjflkadsj): : certificate has expired
Google Test trace:
/data0/somelongdirectorytoavoidrpathissues/src/kudu/src/kudu/rpc/rpc-test.cc:267: Connecting to unix:/tmp/dist-test-taskVdIhSV/test-tmp/rpc-test-c45f8b720f5c411091785519b4a4760c.sock
I20260927 10:41:00.115114   383 test_util.cc:175] -----------------------------------------------
I20260927 10:41:00.115163   383 test_util.cc:176] Had fatal failures, leaving test files at /tmp/dist-test-taskVdIhSV/test-tmp/rpc-test.6.Parameters_TestRpc.TestCallWithChainCertAndChainCA_SSL_UnixSocket.1790505660019430-383-0

Full log

Note: This is test shard 7 of 8.
[==========] Running 21 tests from 2 test suites.
[----------] Global test environment set-up.
[----------] 20 tests from Parameters/TestRpc
[ RUN      ] Parameters/TestRpc.TestMessengerCreateDestroy/SSL_UnixSocket
WARNING: Logging before InitGoogleLogging() is written to STDERR
I20260927 10:41:00.063833   383 rpc-test.cc:169] started messenger TestCreateDestroy
[       OK ] Parameters/TestRpc.TestMessengerCreateDestroy/SSL_UnixSocket (39 ms)
[ RUN      ] Parameters/TestRpc.TestNegotiationDeadlock/SSL_UnixSocket
I20260927 10:41:00.082460   403 acceptor_pool.cc:254] collecting diagnostics on the listening RPC socket unix:/tmp/dist-test-taskVdIhSV/test-tmp/rpc-test-537b6766d4ca49cd82c46fdeffb40257.sock every 8 connection(s)
I20260927 10:41:00.082501   404 acceptor_pool.cc:254] collecting diagnostics on the listening RPC socket unix:/tmp/dist-test-taskVdIhSV/test-tmp/rpc-test-537b6766d4ca49cd82c46fdeffb40257.sock every 8 connection(s)
[       OK ] Parameters/TestRpc.TestNegotiationDeadlock/SSL_UnixSocket (26 ms)
[ RUN      ] Parameters/TestRpc.TestCallWithChainCertAndChainCA/SSL_UnixSocket
I20260927 10:41:00.110303   419 acceptor_pool.cc:254] collecting diagnostics on the listening RPC socket unix:/tmp/dist-test-taskVdIhSV/test-tmp/rpc-test-c45f8b720f5c411091785519b4a4760c.sock every 8 connection(s)
I20260927 10:41:00.110368   420 acceptor_pool.cc:254] collecting diagnostics on the listening RPC socket unix:/tmp/dist-test-taskVdIhSV/test-tmp/rpc-test-c45f8b720f5c411091785519b4a4760c.sock every 8 connection(s)
/data0/somelongdirectorytoavoidrpathissues/src/kudu/src/kudu/rpc/rpc-test.cc:270: Failure
Failed
Bad status: Runtime error: could not verify certificate chain (error with cert: subject=CN = localhost, ST = sadfjas, C = AS, emailAddress = sdflkdsajf, O = lskdfjlsad, OU = sldfkja, issuer=C = AS, ST = ASDfkjdhf, L = lskdjf, O = saldfja, OU = skdjf, CN = localhost, emailAddress = sadjflkadsj): : certificate has expired
Google Test trace:
/data0/somelongdirectorytoavoidrpathissues/src/kudu/src/kudu/rpc/rpc-test.cc:267: Connecting to unix:/tmp/dist-test-taskVdIhSV/test-tmp/rpc-test-c45f8b720f5c411091785519b4a4760c.sock
I20260927 10:41:00.115114   383 test_util.cc:175] -----------------------------------------------
I20260927 10:41:00.115163   383 test_util.cc:176] Had fatal failures, leaving test files at /tmp/dist-test-taskVdIhSV/test-tmp/rpc-test.6.Parameters_TestRpc.TestCallWithChainCertAndChainCA_SSL_UnixSocket.1790505660019430-383-0
[  FAILED  ] Parameters/TestRpc.TestCallWithChainCertAndChainCA/SSL_UnixSocket, where GetParam() = (true, true) (22 ms)
[ RUN      ] Parameters/TestRpc.TestCallWithPasswordProtectedKey/SSL_UnixSocket
I20260927 10:41:00.124212   444 acceptor_pool.cc:254] collecting diagnostics on the listening RPC socket unix:/tmp/dist-test-taskVdIhSV/test-tmp/rpc-test-787162a961d94c36adb3aaf1b230c5f8.sock every 8 connection(s)
I20260927 10:41:00.124361   445 acceptor_pool.cc:254] collecting diagnostics on the listening RPC socket unix:/tmp/dist-test-taskVdIhSV/test-tmp/rpc-test-787162a961d94c36adb3aaf1b230c5f8.sock every 8 connection(s)
W20260927 10:41:00.136420   441 connection.cc:196] Error closing socket: Network error: TlsSocket::Close: Broken pipe
[       OK ] Parameters/TestRpc.TestCallWithPasswordProtectedKey/SSL_UnixSocket (22 ms)
[ RUN      ] Parameters/TestRpc.TestCallToBadServer/SSL_UnixSocket
I20260927 10:41:00.154086   383 rpc-test.cc:394] Status: Network error: Client connection negotiation failed: client connection to 0.0.0.0:0: connect: Connection refused (error 111)
I20260927 10:41:00.154568   383 rpc-test.cc:394] Status: Network error: Client connection negotiation failed: client connection to 0.0.0.0:0: connect: Connection refused (error 111)
I20260927 10:41:00.154948   383 rpc-test.cc:394] Status: Network error: Client connection negotiation failed: client connection to 0.0.0.0:0: connect: Connection refused (error 111)
I20260927 10:41:00.155331   383 rpc-test.cc:394] Status: Network error: Client connection negotiation failed: client connection to 0.0.0.0:0: connect: Connection refused (error 111)
I20260927 10:41:00.155711   383 rpc-test.cc:394] Status: Network error: Client connection negotiation failed: client connection to 0.0.0.0:0: connect: Connection refused (error 111)
[       OK ] Parameters/TestRpc.TestCallToBadServer/SSL_UnixSocket (19 ms)
[ RUN      ] Parameters/TestRpc.TestWrongService/SSL_UnixSocket
I20260927 10:41:00.163301   479 acceptor_pool.cc:254] collecting diagnostics on the listening RPC socket unix:/tmp/dist-test-taskVdIhSV/test-tmp/rpc-test-5c1c7d2627464124a459caf3fab0697a.sock every 8 connection(s)
I20260927 10:41:00.163347   480 acceptor_pool.cc:254] collecting diagnostics on the listening RPC socket unix:/tmp/dist-test-taskVdIhSV/test-tmp/rpc-test-5c1c7d2627464124a459caf3fab0697a.sock every 8 connection(s)
I20260927 10:41:00.193980   476 messenger.cc:345] service WrongServiceName not registered on TestServer
W20260927 10:41:00.194970   476 connection.cc:196] Error closing socket: Network error: TlsSocket::Close: Broken pipe
[       OK ] Parameters/TestRpc.TestWrongService/SSL_UnixSocket (39 ms)
[ RUN      ] Parameters/TestRpc.TestConnectionKeepalive/SSL_UnixSocket
I20260927 10:41:00.212522   502 acceptor_pool.cc:254] collecting diagnostics on the listening RPC socket unix:/tmp/dist-test-taskVdIhSV/test-tmp/rpc-test-27e6f6d6e53a4c2999d3d592ca637edd.sock every 8 connection(s)
I20260927 10:41:00.212570   503 acceptor_pool.cc:254] collecting diagnostics on the listening RPC socket unix:/tmp/dist-test-taskVdIhSV/test-tmp/rpc-test-27e6f6d6e53a4c2999d3d592ca637edd.sock every 8 connection(s)
I20260927 10:41:00.212841   383 rpc-test.cc:488] Connecting to unix:/tmp/dist-test-taskVdIhSV/test-tmp/rpc-test-27e6f6d6e53a4c2999d3d592ca637edd.sock
W20260927 10:41:00.698145   515 connection.cc:196] Error closing socket: Network error: TlsSocket::Close: Broken pipe
[       OK ] Parameters/TestRpc.TestConnectionKeepalive/SSL_UnixSocket (1065 ms)
[ RUN      ] Parameters/TestRpc.TestClientConnectionMetrics/SSL_UnixSocket
I20260927 10:41:01.286595   527 acceptor_pool.cc:254] collecting diagnostics on the listening RPC socket unix:/tmp/dist-test-taskVdIhSV/test-tmp/rpc-test-e81e27983b4e4853a384184cd5522a8e.sock every 8 connection(s)
I20260927 10:41:01.286638   528 acceptor_pool.cc:254] collecting diagnostics on the listening RPC socket unix:/tmp/dist-test-taskVdIhSV/test-tmp/rpc-test-e81e27983b4e4853a384184cd5522a8e.sock every 8 connection(s)
I20260927 10:41:01.286972   383 rpc-test.cc:569] Connecting to unix:/tmp/dist-test-taskVdIhSV/test-tmp/rpc-test-e81e27983b4e4853a384184cd5522a8e.sock
W20260927 10:41:11.639127   524 connection.cc:196] Error closing socket: Network error: TlsSocket::Close: Broken pipe
[       OK ] Parameters/TestRpc.TestClientConnectionMetrics/SSL_UnixSocket (10378 ms)
[ RUN      ] Parameters/TestRpc.TestCredentialsPolicy/SSL_UnixSocket
I20260927 10:41:11.670691   550 acceptor_pool.cc:254] collecting diagnostics on the listening RPC socket unix:/tmp/dist-test-taskVdIhSV/test-tmp/rpc-test-74bc239f27ad441d9125f61eaae769c4.sock every 8 connection(s)
I20260927 10:41:11.670745   551 acceptor_pool.cc:254] collecting diagnostics on the listening RPC socket unix:/tmp/dist-test-taskVdIhSV/test-tmp/rpc-test-74bc239f27ad441d9125f61eaae769c4.sock every 8 connection(s)
I20260927 10:41:11.671061   383 rpc-test.cc:700] Connecting to unix:/tmp/dist-test-taskVdIhSV/test-tmp/rpc-test-74bc239f27ad441d9125f61eaae769c4.sock
W20260927 10:41:11.692247   549 connection.cc:196] Error closing socket: Network error: TlsSocket::Close: Broken pipe
W20260927 10:41:11.696972   549 connection.cc:196] Error closing socket: Network error: TlsSocket::Close: Broken pipe
[       OK ] Parameters/TestRpc.TestCredentialsPolicy/SSL_UnixSocket (57 ms)
[ RUN      ] Parameters/TestRpc.TestCallLongerThanKeepalive/SSL_UnixSocket
I20260927 10:41:11.722205   575 acceptor_pool.cc:254] collecting diagnostics on the listening RPC socket unix:/tmp/dist-test-taskVdIhSV/test-tmp/rpc-test-04f36ba2b43348d4881fb74853318116.sock every 8 connection(s)
I20260927 10:41:11.722254   576 acceptor_pool.cc:254] collecting diagnostics on the listening RPC socket unix:/tmp/dist-test-taskVdIhSV/test-tmp/rpc-test-04f36ba2b43348d4881fb74853318116.sock every 8 connection(s)
I20260927 10:41:11.732501   579 rpc-test-base.h:222] got call: sleep_micros: 3000000 deferred: true
I20260927 10:41:14.733305   579 rpcz_store.cc:275] Call kudu.rpc.GenericCalculatorService.Sleep from unix:<unnamed> (request call id 0) took 3000 ms. Trace:
I20260927 10:41:14.733414   579 rpcz_store.cc:276] 0927 10:41:11.732425 (+     0us) service_pool.cc:170] Inserting onto call queue
0927 10:41:11.732476 (+    51us) service_pool.cc:227] Handling call
0927 10:41:14.733285 (+3000809us) inbound_call.cc:173] Queueing success response
Metrics: {}
[       OK ] Parameters/TestRpc.TestCallLongerThanKeepalive/SSL_UnixSocket (3038 ms)
[ RUN      ] Parameters/TestRpc.TestRpcSidecar/SSL_UnixSocket
I20260927 10:41:14.747615   600 acceptor_pool.cc:254] collecting diagnostics on the listening RPC socket unix:/tmp/dist-test-taskVdIhSV/test-tmp/rpc-test-ce66e289b05a4bb1acc24c5bf49f6591.sock every 8 connection(s)
I20260927 10:41:14.747735   601 acceptor_pool.cc:254] collecting diagnostics on the listening RPC socket unix:/tmp/dist-test-taskVdIhSV/test-tmp/rpc-test-ce66e289b05a4bb1acc24c5bf49f6591.sock every 8 connection(s)
[       OK ] Parameters/TestRpc.TestRpcSidecar/SSL_UnixSocket (68 ms)
[ RUN      ] Parameters/TestRpc.TestRpcSidecarLimits/SSL_UnixSocket
I20260927 10:41:16.490001   625 acceptor_pool.cc:254] collecting diagnostics on the listening RPC socket unix:/tmp/dist-test-taskVdIhSV/test-tmp/rpc-test-cdaa2f3adc5740598fa5d5ee52551cf7.sock every 8 connection(s)
I20260927 10:41:16.490027   626 acceptor_pool.cc:254] collecting diagnostics on the listening RPC socket unix:/tmp/dist-test-taskVdIhSV/test-tmp/rpc-test-cdaa2f3adc5740598fa5d5ee52551cf7.sock every 8 connection(s)
W20260927 10:41:16.502533   383 serialization.cc:72] Serialized kudu.rpc_test.PushStringsRequestPB (2147483654 bytes) is larger than the maximum configured RPC message size (52428800 bytes). Sending anyway, but peer may reject the data.
W20260927 10:41:16.506084   622 connection.cc:535] server connection from unix:<unnamed> recv error: Network error: RPC frame had a length of 2147483714, but we only support messages up to 52428800 bytes long.
W20260927 10:41:16.506151   622 connection.cc:158] shutting down server connection from unix:<unnamed> with pending inbound data: 4/2147483714 bytes received; last active 0 ns ago: status Network error: RPC frame had a length of 2147483714, but we only support messages up to 52428800 bytes long.
W20260927 10:41:16.506325   638 connection.cc:698] client connection to unix:/tmp/dist-test-taskVdIhSV/test-tmp/rpc-test-cdaa2f3adc5740598fa5d5ee52551cf7.sock send error: Network error: failed to write to TLS socket: Broken pipe
W20260927 10:41:16.506501   638 connection.cc:196] Error closing socket: Network error: TlsSocket::Close: Success
I20260927 10:41:16.521646   651 acceptor_pool.cc:254] collecting diagnostics on the listening RPC socket unix:/tmp/dist-test-taskVdIhSV/test-tmp/rpc-test-cdaa2f3adc5740598fa5d5ee52551cf7.sock every 8 connection(s)
I20260927 10:41:16.521633   650 acceptor_pool.cc:254] collecting diagnostics on the listening RPC socket unix:/tmp/dist-test-taskVdIhSV/test-tmp/rpc-test-cdaa2f3adc5740598fa5d5ee52551cf7.sock every 8 connection(s)
W20260927 10:41:21.059175   647 connection.cc:577] server connection from unix:<unnamed>: received bad data: 'Corruption: Invalid packet: message had a length of 2147483710, but we only support messages up to 2147483647 bytes
'
W20260927 10:41:21.059505   663 connection.cc:196] Error closing socket: Network error: TlsSocket::Close: Broken pipe
[       OK ] Parameters/TestRpc.TestRpcSidecarLimits/SSL_UnixSocket (6256 ms)
[ RUN      ] Parameters/TestRpc.TestCallTimeoutDoesntAffectNegotiation/SSL_UnixSocket
I20260927 10:41:21.089799   675 acceptor_pool.cc:254] collecting diagnostics on the listening RPC socket unix:/tmp/dist-test-taskVdIhSV/test-tmp/rpc-test-5b530e20cf6b4281a7b51fa4042946a5.sock every 8 connection(s)
I20260927 10:41:21.089861   676 acceptor_pool.cc:254] collecting diagnostics on the listening RPC socket unix:/tmp/dist-test-taskVdIhSV/test-tmp/rpc-test-5b530e20cf6b4281a7b51fa4042946a5.sock every 8 connection(s)
W20260927 10:41:21.106873   671 negotiation.cc:266] Injecting 500ms delay in negotiation
I20260927 10:41:21.157311   383 rpc-test-base.h:595] status: Timed out: connection negotiation to unix:/tmp/dist-test-taskVdIhSV/test-tmp/rpc-test-5b530e20cf6b4281a7b51fa4042946a5.sock for RPC Sleep timed out after 0.050s (ON_OUTBOUND_QUEUE), seconds elapsed: 0.0508899
W20260927 10:41:21.617944   672 connection.cc:196] Error closing socket: Network error: TlsSocket::Close: Broken pipe
[       OK ] Parameters/TestRpc.TestCallTimeoutDoesntAffectNegotiation/SSL_UnixSocket (557 ms)
[ RUN      ] Parameters/TestRpc.TestRpcHandlerLatencyMetric/SSL_UnixSocket
I20260927 10:41:21.642042   700 acceptor_pool.cc:254] collecting diagnostics on the listening RPC socket unix:/tmp/dist-test-taskVdIhSV/test-tmp/rpc-test-b45f039165804fd6991832f725946e39.sock every 8 connection(s)
I20260927 10:41:21.642086   701 acceptor_pool.cc:254] collecting diagnostics on the listening RPC socket unix:/tmp/dist-test-taskVdIhSV/test-tmp/rpc-test-b45f039165804fd6991832f725946e39.sock every 8 connection(s)
I20260927 10:41:21.671244   383 rpc-test.cc:1236] Sleep() min lat: 20287
I20260927 10:41:21.671295   383 rpc-test.cc:1237] Sleep() mean lat: 20287
I20260927 10:41:21.671322   383 rpc-test.cc:1238] Sleep() max lat: 20287
I20260927 10:41:21.671334   383 rpc-test.cc:1239] Sleep() #calls: 1
W20260927 10:41:21.672267   697 connection.cc:196] Error closing socket: Network error: TlsSocket::Close: Broken pipe
[       OK ] Parameters/TestRpc.TestRpcHandlerLatencyMetric/SSL_UnixSocket (54 ms)
[ RUN      ] Parameters/TestRpc.TimedOutOnResponseMetricServiceQueue/SSL_UnixSocket
I20260927 10:41:21.696259   726 acceptor_pool.cc:254] collecting diagnostics on the listening RPC socket unix:/tmp/dist-test-taskVdIhSV/test-tmp/rpc-test-1589eb1eeddd498b90101152e2145207.sock every 8 connection(s)
I20260927 10:41:21.696298   727 acceptor_pool.cc:254] collecting diagnostics on the listening RPC socket unix:/tmp/dist-test-taskVdIhSV/test-tmp/rpc-test-1589eb1eeddd498b90101152e2145207.sock every 8 connection(s)
W20260927 10:41:21.757426   728 rpcz_store.cc:267] Call kudu.rpc_test.CalculatorService.Sleep from unix:<unnamed> (request call id 2) took 20 ms (client timeout 20 ms). Trace:
W20260927 10:41:21.757524   728 rpcz_store.cc:269] 0927 10:41:21.737065 (+     0us) service_pool.cc:170] Inserting onto call queue
0927 10:41:21.757377 (+ 20312us) service_pool.cc:214] Skipping call since client already timed out
0927 10:41:21.757406 (+    29us) inbound_call.cc:173] Queueing failure response
Metrics: {}
[       OK ] Parameters/TestRpc.TimedOutOnResponseMetricServiceQueue/SSL_UnixSocket (86 ms)
[ RUN      ] Parameters/TestRpc.RpcPendingConnectionsMetric/SSL_UnixSocket
I20260927 10:41:21.762024   749 acceptor_pool.cc:254] collecting diagnostics on the listening RPC socket 0.0.0.0:38925 every 8 connection(s)
I20260927 10:41:21.762094   750 acceptor_pool.cc:254] collecting diagnostics on the listening RPC socket 0.0.0.0:38925 every 8 connection(s)
W20260927 10:41:21.771744   745 negotiation.cc:337] Failed RPC negotiation. Trace:
0927 10:41:21.771185 (+     0us) reactor.cc:625] Submitting negotiation task for server connection from 127.0.0.1:57896 (local address 127.0.0.1:38925)
0927 10:41:21.771319 (+   134us) server_negotiation.cc:206] Beginning negotiation
0927 10:41:21.771323 (+     4us) server_negotiation.cc:399] Waiting for connection header
0927 10:41:21.771442 (+   119us) negotiation.cc:327] Negotiation complete: Network error: Server connection negotiation failed: server connection from 127.0.0.1:57896: BlockingRecv error: recv got EOF from 127.0.0.1:57896 (error 108)
Metrics: {"server-negotiator.queue_time_us":28}
[       OK ] Parameters/TestRpc.RpcPendingConnectionsMetric/SSL_UnixSocket (22 ms)
[ RUN      ] Parameters/TestRpc.TestRpcContextClientDeadline/SSL_UnixSocket
I20260927 10:41:21.796283   765 acceptor_pool.cc:254] collecting diagnostics on the listening RPC socket unix:/tmp/dist-test-taskVdIhSV/test-tmp/rpc-test-c434f2bfd65a4a66a13c746613c23b61.sock every 8 connection(s)
I20260927 10:41:21.796331   766 acceptor_pool.cc:254] collecting diagnostics on the listening RPC socket unix:/tmp/dist-test-taskVdIhSV/test-tmp/rpc-test-c434f2bfd65a4a66a13c746613c23b61.sock every 8 connection(s)
W20260927 10:41:21.841609   762 connection.cc:196] Error closing socket: Network error: TlsSocket::Close: Broken pipe
[       OK ] Parameters/TestRpc.TestRpcContextClientDeadline/SSL_UnixSocket (60 ms)
[ RUN      ] Parameters/TestRpc.TestApplicationFeatureFlagUnsupportedServer/SSL_UnixSocket
I20260927 10:41:21.869204   790 acceptor_pool.cc:254] collecting diagnostics on the listening RPC socket unix:/tmp/dist-test-taskVdIhSV/test-tmp/rpc-test-6723e08e73e444c58cf8cf16c0b60f49.sock every 8 connection(s)
I20260927 10:41:21.869256   791 acceptor_pool.cc:254] collecting diagnostics on the listening RPC socket unix:/tmp/dist-test-taskVdIhSV/test-tmp/rpc-test-6723e08e73e444c58cf8cf16c0b60f49.sock every 8 connection(s)
[       OK ] Parameters/TestRpc.TestApplicationFeatureFlagUnsupportedServer/SSL_UnixSocket (47 ms)
[ RUN      ] Parameters/TestRpc.TestCancellationAsync/SSL_UnixSocket
I20260927 10:41:21.918921   815 acceptor_pool.cc:254] collecting diagnostics on the listening RPC socket unix:/tmp/dist-test-taskVdIhSV/test-tmp/rpc-test-ef655cfc09274b62973505f4e6f3dfe0.sock every 8 connection(s)
I20260927 10:41:21.918967   816 acceptor_pool.cc:254] collecting diagnostics on the listening RPC socket unix:/tmp/dist-test-taskVdIhSV/test-tmp/rpc-test-ef655cfc09274b62973505f4e6f3dfe0.sock every 8 connection(s)
I20260927 10:41:21.919274   383 rpc-test.cc:1716] Connecting to unix:/tmp/dist-test-taskVdIhSV/test-tmp/rpc-test-ef655cfc09274b62973505f4e6f3dfe0.sock
I20260927 10:41:21.928056   383 test_util.cc:268] Using random seed: -1759264906
I20260927 10:41:21.943405   819 rpc-test-base.h:240] got call: sleep_micros: 500 pattern: 4294967295 num_repetitions: 2097152 sidecar_idx: 0
I20260927 10:41:21.960246   818 rpc-test-base.h:240] got call: sleep_micros: 500 pattern: 4294967295 num_repetitions: 2097152 sidecar_idx: 0
I20260927 10:41:21.975929   819 rpc-test-base.h:240] got call: sleep_micros: 500 pattern: 4294967295 num_repetitions: 2097152 sidecar_idx: 0
I20260927 10:41:21.991822   818 rpc-test-base.h:240] got call: sleep_micros: 500 pattern: 4294967295 num_repetitions: 2097152 sidecar_idx: 0
I20260927 10:41:22.007711   819 rpc-test-base.h:240] got call: sleep_micros: 500 pattern: 4294967295 num_repetitions: 2097152 sidecar_idx: 0
I20260927 10:41:22.023182   818 rpc-test-base.h:240] got call: sleep_micros: 500 pattern: 4294967295 num_repetitions: 2097152 sidecar_idx: 0
I20260927 10:41:22.038720   819 rpc-test-base.h:240] got call: sleep_micros: 500 pattern: 4294967295 num_repetitions: 2097152 sidecar_idx: 0
W20260927 10:41:22.040246   812 connection.cc:196] Error closing socket: Network error: TlsSocket::Close: Broken pipe
W20260927 10:41:22.052495   812 connection.cc:441] server connection from unix:<unnamed> torn down before Call kudu.rpc.GenericCalculatorService.SleepWithSidecar from unix:<unnamed> (request call id 8) could send its response
W20260927 10:41:22.063021   812 connection.cc:441] server connection from unix:<unnamed> torn down before Call kudu.rpc.GenericCalculatorService.SleepWithSidecar from unix:<unnamed> (request call id 9) could send its response
[       OK ] Parameters/TestRpc.TestCancellationAsync/SSL_UnixSocket (173 ms)
[ RUN      ] Parameters/TestRpc.TestPerformanceBySocketType/SSL_UnixSocket
I20260927 10:41:22.087296   840 acceptor_pool.cc:254] collecting diagnostics on the listening RPC socket unix:/tmp/dist-test-taskVdIhSV/test-tmp/rpc-test-ff9d344959b34423b813a154f76dc0cb.sock every 8 connection(s)
I20260927 10:41:22.087342   841 acceptor_pool.cc:254] collecting diagnostics on the listening RPC socket unix:/tmp/dist-test-taskVdIhSV/test-tmp/rpc-test-ff9d344959b34423b813a154f76dc0cb.sock every 8 connection(s)
I20260927 10:41:22.087661   383 rpc-test.cc:1846] Connecting to unix:/tmp/dist-test-taskVdIhSV/test-tmp/rpc-test-ff9d344959b34423b813a154f76dc0cb.sock
I20260927 10:41:23.514160   383 rpc-test.cc:1859] Sending 1024MB via ssl-enabled unix socket: real 1.404s	user 1.701s	sys 0.882s
I20260927 10:41:24.963281   383 rpc-test.cc:1859] Sending 1024MB via ssl-enabled unix socket: real 1.449s	user 1.759s	sys 0.902s
I20260927 10:41:26.363453   383 rpc-test.cc:1859] Sending 1024MB via ssl-enabled unix socket: real 1.400s	user 1.684s	sys 0.893s
I20260927 10:41:27.752832   383 rpc-test.cc:1859] Sending 1024MB via ssl-enabled unix socket: real 1.389s	user 1.728s	sys 0.833s
I20260927 10:41:29.196676   383 rpc-test.cc:1859] Sending 1024MB via ssl-enabled unix socket: real 1.444s	user 1.783s	sys 0.877s
W20260927 10:41:29.198045   837 connection.cc:196] Error closing socket: Network error: TlsSocket::Close: Broken pipe
[       OK ] Parameters/TestRpc.TestPerformanceBySocketType/SSL_UnixSocket (7133 ms)
[----------] 20 tests from Parameters/TestRpc (29172 ms total)

[----------] 1 test from Parameters/TestRpcSocketTxRxQueue
[ RUN      ] Parameters/TestRpcSocketTxRxQueue.AcceptorRxQueueSizeMetric/0
I20260927 10:41:29.201104   865 acceptor_pool.cc:254] collecting diagnostics on the listening RPC socket 0.0.0.0:37241 every 1 connection(s)
I20260927 10:41:29.201181   866 acceptor_pool.cc:254] collecting diagnostics on the listening RPC socket 0.0.0.0:37241 every 1 connection(s)
W20260927 10:41:29.202015   861 negotiation.cc:337] Failed RPC negotiation. Trace:
0927 10:41:29.201732 (+     0us) reactor.cc:625] Submitting negotiation task for server connection from 127.0.0.1:35470 (local address 127.0.0.1:37241)
0927 10:41:29.201819 (+    87us) server_negotiation.cc:206] Beginning negotiation
0927 10:41:29.201822 (+     3us) server_negotiation.cc:399] Waiting for connection header
0927 10:41:29.201961 (+   139us) negotiation.cc:327] Negotiation complete: Network error: Server connection negotiation failed: server connection from 127.0.0.1:35470: BlockingRecv error: recv got EOF from 127.0.0.1:35470 (error 108)
Metrics: {"server-negotiator.queue_time_us":23}
[       OK ] Parameters/TestRpcSocketTxRxQueue.AcceptorRxQueueSizeMetric/0 (5 ms)
[----------] 1 test from Parameters/TestRpcSocketTxRxQueue (5 ms total)

[----------] Global test environment tear-down
[==========] 21 tests from 2 test suites ran. (29178 ms total)
[  PASSED  ] 20 tests.
[  FAILED  ] 1 test, listed below:
[  FAILED  ] Parameters/TestRpc.TestCallWithChainCertAndChainCA/SSL_UnixSocket, where GetParam() = (true, true)

 1 FAILED TEST