Diagnosed failure

Parameters/TestRpc.TestCallWithChainCertAndChainCA/SSL_TCP: /data0/somelongdirectorytoavoidrpathissues/src/kudu/src/kudu/rpc/rpc-test.cc:270: Failure
Failed
Bad status: Runtime error: could not verify certificate chain (error with cert: subject=CN = localhost, ST = sadfjas, C = AS, emailAddress = sdflkdsajf, O = lskdfjlsad, OU = sldfkja, issuer=C = AS, ST = ASDfkjdhf, L = lskdjf, O = saldfja, OU = skdjf, CN = localhost, emailAddress = sadjflkadsj): : certificate has expired
Google Test trace:
/data0/somelongdirectorytoavoidrpathissues/src/kudu/src/kudu/rpc/rpc-test.cc:267: Connecting to 0.0.0.0:43965
I20260929 06:28:01.464155  1247 test_util.cc:175] -----------------------------------------------
I20260929 06:28:01.464231  1247 test_util.cc:176] Had fatal failures, leaving test files at /tmp/dist-test-taskMulHZK/test-tmp/rpc-test.5.Parameters_TestRpc.TestCallWithChainCertAndChainCA_SSL_TCP.1790663281391873-1247-0

Full log

Note: This is test shard 6 of 8.
[==========] Running 21 tests from 2 test suites.
[----------] Global test environment set-up.
[----------] 20 tests from Parameters/TestRpc
[ RUN      ] Parameters/TestRpc.TestMessengerCreateDestroy/SSL_TCP
WARNING: Logging before InitGoogleLogging() is written to STDERR
I20260929 06:28:01.418727  1247 rpc-test.cc:169] started messenger TestCreateDestroy
[       OK ] Parameters/TestRpc.TestMessengerCreateDestroy/SSL_TCP (25 ms)
[ RUN      ] Parameters/TestRpc.TestNegotiationDeadlock/SSL_TCP
I20260929 06:28:01.429421  1268 acceptor_pool.cc:254] collecting diagnostics on the listening RPC socket 0.0.0.0:35099 every 8 connection(s)
I20260929 06:28:01.429415  1267 acceptor_pool.cc:254] collecting diagnostics on the listening RPC socket 0.0.0.0:35099 every 8 connection(s)
[       OK ] Parameters/TestRpc.TestNegotiationDeadlock/SSL_TCP (17 ms)
[ RUN      ] Parameters/TestRpc.TestCallWithChainCertAndChainCA/SSL_TCP
I20260929 06:28:01.459920  1283 acceptor_pool.cc:254] collecting diagnostics on the listening RPC socket 0.0.0.0:43965 every 8 connection(s)
I20260929 06:28:01.459939  1284 acceptor_pool.cc:254] collecting diagnostics on the listening RPC socket 0.0.0.0:43965 every 8 connection(s)
/data0/somelongdirectorytoavoidrpathissues/src/kudu/src/kudu/rpc/rpc-test.cc:270: Failure
Failed
Bad status: Runtime error: could not verify certificate chain (error with cert: subject=CN = localhost, ST = sadfjas, C = AS, emailAddress = sdflkdsajf, O = lskdfjlsad, OU = sldfkja, issuer=C = AS, ST = ASDfkjdhf, L = lskdjf, O = saldfja, OU = skdjf, CN = localhost, emailAddress = sadjflkadsj): : certificate has expired
Google Test trace:
/data0/somelongdirectorytoavoidrpathissues/src/kudu/src/kudu/rpc/rpc-test.cc:267: Connecting to 0.0.0.0:43965
I20260929 06:28:01.464155  1247 test_util.cc:175] -----------------------------------------------
I20260929 06:28:01.464231  1247 test_util.cc:176] Had fatal failures, leaving test files at /tmp/dist-test-taskMulHZK/test-tmp/rpc-test.5.Parameters_TestRpc.TestCallWithChainCertAndChainCA_SSL_TCP.1790663281391873-1247-0
[  FAILED  ] Parameters/TestRpc.TestCallWithChainCertAndChainCA/SSL_TCP, where GetParam() = (true, false) (27 ms)
[ RUN      ] Parameters/TestRpc.TestCallWithPasswordProtectedKey/SSL_TCP
I20260929 06:28:01.473860  1309 acceptor_pool.cc:254] collecting diagnostics on the listening RPC socket 0.0.0.0:41009 every 8 connection(s)
I20260929 06:28:01.473860  1308 acceptor_pool.cc:254] collecting diagnostics on the listening RPC socket 0.0.0.0:41009 every 8 connection(s)
[       OK ] Parameters/TestRpc.TestCallWithPasswordProtectedKey/SSL_TCP (23 ms)
[ RUN      ] Parameters/TestRpc.TestCallToBadServer/SSL_TCP
I20260929 06:28:01.495831  1247 rpc-test.cc:394] Status: Network error: Client connection negotiation failed: client connection to 0.0.0.0:0: connect: Connection refused (error 111)
I20260929 06:28:01.496150  1247 rpc-test.cc:394] Status: Network error: Client connection negotiation failed: client connection to 0.0.0.0:0: connect: Connection refused (error 111)
I20260929 06:28:01.496397  1247 rpc-test.cc:394] Status: Network error: Client connection negotiation failed: client connection to 0.0.0.0:0: connect: Connection refused (error 111)
I20260929 06:28:01.496626  1247 rpc-test.cc:394] Status: Network error: Client connection negotiation failed: client connection to 0.0.0.0:0: connect: Connection refused (error 111)
I20260929 06:28:01.496853  1247 rpc-test.cc:394] Status: Network error: Client connection negotiation failed: client connection to 0.0.0.0:0: connect: Connection refused (error 111)
[       OK ] Parameters/TestRpc.TestCallToBadServer/SSL_TCP (10 ms)
[ RUN      ] Parameters/TestRpc.TestWrongService/SSL_TCP
I20260929 06:28:01.545336  1343 acceptor_pool.cc:254] collecting diagnostics on the listening RPC socket 0.0.0.0:38061 every 8 connection(s)
I20260929 06:28:01.545372  1344 acceptor_pool.cc:254] collecting diagnostics on the listening RPC socket 0.0.0.0:38061 every 8 connection(s)
I20260929 06:28:01.565697  1341 messenger.cc:345] service WrongServiceName not registered on TestServer
[       OK ] Parameters/TestRpc.TestWrongService/SSL_TCP (69 ms)
[ RUN      ] Parameters/TestRpc.TestConnectionKeepalive/SSL_TCP
I20260929 06:28:01.582131  1366 acceptor_pool.cc:254] collecting diagnostics on the listening RPC socket 0.0.0.0:35757 every 8 connection(s)
I20260929 06:28:01.582168  1367 acceptor_pool.cc:254] collecting diagnostics on the listening RPC socket 0.0.0.0:35757 every 8 connection(s)
I20260929 06:28:01.582386  1247 rpc-test.cc:488] Connecting to 0.0.0.0:35757
[       OK ] Parameters/TestRpc.TestConnectionKeepalive/SSL_TCP (1034 ms)
[ RUN      ] Parameters/TestRpc.TestClientConnectionMetrics/SSL_TCP
I20260929 06:28:02.618737  1391 acceptor_pool.cc:254] collecting diagnostics on the listening RPC socket 0.0.0.0:43101 every 8 connection(s)
I20260929 06:28:02.618773  1392 acceptor_pool.cc:254] collecting diagnostics on the listening RPC socket 0.0.0.0:43101 every 8 connection(s)
I20260929 06:28:02.618984  1247 rpc-test.cc:569] Connecting to 0.0.0.0:43101
[       OK ] Parameters/TestRpc.TestClientConnectionMetrics/SSL_TCP (11545 ms)
[ RUN      ] Parameters/TestRpc.TestCredentialsPolicy/SSL_TCP
I20260929 06:28:14.162019  1414 acceptor_pool.cc:254] collecting diagnostics on the listening RPC socket 0.0.0.0:35183 every 8 connection(s)
I20260929 06:28:14.162047  1415 acceptor_pool.cc:254] collecting diagnostics on the listening RPC socket 0.0.0.0:35183 every 8 connection(s)
I20260929 06:28:14.162256  1247 rpc-test.cc:700] Connecting to 0.0.0.0:35183
[       OK ] Parameters/TestRpc.TestCredentialsPolicy/SSL_TCP (35 ms)
[ RUN      ] Parameters/TestRpc.TestCallLongerThanKeepalive/SSL_TCP
I20260929 06:28:14.209575  1439 acceptor_pool.cc:254] collecting diagnostics on the listening RPC socket 0.0.0.0:44497 every 8 connection(s)
I20260929 06:28:14.209621  1440 acceptor_pool.cc:254] collecting diagnostics on the listening RPC socket 0.0.0.0:44497 every 8 connection(s)
I20260929 06:28:14.227231  1443 rpc-test-base.h:222] got call: sleep_micros: 3000000 deferred: true
I20260929 06:28:17.227969  1443 rpcz_store.cc:275] Call kudu.rpc.GenericCalculatorService.Sleep from 127.0.0.1:50600 (request call id 0) took 3000 ms. Trace:
I20260929 06:28:17.228116  1443 rpcz_store.cc:276] 0929 06:28:14.227168 (+     0us) service_pool.cc:170] Inserting onto call queue
0929 06:28:14.227209 (+    41us) service_pool.cc:227] Handling call
0929 06:28:17.227942 (+3000733us) inbound_call.cc:173] Queueing success response
Metrics: {}
[       OK ] Parameters/TestRpc.TestCallLongerThanKeepalive/SSL_TCP (3046 ms)
[ RUN      ] Parameters/TestRpc.TestRpcSidecar/SSL_TCP
I20260929 06:28:17.250373  1464 acceptor_pool.cc:254] collecting diagnostics on the listening RPC socket 0.0.0.0:40979 every 8 connection(s)
I20260929 06:28:17.250543  1465 acceptor_pool.cc:254] collecting diagnostics on the listening RPC socket 0.0.0.0:40979 every 8 connection(s)
[       OK ] Parameters/TestRpc.TestRpcSidecar/SSL_TCP (73 ms)
[ RUN      ] Parameters/TestRpc.TestRpcSidecarLimits/SSL_TCP
I20260929 06:28:19.075598  1489 acceptor_pool.cc:254] collecting diagnostics on the listening RPC socket 0.0.0.0:38079 every 8 connection(s)
I20260929 06:28:19.075623  1490 acceptor_pool.cc:254] collecting diagnostics on the listening RPC socket 0.0.0.0:38079 every 8 connection(s)
W20260929 06:28:19.091545  1247 serialization.cc:72] Serialized kudu.rpc_test.PushStringsRequestPB (2147483654 bytes) is larger than the maximum configured RPC message size (52428800 bytes). Sending anyway, but peer may reject the data.
W20260929 06:28:19.095573  1487 connection.cc:535] server connection from 127.0.0.1:37496 recv error: Network error: RPC frame had a length of 2147483714, but we only support messages up to 52428800 bytes long.
W20260929 06:28:19.095656  1487 connection.cc:158] shutting down server connection from 127.0.0.1:37496 with pending inbound data: 4/2147483714 bytes received; last active 0 ns ago: status Network error: RPC frame had a length of 2147483714, but we only support messages up to 52428800 bytes long.
W20260929 06:28:19.095890  1502 connection.cc:196] Error closing socket: Network error: TlsSocket::Close: Connection reset by peer
I20260929 06:28:19.108150  1514 acceptor_pool.cc:254] collecting diagnostics on the listening RPC socket 0.0.0.0:39809 every 8 connection(s)
I20260929 06:28:19.108212  1515 acceptor_pool.cc:254] collecting diagnostics on the listening RPC socket 0.0.0.0:39809 every 8 connection(s)
W20260929 06:28:23.023590  1511 connection.cc:577] server connection from 127.0.0.1:41520: received bad data: 'Corruption: Invalid packet: message had a length of 2147483710, but we only support messages up to 2147483647 bytes
'
[       OK ] Parameters/TestRpc.TestRpcSidecarLimits/SSL_TCP (5721 ms)
[ RUN      ] Parameters/TestRpc.TestCallTimeoutDoesntAffectNegotiation/SSL_TCP
I20260929 06:28:23.035416  1539 acceptor_pool.cc:254] collecting diagnostics on the listening RPC socket 0.0.0.0:39533 every 8 connection(s)
I20260929 06:28:23.035529  1540 acceptor_pool.cc:254] collecting diagnostics on the listening RPC socket 0.0.0.0:39533 every 8 connection(s)
W20260929 06:28:23.051303  1535 negotiation.cc:266] Injecting 500ms delay in negotiation
I20260929 06:28:23.101518  1247 rpc-test-base.h:595] status: Timed out: connection negotiation to 0.0.0.0:39533 for RPC Sleep timed out after 0.050s (ON_OUTBOUND_QUEUE), seconds elapsed: 0.050633
[       OK ] Parameters/TestRpc.TestCallTimeoutDoesntAffectNegotiation/SSL_TCP (531 ms)
[ RUN      ] Parameters/TestRpc.TestRpcHandlerLatencyMetric/SSL_TCP
I20260929 06:28:23.578186  1564 acceptor_pool.cc:254] collecting diagnostics on the listening RPC socket 0.0.0.0:38531 every 8 connection(s)
I20260929 06:28:23.578235  1565 acceptor_pool.cc:254] collecting diagnostics on the listening RPC socket 0.0.0.0:38531 every 8 connection(s)
I20260929 06:28:23.614180  1247 rpc-test.cc:1236] Sleep() min lat: 20422
I20260929 06:28:23.614288  1247 rpc-test.cc:1237] Sleep() mean lat: 20422
I20260929 06:28:23.614318  1247 rpc-test.cc:1238] Sleep() max lat: 20422
I20260929 06:28:23.614332  1247 rpc-test.cc:1239] Sleep() #calls: 1
[       OK ] Parameters/TestRpc.TestRpcHandlerLatencyMetric/SSL_TCP (58 ms)
[ RUN      ] Parameters/TestRpc.TimedOutOnResponseMetricServiceQueue/SSL_TCP
I20260929 06:28:23.627529  1590 acceptor_pool.cc:254] collecting diagnostics on the listening RPC socket 0.0.0.0:33951 every 8 connection(s)
I20260929 06:28:23.627561  1591 acceptor_pool.cc:254] collecting diagnostics on the listening RPC socket 0.0.0.0:33951 every 8 connection(s)
W20260929 06:28:23.682184  1592 rpcz_store.cc:267] Call kudu.rpc_test.CalculatorService.Sleep from 127.0.0.1:47706 (request call id 2) took 20 ms (client timeout 20 ms). Trace:
W20260929 06:28:23.682363  1592 rpcz_store.cc:269] 0929 06:28:23.661871 (+     0us) service_pool.cc:170] Inserting onto call queue
0929 06:28:23.682161 (+ 20290us) service_pool.cc:214] Skipping call since client already timed out
0929 06:28:23.682170 (+     9us) inbound_call.cc:173] Queueing failure response
Metrics: {}
[       OK ] Parameters/TestRpc.TimedOutOnResponseMetricServiceQueue/SSL_TCP (68 ms)
[ RUN      ] Parameters/TestRpc.RpcPendingConnectionsMetric/SSL_TCP
I20260929 06:28:23.687726  1613 acceptor_pool.cc:254] collecting diagnostics on the listening RPC socket 0.0.0.0:34563 every 8 connection(s)
I20260929 06:28:23.687780  1614 acceptor_pool.cc:254] collecting diagnostics on the listening RPC socket 0.0.0.0:34563 every 8 connection(s)
W20260929 06:28:23.697933  1609 negotiation.cc:337] Failed RPC negotiation. Trace:
0929 06:28:23.697490 (+     0us) reactor.cc:625] Submitting negotiation task for server connection from 127.0.0.1:47698 (local address 127.0.0.1:34563)
0929 06:28:23.697604 (+   114us) server_negotiation.cc:206] Beginning negotiation
0929 06:28:23.697608 (+     4us) server_negotiation.cc:399] Waiting for connection header
0929 06:28:23.697806 (+   198us) negotiation.cc:327] Negotiation complete: Network error: Server connection negotiation failed: server connection from 127.0.0.1:47698: BlockingRecv error: recv got EOF from 127.0.0.1:47698 (error 108)
Metrics: {"server-negotiator.queue_time_us":49}
[       OK ] Parameters/TestRpc.RpcPendingConnectionsMetric/SSL_TCP (24 ms)
[ RUN      ] Parameters/TestRpc.TestRpcContextClientDeadline/SSL_TCP
I20260929 06:28:23.726483  1630 acceptor_pool.cc:254] collecting diagnostics on the listening RPC socket 0.0.0.0:33897 every 8 connection(s)
I20260929 06:28:23.726480  1629 acceptor_pool.cc:254] collecting diagnostics on the listening RPC socket 0.0.0.0:33897 every 8 connection(s)
[       OK ] Parameters/TestRpc.TestRpcContextClientDeadline/SSL_TCP (72 ms)
[ RUN      ] Parameters/TestRpc.TestApplicationFeatureFlagUnsupportedServer/SSL_TCP
I20260929 06:28:23.795678  1655 acceptor_pool.cc:254] collecting diagnostics on the listening RPC socket 0.0.0.0:45113 every 8 connection(s)
I20260929 06:28:23.795678  1654 acceptor_pool.cc:254] collecting diagnostics on the listening RPC socket 0.0.0.0:45113 every 8 connection(s)
[       OK ] Parameters/TestRpc.TestApplicationFeatureFlagUnsupportedServer/SSL_TCP (36 ms)
[ RUN      ] Parameters/TestRpc.TestCancellationAsync/SSL_TCP
I20260929 06:28:23.837280  1679 acceptor_pool.cc:254] collecting diagnostics on the listening RPC socket 0.0.0.0:35461 every 8 connection(s)
I20260929 06:28:23.837292  1680 acceptor_pool.cc:254] collecting diagnostics on the listening RPC socket 0.0.0.0:35461 every 8 connection(s)
I20260929 06:28:23.837482  1247 rpc-test.cc:1716] Connecting to 0.0.0.0:35461
I20260929 06:28:23.850577  1247 test_util.cc:268] Using random seed: 1243834956
I20260929 06:28:23.870808  1683 rpc-test-base.h:240] got call: sleep_micros: 500 pattern: 4294967295 num_repetitions: 2097152 sidecar_idx: 0
I20260929 06:28:23.885330  1683 rpc-test-base.h:240] got call: sleep_micros: 500 pattern: 4294967295 num_repetitions: 2097152 sidecar_idx: 0
I20260929 06:28:23.901896  1683 rpc-test-base.h:240] got call: sleep_micros: 500 pattern: 4294967295 num_repetitions: 2097152 sidecar_idx: 0
I20260929 06:28:23.916760  1683 rpc-test-base.h:240] got call: sleep_micros: 500 pattern: 4294967295 num_repetitions: 2097152 sidecar_idx: 0
I20260929 06:28:23.940431  1683 rpc-test-base.h:240] got call: sleep_micros: 500 pattern: 4294967295 num_repetitions: 2097152 sidecar_idx: 0
I20260929 06:28:23.965170  1683 rpc-test-base.h:240] got call: sleep_micros: 500 pattern: 4294967295 num_repetitions: 2097152 sidecar_idx: 0
I20260929 06:28:23.980563  1683 rpc-test-base.h:240] got call: sleep_micros: 500 pattern: 4294967295 num_repetitions: 2097152 sidecar_idx: 0
I20260929 06:28:23.997394  1683 rpc-test-base.h:240] got call: sleep_micros: 500 pattern: 4294967295 num_repetitions: 2097152 sidecar_idx: 0
I20260929 06:28:24.013455  1683 rpc-test-base.h:240] got call: sleep_micros: 500 pattern: 4294967295 num_repetitions: 2097152 sidecar_idx: 0
W20260929 06:28:24.017612  1677 connection.cc:441] server connection from 127.0.0.1:60416 torn down before Call kudu.rpc.GenericCalculatorService.SleepWithSidecar from 127.0.0.1:60416 (request call id 9) could send its response
[       OK ] Parameters/TestRpc.TestCancellationAsync/SSL_TCP (200 ms)
[ RUN      ] Parameters/TestRpc.TestPerformanceBySocketType/SSL_TCP
I20260929 06:28:24.057765  1704 acceptor_pool.cc:254] collecting diagnostics on the listening RPC socket 0.0.0.0:34545 every 8 connection(s)
I20260929 06:28:24.057765  1705 acceptor_pool.cc:254] collecting diagnostics on the listening RPC socket 0.0.0.0:34545 every 8 connection(s)
I20260929 06:28:24.058013  1247 rpc-test.cc:1846] Connecting to 0.0.0.0:34545
I20260929 06:28:25.899524  1247 rpc-test.cc:1859] Sending 1024MB via ssl-enabled tcp socket: real 1.826s	user 1.641s	sys 1.580s
I20260929 06:28:27.700505  1247 rpc-test.cc:1859] Sending 1024MB via ssl-enabled tcp socket: real 1.801s	user 1.587s	sys 1.584s
I20260929 06:28:29.507704  1247 rpc-test.cc:1859] Sending 1024MB via ssl-enabled tcp socket: real 1.807s	user 1.616s	sys 1.581s
I20260929 06:28:31.354660  1247 rpc-test.cc:1859] Sending 1024MB via ssl-enabled tcp socket: real 1.847s	user 1.786s	sys 1.470s
I20260929 06:28:33.093416  1247 rpc-test.cc:1859] Sending 1024MB via ssl-enabled tcp socket: real 1.739s	user 1.557s	sys 1.522s
[       OK ] Parameters/TestRpc.TestPerformanceBySocketType/SSL_TCP (9076 ms)
[----------] 20 tests from Parameters/TestRpc (31701 ms total)

[----------] 1 test from Parameters/TestRpcSocketTxRxQueue
[ RUN      ] Parameters/TestRpcSocketTxRxQueue.OverCapacity/0
W20260929 06:28:33.361102  1739 negotiation.cc:337] Failed RPC negotiation. Trace:
0929 06:28:33.099089 (+     0us) reactor.cc:625] Submitting negotiation task for client connection to 0.0.0.0:41491 (local address 127.0.0.1:44022)
0929 06:28:33.099147 (+    58us) negotiation.cc:107] Waiting for socket to connect
0929 06:28:33.099156 (+     9us) client_negotiation.cc:174] Beginning negotiation
0929 06:28:33.099196 (+    40us) client_negotiation.cc:252] Sending NEGOTIATE NegotiatePB request
0929 06:28:33.360953 (+261757us) negotiation.cc:327] Negotiation complete: Network error: Client connection negotiation failed: client connection to 0.0.0.0:41491: BlockingRecv error: recv error from unknown peer: Transport endpoint is not connected (error 107)
Metrics: {"client-negotiator.queue_time_us":37}
W20260929 06:28:33.361213  1730 negotiation.cc:337] Failed RPC negotiation. Trace:
0929 06:28:33.098248 (+     0us) reactor.cc:625] Submitting negotiation task for client connection to 0.0.0.0:41491 (local address 127.0.0.1:44014)
0929 06:28:33.098288 (+    40us) negotiation.cc:107] Waiting for socket to connect
0929 06:28:33.098296 (+     8us) client_negotiation.cc:174] Beginning negotiation
0929 06:28:33.098337 (+    41us) client_negotiation.cc:252] Sending NEGOTIATE NegotiatePB request
0929 06:28:33.360937 (+262600us) negotiation.cc:327] Negotiation complete: Network error: Client connection negotiation failed: client connection to 0.0.0.0:41491: BlockingRecv error: recv error from unknown peer: Transport endpoint is not connected (error 107)
Metrics: {"client-negotiator.queue_time_us":17}
W20260929 06:28:33.361220  1766 negotiation.cc:337] Failed RPC negotiation. Trace:
0929 06:28:33.101754 (+     0us) reactor.cc:625] Submitting negotiation task for client connection to 0.0.0.0:41491 (local address 127.0.0.1:44054)
0929 06:28:33.101803 (+    49us) negotiation.cc:107] Waiting for socket to connect
0929 06:28:33.101812 (+     9us) client_negotiation.cc:174] Beginning negotiation
0929 06:28:33.101851 (+    39us) client_negotiation.cc:252] Sending NEGOTIATE NegotiatePB request
0929 06:28:33.361083 (+259232us) negotiation.cc:327] Negotiation complete: Network error: Client connection negotiation failed: client connection to 0.0.0.0:41491: BlockingRecv error: recv error from unknown peer: Transport endpoint is not connected (error 107)
Metrics: {"client-negotiator.queue_time_us":29}
W20260929 06:28:33.361104  1721 negotiation.cc:337] Failed RPC negotiation. Trace:
0929 06:28:33.097271 (+     0us) reactor.cc:625] Submitting negotiation task for client connection to 0.0.0.0:41491 (local address 127.0.0.1:43998)
0929 06:28:33.097357 (+    86us) negotiation.cc:107] Waiting for socket to connect
0929 06:28:33.097368 (+    11us) client_negotiation.cc:174] Beginning negotiation
0929 06:28:33.097427 (+    59us) client_negotiation.cc:252] Sending NEGOTIATE NegotiatePB request
0929 06:28:33.360938 (+263511us) negotiation.cc:327] Negotiation complete: Network error: Client connection negotiation failed: client connection to 0.0.0.0:41491: BlockingRecv error: recv error from unknown peer: Transport endpoint is not connected (error 107)
Metrics: {"client-negotiator.queue_time_us":53}
W20260929 06:28:33.361336  1748 negotiation.cc:337] Failed RPC negotiation. Trace:
0929 06:28:33.100018 (+     0us) reactor.cc:625] Submitting negotiation task for client connection to 0.0.0.0:41491 (local address 127.0.0.1:44036)
0929 06:28:33.100074 (+    56us) negotiation.cc:107] Waiting for socket to connect
0929 06:28:33.100084 (+    10us) client_negotiation.cc:174] Beginning negotiation
0929 06:28:33.100127 (+    43us) client_negotiation.cc:252] Sending NEGOTIATE NegotiatePB request
0929 06:28:33.360948 (+260821us) negotiation.cc:327] Negotiation complete: Network error: Client connection negotiation failed: client connection to 0.0.0.0:41491: BlockingRecv error: recv error from unknown peer: Transport endpoint is not connected (error 107)
Metrics: {"client-negotiator.queue_time_us":34}
W20260929 06:28:33.361492  1757 negotiation.cc:337] Failed RPC negotiation. Trace:
0929 06:28:33.100868 (+     0us) reactor.cc:625] Submitting negotiation task for client connection to 0.0.0.0:41491 (local address 127.0.0.1:44042)
0929 06:28:33.100945 (+    77us) negotiation.cc:107] Waiting for socket to connect
0929 06:28:33.100955 (+    10us) client_negotiation.cc:174] Beginning negotiation
0929 06:28:33.101000 (+    45us) client_negotiation.cc:252] Sending NEGOTIATE NegotiatePB request
0929 06:28:33.361139 (+260139us) negotiation.cc:327] Negotiation complete: Network error: Client connection negotiation failed: client connection to 0.0.0.0:41491: BlockingRecv error: recv error from unknown peer: Transport endpoint is not connected (error 107)
Metrics: {"client-negotiator.queue_time_us":37}
[       OK ] Parameters/TestRpcSocketTxRxQueue.OverCapacity/0 (1035 ms)
[----------] 1 test from Parameters/TestRpcSocketTxRxQueue (1035 ms total)

[----------] Global test environment tear-down
[==========] 21 tests from 2 test suites ran. (32736 ms total)
[  PASSED  ] 20 tests.
[  FAILED  ] 1 test, listed below:
[  FAILED  ] Parameters/TestRpc.TestCallWithChainCertAndChainCA/SSL_TCP, where GetParam() = (true, false)

 1 FAILED TEST