Diagnosed failure

Parameters/TestRpc.TestCallWithChainCertAndChainCA/SSL_UnixSocket: /data0/somelongdirectorytoavoidrpathissues/src/kudu/src/kudu/rpc/rpc-test.cc:270: Failure
Failed
Bad status: Runtime error: could not verify certificate chain (error with cert: subject=CN = localhost, ST = sadfjas, C = AS, emailAddress = sdflkdsajf, O = lskdfjlsad, OU = sldfkja, issuer=C = AS, ST = ASDfkjdhf, L = lskdjf, O = saldfja, OU = skdjf, CN = localhost, emailAddress = sadjflkadsj): : certificate has expired
Google Test trace:
/data0/somelongdirectorytoavoidrpathissues/src/kudu/src/kudu/rpc/rpc-test.cc:267: Connecting to unix:/tmp/dist-test-taskuEBhgy/test-tmp/rpc-test-4e801a1ca1214eaf9926461e7875bfaf.sock
I20260928 10:03:37.443500   808 test_util.cc:175] -----------------------------------------------
I20260928 10:03:37.443619   808 test_util.cc:176] Had fatal failures, leaving test files at /tmp/dist-test-taskuEBhgy/test-tmp/rpc-test.6.Parameters_TestRpc.TestCallWithChainCertAndChainCA_SSL_UnixSocket.1790589817316766-808-0

Full log

Note: This is test shard 7 of 8.
[==========] Running 21 tests from 2 test suites.
[----------] Global test environment set-up.
[----------] 20 tests from Parameters/TestRpc
[ RUN      ] Parameters/TestRpc.TestMessengerCreateDestroy/SSL_UnixSocket
WARNING: Logging before InitGoogleLogging() is written to STDERR
I20260928 10:03:37.355466   808 rpc-test.cc:169] started messenger TestCreateDestroy
[       OK ] Parameters/TestRpc.TestMessengerCreateDestroy/SSL_UnixSocket (22 ms)
[ RUN      ] Parameters/TestRpc.TestNegotiationDeadlock/SSL_UnixSocket
I20260928 10:03:37.368549   828 acceptor_pool.cc:254] collecting diagnostics on the listening RPC socket unix:/tmp/dist-test-taskuEBhgy/test-tmp/rpc-test-e3328cc94eb94b8ea98ced9a9759b21a.sock every 8 connection(s)
I20260928 10:03:37.368953   829 acceptor_pool.cc:254] collecting diagnostics on the listening RPC socket unix:/tmp/dist-test-taskuEBhgy/test-tmp/rpc-test-e3328cc94eb94b8ea98ced9a9759b21a.sock every 8 connection(s)
[       OK ] Parameters/TestRpc.TestNegotiationDeadlock/SSL_UnixSocket (30 ms)
[ RUN      ] Parameters/TestRpc.TestCallWithChainCertAndChainCA/SSL_UnixSocket
I20260928 10:03:37.428776   844 acceptor_pool.cc:254] collecting diagnostics on the listening RPC socket unix:/tmp/dist-test-taskuEBhgy/test-tmp/rpc-test-4e801a1ca1214eaf9926461e7875bfaf.sock every 8 connection(s)
I20260928 10:03:37.429047   845 acceptor_pool.cc:254] collecting diagnostics on the listening RPC socket unix:/tmp/dist-test-taskuEBhgy/test-tmp/rpc-test-4e801a1ca1214eaf9926461e7875bfaf.sock every 8 connection(s)
/data0/somelongdirectorytoavoidrpathissues/src/kudu/src/kudu/rpc/rpc-test.cc:270: Failure
Failed
Bad status: Runtime error: could not verify certificate chain (error with cert: subject=CN = localhost, ST = sadfjas, C = AS, emailAddress = sdflkdsajf, O = lskdfjlsad, OU = sldfkja, issuer=C = AS, ST = ASDfkjdhf, L = lskdjf, O = saldfja, OU = skdjf, CN = localhost, emailAddress = sadjflkadsj): : certificate has expired
Google Test trace:
/data0/somelongdirectorytoavoidrpathissues/src/kudu/src/kudu/rpc/rpc-test.cc:267: Connecting to unix:/tmp/dist-test-taskuEBhgy/test-tmp/rpc-test-4e801a1ca1214eaf9926461e7875bfaf.sock
I20260928 10:03:37.443500   808 test_util.cc:175] -----------------------------------------------
I20260928 10:03:37.443619   808 test_util.cc:176] Had fatal failures, leaving test files at /tmp/dist-test-taskuEBhgy/test-tmp/rpc-test.6.Parameters_TestRpc.TestCallWithChainCertAndChainCA_SSL_UnixSocket.1790589817316766-808-0
[  FAILED  ] Parameters/TestRpc.TestCallWithChainCertAndChainCA/SSL_UnixSocket, where GetParam() = (true, true) (54 ms)
[ RUN      ] Parameters/TestRpc.TestCallWithPasswordProtectedKey/SSL_UnixSocket
I20260928 10:03:37.468565   869 acceptor_pool.cc:254] collecting diagnostics on the listening RPC socket unix:/tmp/dist-test-taskuEBhgy/test-tmp/rpc-test-74996e6d441d45b88196f363896430e2.sock every 8 connection(s)
I20260928 10:03:37.468787   870 acceptor_pool.cc:254] collecting diagnostics on the listening RPC socket unix:/tmp/dist-test-taskuEBhgy/test-tmp/rpc-test-74996e6d441d45b88196f363896430e2.sock every 8 connection(s)
W20260928 10:03:37.499223   866 connection.cc:196] Error closing socket: Network error: TlsSocket::Close: Broken pipe
[       OK ] Parameters/TestRpc.TestCallWithPasswordProtectedKey/SSL_UnixSocket (59 ms)
[ RUN      ] Parameters/TestRpc.TestCallToBadServer/SSL_UnixSocket
I20260928 10:03:37.531867   808 rpc-test.cc:394] Status: Network error: Client connection negotiation failed: client connection to 0.0.0.0:0: connect: Connection refused (error 111)
I20260928 10:03:37.532639   808 rpc-test.cc:394] Status: Network error: Client connection negotiation failed: client connection to 0.0.0.0:0: connect: Connection refused (error 111)
I20260928 10:03:37.533284   808 rpc-test.cc:394] Status: Network error: Client connection negotiation failed: client connection to 0.0.0.0:0: connect: Connection refused (error 111)
I20260928 10:03:37.533862   808 rpc-test.cc:394] Status: Network error: Client connection negotiation failed: client connection to 0.0.0.0:0: connect: Connection refused (error 111)
I20260928 10:03:37.534382   808 rpc-test.cc:394] Status: Network error: Client connection negotiation failed: client connection to 0.0.0.0:0: connect: Connection refused (error 111)
[       OK ] Parameters/TestRpc.TestCallToBadServer/SSL_UnixSocket (32 ms)
[ RUN      ] Parameters/TestRpc.TestWrongService/SSL_UnixSocket
I20260928 10:03:37.561486   904 acceptor_pool.cc:254] collecting diagnostics on the listening RPC socket unix:/tmp/dist-test-taskuEBhgy/test-tmp/rpc-test-36e7ce1c6ce84932980284a2a0b9113a.sock every 8 connection(s)
I20260928 10:03:37.561756   905 acceptor_pool.cc:254] collecting diagnostics on the listening RPC socket unix:/tmp/dist-test-taskuEBhgy/test-tmp/rpc-test-36e7ce1c6ce84932980284a2a0b9113a.sock every 8 connection(s)
I20260928 10:03:37.582975   901 messenger.cc:345] service WrongServiceName not registered on TestServer
[       OK ] Parameters/TestRpc.TestWrongService/SSL_UnixSocket (51 ms)
[ RUN      ] Parameters/TestRpc.TestConnectionKeepalive/SSL_UnixSocket
I20260928 10:03:37.605624   927 acceptor_pool.cc:254] collecting diagnostics on the listening RPC socket unix:/tmp/dist-test-taskuEBhgy/test-tmp/rpc-test-07c9c5b775944c85baeae568ffa08224.sock every 8 connection(s)
I20260928 10:03:37.605907   928 acceptor_pool.cc:254] collecting diagnostics on the listening RPC socket unix:/tmp/dist-test-taskuEBhgy/test-tmp/rpc-test-07c9c5b775944c85baeae568ffa08224.sock every 8 connection(s)
I20260928 10:03:37.606845   808 rpc-test.cc:488] Connecting to unix:/tmp/dist-test-taskuEBhgy/test-tmp/rpc-test-07c9c5b775944c85baeae568ffa08224.sock
W20260928 10:03:38.091012   940 connection.cc:196] Error closing socket: Network error: TlsSocket::Close: Broken pipe
[       OK ] Parameters/TestRpc.TestConnectionKeepalive/SSL_UnixSocket (1051 ms)
[ RUN      ] Parameters/TestRpc.TestClientConnectionMetrics/SSL_UnixSocket
I20260928 10:03:38.656487   952 acceptor_pool.cc:254] collecting diagnostics on the listening RPC socket unix:/tmp/dist-test-taskuEBhgy/test-tmp/rpc-test-185a66af04c447a7ba0d1aad3efa19dc.sock every 8 connection(s)
I20260928 10:03:38.656744   953 acceptor_pool.cc:254] collecting diagnostics on the listening RPC socket unix:/tmp/dist-test-taskuEBhgy/test-tmp/rpc-test-185a66af04c447a7ba0d1aad3efa19dc.sock every 8 connection(s)
I20260928 10:03:38.657653   808 rpc-test.cc:569] Connecting to unix:/tmp/dist-test-taskuEBhgy/test-tmp/rpc-test-185a66af04c447a7ba0d1aad3efa19dc.sock
W20260928 10:04:00.050005   949 connection.cc:196] Error closing socket: Network error: TlsSocket::Close: Broken pipe
[       OK ] Parameters/TestRpc.TestClientConnectionMetrics/SSL_UnixSocket (21416 ms)
[ RUN      ] Parameters/TestRpc.TestCredentialsPolicy/SSL_UnixSocket
I20260928 10:04:00.073743   975 acceptor_pool.cc:254] collecting diagnostics on the listening RPC socket unix:/tmp/dist-test-taskuEBhgy/test-tmp/rpc-test-47c22e609e59456d878d8394400feda2.sock every 8 connection(s)
I20260928 10:04:00.074028   976 acceptor_pool.cc:254] collecting diagnostics on the listening RPC socket unix:/tmp/dist-test-taskuEBhgy/test-tmp/rpc-test-47c22e609e59456d878d8394400feda2.sock every 8 connection(s)
I20260928 10:04:00.074962   808 rpc-test.cc:700] Connecting to unix:/tmp/dist-test-taskuEBhgy/test-tmp/rpc-test-47c22e609e59456d878d8394400feda2.sock
W20260928 10:04:00.105057   974 connection.cc:196] Error closing socket: Network error: TlsSocket::Close: Broken pipe
W20260928 10:04:00.112280   974 connection.cc:196] Error closing socket: Network error: TlsSocket::Close: Broken pipe
[       OK ] Parameters/TestRpc.TestCredentialsPolicy/SSL_UnixSocket (59 ms)
[ RUN      ] Parameters/TestRpc.TestCallLongerThanKeepalive/SSL_UnixSocket
I20260928 10:04:00.127611  1000 acceptor_pool.cc:254] collecting diagnostics on the listening RPC socket unix:/tmp/dist-test-taskuEBhgy/test-tmp/rpc-test-994aa841314e405f85b5b170c5c9bc8d.sock every 8 connection(s)
I20260928 10:04:00.127841  1001 acceptor_pool.cc:254] collecting diagnostics on the listening RPC socket unix:/tmp/dist-test-taskuEBhgy/test-tmp/rpc-test-994aa841314e405f85b5b170c5c9bc8d.sock every 8 connection(s)
I20260928 10:04:00.145421  1004 rpc-test-base.h:222] got call: sleep_micros: 3000000 deferred: true
I20260928 10:04:03.147141  1004 rpcz_store.cc:275] Call kudu.rpc.GenericCalculatorService.Sleep from unix:<unnamed> (request call id 0) took 3001 ms. Trace:
I20260928 10:04:03.147301  1004 rpcz_store.cc:276] 0928 10:04:00.145298 (+     0us) service_pool.cc:170] Inserting onto call queue
0928 10:04:00.145355 (+    57us) service_pool.cc:227] Handling call
0928 10:04:03.147093 (+3001738us) inbound_call.cc:173] Queueing success response
Metrics: {}
[       OK ] Parameters/TestRpc.TestCallLongerThanKeepalive/SSL_UnixSocket (3038 ms)
[ RUN      ] Parameters/TestRpc.TestRpcSidecar/SSL_UnixSocket
I20260928 10:04:03.164845  1025 acceptor_pool.cc:254] collecting diagnostics on the listening RPC socket unix:/tmp/dist-test-taskuEBhgy/test-tmp/rpc-test-1540f79294ea47a8a1deff88ae7db343.sock every 8 connection(s)
I20260928 10:04:03.165086  1026 acceptor_pool.cc:254] collecting diagnostics on the listening RPC socket unix:/tmp/dist-test-taskuEBhgy/test-tmp/rpc-test-1540f79294ea47a8a1deff88ae7db343.sock every 8 connection(s)
W20260928 10:04:03.282032  1022 connection.cc:196] Error closing socket: Network error: TlsSocket::Close: Broken pipe
[       OK ] Parameters/TestRpc.TestRpcSidecar/SSL_UnixSocket (132 ms)
[ RUN      ] Parameters/TestRpc.TestRpcSidecarLimits/SSL_UnixSocket
I20260928 10:04:05.418190  1050 acceptor_pool.cc:254] collecting diagnostics on the listening RPC socket unix:/tmp/dist-test-taskuEBhgy/test-tmp/rpc-test-5b91fe64b54e4d55a41216a1d1797cdb.sock every 8 connection(s)
I20260928 10:04:05.418450  1051 acceptor_pool.cc:254] collecting diagnostics on the listening RPC socket unix:/tmp/dist-test-taskuEBhgy/test-tmp/rpc-test-5b91fe64b54e4d55a41216a1d1797cdb.sock every 8 connection(s)
W20260928 10:04:05.452313   808 serialization.cc:72] Serialized kudu.rpc_test.PushStringsRequestPB (2147483654 bytes) is larger than the maximum configured RPC message size (52428800 bytes). Sending anyway, but peer may reject the data.
W20260928 10:04:05.458218  1047 connection.cc:535] server connection from unix:<unnamed> recv error: Network error: RPC frame had a length of 2147483714, but we only support messages up to 52428800 bytes long.
W20260928 10:04:05.458365  1047 connection.cc:158] shutting down server connection from unix:<unnamed> with pending inbound data: 4/2147483714 bytes received; last active 0 ns ago: status Network error: RPC frame had a length of 2147483714, but we only support messages up to 52428800 bytes long.
W20260928 10:04:05.458879  1063 connection.cc:196] Error closing socket: Network error: TlsSocket::Close: Broken pipe
I20260928 10:04:05.481117  1075 acceptor_pool.cc:254] collecting diagnostics on the listening RPC socket unix:/tmp/dist-test-taskuEBhgy/test-tmp/rpc-test-5b91fe64b54e4d55a41216a1d1797cdb.sock every 8 connection(s)
I20260928 10:04:05.481413  1076 acceptor_pool.cc:254] collecting diagnostics on the listening RPC socket unix:/tmp/dist-test-taskuEBhgy/test-tmp/rpc-test-5b91fe64b54e4d55a41216a1d1797cdb.sock every 8 connection(s)
W20260928 10:04:11.199646  1072 connection.cc:577] server connection from unix:<unnamed>: received bad data: 'Corruption: Invalid packet: message had a length of 2147483710, but we only support messages up to 2147483647 bytes
'
W20260928 10:04:11.200243  1088 connection.cc:196] Error closing socket: Network error: TlsSocket::Close: Broken pipe
[       OK ] Parameters/TestRpc.TestRpcSidecarLimits/SSL_UnixSocket (8372 ms)
[ RUN      ] Parameters/TestRpc.TestCallTimeoutDoesntAffectNegotiation/SSL_UnixSocket
I20260928 10:04:11.674815  1100 acceptor_pool.cc:254] collecting diagnostics on the listening RPC socket unix:/tmp/dist-test-taskuEBhgy/test-tmp/rpc-test-7955201a749e40bd823c2ba15a429970.sock every 8 connection(s)
I20260928 10:04:11.675153  1101 acceptor_pool.cc:254] collecting diagnostics on the listening RPC socket unix:/tmp/dist-test-taskuEBhgy/test-tmp/rpc-test-7955201a749e40bd823c2ba15a429970.sock every 8 connection(s)
W20260928 10:04:11.692999  1096 negotiation.cc:266] Injecting 500ms delay in negotiation
I20260928 10:04:11.743500   808 rpc-test-base.h:595] status: Timed out: connection negotiation to unix:/tmp/dist-test-taskuEBhgy/test-tmp/rpc-test-7955201a749e40bd823c2ba15a429970.sock for RPC Sleep timed out after 0.050s (ON_OUTBOUND_QUEUE), seconds elapsed: 0.0510353
[       OK ] Parameters/TestRpc.TestCallTimeoutDoesntAffectNegotiation/SSL_UnixSocket (545 ms)
[ RUN      ] Parameters/TestRpc.TestRpcHandlerLatencyMetric/SSL_UnixSocket
I20260928 10:04:12.231909  1125 acceptor_pool.cc:254] collecting diagnostics on the listening RPC socket unix:/tmp/dist-test-taskuEBhgy/test-tmp/rpc-test-dc9ecfd5ac4648489388b5bc6250b904.sock every 8 connection(s)
I20260928 10:04:12.232132  1126 acceptor_pool.cc:254] collecting diagnostics on the listening RPC socket unix:/tmp/dist-test-taskuEBhgy/test-tmp/rpc-test-dc9ecfd5ac4648489388b5bc6250b904.sock every 8 connection(s)
I20260928 10:04:12.271833   808 rpc-test.cc:1236] Sleep() min lat: 20594
I20260928 10:04:12.271929   808 rpc-test.cc:1237] Sleep() mean lat: 20594
I20260928 10:04:12.271970   808 rpc-test.cc:1238] Sleep() max lat: 20594
I20260928 10:04:12.271988   808 rpc-test.cc:1239] Sleep() #calls: 1
W20260928 10:04:12.273200  1122 connection.cc:196] Error closing socket: Network error: TlsSocket::Close: Broken pipe
[       OK ] Parameters/TestRpc.TestRpcHandlerLatencyMetric/SSL_UnixSocket (73 ms)
[ RUN      ] Parameters/TestRpc.TimedOutOnResponseMetricServiceQueue/SSL_UnixSocket
I20260928 10:04:12.293658  1151 acceptor_pool.cc:254] collecting diagnostics on the listening RPC socket unix:/tmp/dist-test-taskuEBhgy/test-tmp/rpc-test-4dc732b137fa43dca27157195021367f.sock every 8 connection(s)
I20260928 10:04:12.293929  1152 acceptor_pool.cc:254] collecting diagnostics on the listening RPC socket unix:/tmp/dist-test-taskuEBhgy/test-tmp/rpc-test-4dc732b137fa43dca27157195021367f.sock every 8 connection(s)
W20260928 10:04:12.354625  1153 rpcz_store.cc:267] Call kudu.rpc_test.CalculatorService.Sleep from unix:<unnamed> (request call id 2) took 20 ms (client timeout 20 ms). Trace:
W20260928 10:04:12.354777  1153 rpcz_store.cc:269] 0928 10:04:12.334177 (+     0us) service_pool.cc:170] Inserting onto call queue
0928 10:04:12.354499 (+ 20322us) service_pool.cc:214] Skipping call since client already timed out
0928 10:04:12.354602 (+   103us) inbound_call.cc:173] Queueing failure response
Metrics: {}
[       OK ] Parameters/TestRpc.TimedOutOnResponseMetricServiceQueue/SSL_UnixSocket (81 ms)
[ RUN      ] Parameters/TestRpc.RpcPendingConnectionsMetric/SSL_UnixSocket
I20260928 10:04:12.363689  1174 acceptor_pool.cc:254] collecting diagnostics on the listening RPC socket 0.0.0.0:38135 every 8 connection(s)
I20260928 10:04:12.363917  1175 acceptor_pool.cc:254] collecting diagnostics on the listening RPC socket 0.0.0.0:38135 every 8 connection(s)
W20260928 10:04:12.376297  1170 negotiation.cc:337] Failed RPC negotiation. Trace:
0928 10:04:12.375649 (+     0us) reactor.cc:625] Submitting negotiation task for server connection from 127.0.0.1:41598 (local address 127.0.0.1:38135)
0928 10:04:12.375838 (+   189us) server_negotiation.cc:206] Beginning negotiation
0928 10:04:12.375843 (+     5us) server_negotiation.cc:399] Waiting for connection header
0928 10:04:12.375981 (+   138us) negotiation.cc:327] Negotiation complete: Network error: Server connection negotiation failed: server connection from 127.0.0.1:41598: BlockingRecv error: recv got EOF from 127.0.0.1:41598 (error 108)
Metrics: {"server-negotiator.queue_time_us":57}
[       OK ] Parameters/TestRpc.RpcPendingConnectionsMetric/SSL_UnixSocket (27 ms)
[ RUN      ] Parameters/TestRpc.TestRpcContextClientDeadline/SSL_UnixSocket
I20260928 10:04:12.407260  1190 acceptor_pool.cc:254] collecting diagnostics on the listening RPC socket unix:/tmp/dist-test-taskuEBhgy/test-tmp/rpc-test-6fc62c658e19498c8f19860da5a7d112.sock every 8 connection(s)
I20260928 10:04:12.407493  1191 acceptor_pool.cc:254] collecting diagnostics on the listening RPC socket unix:/tmp/dist-test-taskuEBhgy/test-tmp/rpc-test-6fc62c658e19498c8f19860da5a7d112.sock every 8 connection(s)
W20260928 10:04:12.458134  1187 connection.cc:196] Error closing socket: Network error: TlsSocket::Close: Broken pipe
[       OK ] Parameters/TestRpc.TestRpcContextClientDeadline/SSL_UnixSocket (74 ms)
[ RUN      ] Parameters/TestRpc.TestApplicationFeatureFlagUnsupportedServer/SSL_UnixSocket
I20260928 10:04:12.471807  1215 acceptor_pool.cc:254] collecting diagnostics on the listening RPC socket unix:/tmp/dist-test-taskuEBhgy/test-tmp/rpc-test-176ad7ca8eb84614aedca20129a6b51e.sock every 8 connection(s)
I20260928 10:04:12.472019  1216 acceptor_pool.cc:254] collecting diagnostics on the listening RPC socket unix:/tmp/dist-test-taskuEBhgy/test-tmp/rpc-test-176ad7ca8eb84614aedca20129a6b51e.sock every 8 connection(s)
[       OK ] Parameters/TestRpc.TestApplicationFeatureFlagUnsupportedServer/SSL_UnixSocket (38 ms)
[ RUN      ] Parameters/TestRpc.TestCancellationAsync/SSL_UnixSocket
I20260928 10:04:12.522436  1240 acceptor_pool.cc:254] collecting diagnostics on the listening RPC socket unix:/tmp/dist-test-taskuEBhgy/test-tmp/rpc-test-76aae1dfed3f4dcabd49ebafe8267b71.sock every 8 connection(s)
I20260928 10:04:12.522716  1241 acceptor_pool.cc:254] collecting diagnostics on the listening RPC socket unix:/tmp/dist-test-taskuEBhgy/test-tmp/rpc-test-76aae1dfed3f4dcabd49ebafe8267b71.sock every 8 connection(s)
I20260928 10:04:12.523554   808 rpc-test.cc:1716] Connecting to unix:/tmp/dist-test-taskuEBhgy/test-tmp/rpc-test-76aae1dfed3f4dcabd49ebafe8267b71.sock
I20260928 10:04:12.539546   808 test_util.cc:268] Using random seed: 806967941
I20260928 10:04:12.572594  1244 rpc-test-base.h:240] got call: sleep_micros: 500 pattern: 4294967295 num_repetitions: 2097152 sidecar_idx: 0
I20260928 10:04:12.596597  1243 rpc-test-base.h:240] got call: sleep_micros: 500 pattern: 4294967295 num_repetitions: 2097152 sidecar_idx: 0
I20260928 10:04:12.624886  1242 rpc-test-base.h:240] got call: sleep_micros: 500 pattern: 4294967295 num_repetitions: 2097152 sidecar_idx: 0
I20260928 10:04:12.653551  1244 rpc-test-base.h:240] got call: sleep_micros: 500 pattern: 4294967295 num_repetitions: 2097152 sidecar_idx: 0
I20260928 10:04:12.691696  1242 rpc-test-base.h:240] got call: sleep_micros: 500 pattern: 4294967295 num_repetitions: 2097152 sidecar_idx: 0
I20260928 10:04:12.720108  1244 rpc-test-base.h:240] got call: sleep_micros: 500 pattern: 4294967295 num_repetitions: 2097152 sidecar_idx: 0
I20260928 10:04:12.753201  1242 rpc-test-base.h:240] got call: sleep_micros: 500 pattern: 4294967295 num_repetitions: 2097152 sidecar_idx: 0
W20260928 10:04:12.755250  1237 connection.cc:196] Error closing socket: Network error: TlsSocket::Close: Broken pipe
W20260928 10:04:12.781432  1237 connection.cc:441] server connection from unix:<unnamed> torn down before Call kudu.rpc.GenericCalculatorService.SleepWithSidecar from unix:<unnamed> (request call id 8) could send its response
W20260928 10:04:12.799610  1237 connection.cc:441] server connection from unix:<unnamed> torn down before Call kudu.rpc.GenericCalculatorService.SleepWithSidecar from unix:<unnamed> (request call id 9) could send its response
[       OK ] Parameters/TestRpc.TestCancellationAsync/SSL_UnixSocket (302 ms)
[ RUN      ] Parameters/TestRpc.TestPerformanceBySocketType/SSL_UnixSocket
I20260928 10:04:12.829406  1265 acceptor_pool.cc:254] collecting diagnostics on the listening RPC socket unix:/tmp/dist-test-taskuEBhgy/test-tmp/rpc-test-f2bb3d895f044cdc8d337b49a9d2fd7c.sock every 8 connection(s)
I20260928 10:04:12.829627  1266 acceptor_pool.cc:254] collecting diagnostics on the listening RPC socket unix:/tmp/dist-test-taskuEBhgy/test-tmp/rpc-test-f2bb3d895f044cdc8d337b49a9d2fd7c.sock every 8 connection(s)
I20260928 10:04:12.830580   808 rpc-test.cc:1846] Connecting to unix:/tmp/dist-test-taskuEBhgy/test-tmp/rpc-test-f2bb3d895f044cdc8d337b49a9d2fd7c.sock
I20260928 10:04:16.033758   808 rpc-test.cc:1859] Sending 1024MB via ssl-enabled unix socket: real 3.192s	user 3.211s	sys 2.221s
I20260928 10:04:19.290380   808 rpc-test.cc:1859] Sending 1024MB via ssl-enabled unix socket: real 3.256s	user 3.163s	sys 2.374s
I20260928 10:04:22.421346   808 rpc-test.cc:1859] Sending 1024MB via ssl-enabled unix socket: real 3.131s	user 3.027s	sys 2.285s
I20260928 10:04:25.579870   808 rpc-test.cc:1859] Sending 1024MB via ssl-enabled unix socket: real 3.158s	user 3.112s	sys 2.245s
I20260928 10:04:28.694368   808 rpc-test.cc:1859] Sending 1024MB via ssl-enabled unix socket: real 3.114s	user 2.777s	sys 2.494s
W20260928 10:04:28.695369  1262 connection.cc:196] Error closing socket: Network error: TlsSocket::Close: Broken pipe
[       OK ] Parameters/TestRpc.TestPerformanceBySocketType/SSL_UnixSocket (15899 ms)
[----------] 20 tests from Parameters/TestRpc (51367 ms total)

[----------] 1 test from Parameters/TestRpcSocketTxRxQueue
[ RUN      ] Parameters/TestRpcSocketTxRxQueue.AcceptorRxQueueSizeMetric/0
I20260928 10:04:28.707804  1290 acceptor_pool.cc:254] collecting diagnostics on the listening RPC socket 0.0.0.0:42455 every 1 connection(s)
I20260928 10:04:28.708077  1291 acceptor_pool.cc:254] collecting diagnostics on the listening RPC socket 0.0.0.0:42455 every 1 connection(s)
W20260928 10:04:28.709769  1286 negotiation.cc:337] Failed RPC negotiation. Trace:
0928 10:04:28.709344 (+     0us) reactor.cc:625] Submitting negotiation task for server connection from 127.0.0.1:43426 (local address 127.0.0.1:42455)
0928 10:04:28.709519 (+   175us) server_negotiation.cc:206] Beginning negotiation
0928 10:04:28.709523 (+     4us) server_negotiation.cc:399] Waiting for connection header
0928 10:04:28.709651 (+   128us) negotiation.cc:327] Negotiation complete: Network error: Server connection negotiation failed: server connection from 127.0.0.1:43426: BlockingRecv error: recv got EOF from 127.0.0.1:43426 (error 108)
Metrics: {"server-negotiator.queue_time_us":62}
[       OK ] Parameters/TestRpcSocketTxRxQueue.AcceptorRxQueueSizeMetric/0 (10 ms)
[----------] 1 test from Parameters/TestRpcSocketTxRxQueue (10 ms total)

[----------] Global test environment tear-down
[==========] 21 tests from 2 test suites ran. (51378 ms total)
[  PASSED  ] 20 tests.
[  FAILED  ] 1 test, listed below:
[  FAILED  ] Parameters/TestRpc.TestCallWithChainCertAndChainCA/SSL_UnixSocket, where GetParam() = (true, true)

 1 FAILED TEST