Diagnosed failure
Parameters/TestRpc.TestCallWithChainCertAndChainCA/SSL_TCP: /data0/somelongdirectorytoavoidrpathissues/src/kudu/src/kudu/rpc/rpc-test.cc:270: Failure
Failed
Bad status: Runtime error: could not verify certificate chain (error with cert: subject=CN = localhost, ST = sadfjas, C = AS, emailAddress = sdflkdsajf, O = lskdfjlsad, OU = sldfkja, issuer=C = AS, ST = ASDfkjdhf, L = lskdjf, O = saldfja, OU = skdjf, CN = localhost, emailAddress = sadjflkadsj): : certificate has expired
Google Test trace:
/data0/somelongdirectorytoavoidrpathissues/src/kudu/src/kudu/rpc/rpc-test.cc:267: Connecting to 0.0.0.0:46015
I20260929 18:30:55.044587 6544 test_util.cc:175] -----------------------------------------------
I20260929 18:30:55.044641 6544 test_util.cc:176] Had fatal failures, leaving test files at /tmp/dist-test-taskNASjKY/test-tmp/rpc-test.5.Parameters_TestRpc.TestCallWithChainCertAndChainCA_SSL_TCP.1790706654965958-6544-0
Full log
Note: This is test shard 6 of 8.
[==========] Running 21 tests from 2 test suites.
[----------] Global test environment set-up.
[----------] 20 tests from Parameters/TestRpc
[ RUN ] Parameters/TestRpc.TestMessengerCreateDestroy/SSL_TCP
WARNING: Logging before InitGoogleLogging() is written to STDERR
I20260929 18:30:54.998652 6544 rpc-test.cc:169] started messenger TestCreateDestroy
[ OK ] Parameters/TestRpc.TestMessengerCreateDestroy/SSL_TCP (28 ms)
[ RUN ] Parameters/TestRpc.TestNegotiationDeadlock/SSL_TCP
I20260929 18:30:55.012082 6564 acceptor_pool.cc:254] collecting diagnostics on the listening RPC socket 0.0.0.0:40051 every 8 connection(s)
I20260929 18:30:55.012145 6565 acceptor_pool.cc:254] collecting diagnostics on the listening RPC socket 0.0.0.0:40051 every 8 connection(s)
[ OK ] Parameters/TestRpc.TestNegotiationDeadlock/SSL_TCP (22 ms)
[ RUN ] Parameters/TestRpc.TestCallWithChainCertAndChainCA/SSL_TCP
I20260929 18:30:55.039651 6580 acceptor_pool.cc:254] collecting diagnostics on the listening RPC socket 0.0.0.0:46015 every 8 connection(s)
I20260929 18:30:55.039697 6581 acceptor_pool.cc:254] collecting diagnostics on the listening RPC socket 0.0.0.0:46015 every 8 connection(s)
/data0/somelongdirectorytoavoidrpathissues/src/kudu/src/kudu/rpc/rpc-test.cc:270: Failure
Failed
Bad status: Runtime error: could not verify certificate chain (error with cert: subject=CN = localhost, ST = sadfjas, C = AS, emailAddress = sdflkdsajf, O = lskdfjlsad, OU = sldfkja, issuer=C = AS, ST = ASDfkjdhf, L = lskdjf, O = saldfja, OU = skdjf, CN = localhost, emailAddress = sadjflkadsj): : certificate has expired
Google Test trace:
/data0/somelongdirectorytoavoidrpathissues/src/kudu/src/kudu/rpc/rpc-test.cc:267: Connecting to 0.0.0.0:46015
I20260929 18:30:55.044587 6544 test_util.cc:175] -----------------------------------------------
I20260929 18:30:55.044641 6544 test_util.cc:176] Had fatal failures, leaving test files at /tmp/dist-test-taskNASjKY/test-tmp/rpc-test.5.Parameters_TestRpc.TestCallWithChainCertAndChainCA_SSL_TCP.1790706654965958-6544-0
[ FAILED ] Parameters/TestRpc.TestCallWithChainCertAndChainCA/SSL_TCP, where GetParam() = (true, false) (22 ms)
[ RUN ] Parameters/TestRpc.TestCallWithPasswordProtectedKey/SSL_TCP
I20260929 18:30:55.055015 6605 acceptor_pool.cc:254] collecting diagnostics on the listening RPC socket 0.0.0.0:37651 every 8 connection(s)
I20260929 18:30:55.055035 6606 acceptor_pool.cc:254] collecting diagnostics on the listening RPC socket 0.0.0.0:37651 every 8 connection(s)
[ OK ] Parameters/TestRpc.TestCallWithPasswordProtectedKey/SSL_TCP (24 ms)
[ RUN ] Parameters/TestRpc.TestCallToBadServer/SSL_TCP
I20260929 18:30:55.075421 6544 rpc-test.cc:394] Status: Network error: Client connection negotiation failed: client connection to 0.0.0.0:0: connect: Connection refused (error 111)
I20260929 18:30:55.075829 6544 rpc-test.cc:394] Status: Network error: Client connection negotiation failed: client connection to 0.0.0.0:0: connect: Connection refused (error 111)
I20260929 18:30:55.076185 6544 rpc-test.cc:394] Status: Network error: Client connection negotiation failed: client connection to 0.0.0.0:0: connect: Connection refused (error 111)
I20260929 18:30:55.076521 6544 rpc-test.cc:394] Status: Network error: Client connection negotiation failed: client connection to 0.0.0.0:0: connect: Connection refused (error 111)
I20260929 18:30:55.076884 6544 rpc-test.cc:394] Status: Network error: Client connection negotiation failed: client connection to 0.0.0.0:0: connect: Connection refused (error 111)
[ OK ] Parameters/TestRpc.TestCallToBadServer/SSL_TCP (8 ms)
[ RUN ] Parameters/TestRpc.TestWrongService/SSL_TCP
I20260929 18:30:55.092257 6640 acceptor_pool.cc:254] collecting diagnostics on the listening RPC socket 0.0.0.0:45411 every 8 connection(s)
I20260929 18:30:55.092286 6641 acceptor_pool.cc:254] collecting diagnostics on the listening RPC socket 0.0.0.0:45411 every 8 connection(s)
I20260929 18:30:55.104775 6637 messenger.cc:345] service WrongServiceName not registered on TestServer
[ OK ] Parameters/TestRpc.TestWrongService/SSL_TCP (29 ms)
[ RUN ] Parameters/TestRpc.TestConnectionKeepalive/SSL_TCP
I20260929 18:30:55.132215 6663 acceptor_pool.cc:254] collecting diagnostics on the listening RPC socket 0.0.0.0:40593 every 8 connection(s)
I20260929 18:30:55.132272 6664 acceptor_pool.cc:254] collecting diagnostics on the listening RPC socket 0.0.0.0:40593 every 8 connection(s)
I20260929 18:30:55.132534 6544 rpc-test.cc:488] Connecting to 0.0.0.0:40593
[ OK ] Parameters/TestRpc.TestConnectionKeepalive/SSL_TCP (1054 ms)
[ RUN ] Parameters/TestRpc.TestClientConnectionMetrics/SSL_TCP
I20260929 18:30:56.180553 6688 acceptor_pool.cc:254] collecting diagnostics on the listening RPC socket 0.0.0.0:44707 every 8 connection(s)
I20260929 18:30:56.180606 6689 acceptor_pool.cc:254] collecting diagnostics on the listening RPC socket 0.0.0.0:44707 every 8 connection(s)
I20260929 18:30:56.180881 6544 rpc-test.cc:569] Connecting to 0.0.0.0:44707
[ OK ] Parameters/TestRpc.TestClientConnectionMetrics/SSL_TCP (12735 ms)
[ RUN ] Parameters/TestRpc.TestCredentialsPolicy/SSL_TCP
I20260929 18:31:08.924465 6711 acceptor_pool.cc:254] collecting diagnostics on the listening RPC socket 0.0.0.0:43217 every 8 connection(s)
I20260929 18:31:08.924485 6712 acceptor_pool.cc:254] collecting diagnostics on the listening RPC socket 0.0.0.0:43217 every 8 connection(s)
I20260929 18:31:08.924808 6544 rpc-test.cc:700] Connecting to 0.0.0.0:43217
[ OK ] Parameters/TestRpc.TestCredentialsPolicy/SSL_TCP (59 ms)
[ RUN ] Parameters/TestRpc.TestCallLongerThanKeepalive/SSL_TCP
I20260929 18:31:08.974427 6736 acceptor_pool.cc:254] collecting diagnostics on the listening RPC socket 0.0.0.0:38205 every 8 connection(s)
I20260929 18:31:08.974474 6737 acceptor_pool.cc:254] collecting diagnostics on the listening RPC socket 0.0.0.0:38205 every 8 connection(s)
I20260929 18:31:08.990185 6740 rpc-test-base.h:222] got call: sleep_micros: 3000000 deferred: true
I20260929 18:31:11.991057 6740 rpcz_store.cc:275] Call kudu.rpc.GenericCalculatorService.Sleep from 127.0.0.1:34218 (request call id 0) took 3000 ms. Trace:
I20260929 18:31:11.991226 6740 rpcz_store.cc:276] 0929 18:31:08.990097 (+ 0us) service_pool.cc:170] Inserting onto call queue
0929 18:31:08.990148 (+ 51us) service_pool.cc:227] Handling call
0929 18:31:11.991037 (+3000889us) inbound_call.cc:173] Queueing success response
Metrics: {}
[ OK ] Parameters/TestRpc.TestCallLongerThanKeepalive/SSL_TCP (3037 ms)
[ RUN ] Parameters/TestRpc.TestRpcSidecar/SSL_TCP
I20260929 18:31:12.004281 6761 acceptor_pool.cc:254] collecting diagnostics on the listening RPC socket 0.0.0.0:37951 every 8 connection(s)
I20260929 18:31:12.004386 6762 acceptor_pool.cc:254] collecting diagnostics on the listening RPC socket 0.0.0.0:37951 every 8 connection(s)
[ OK ] Parameters/TestRpc.TestRpcSidecar/SSL_TCP (81 ms)
[ RUN ] Parameters/TestRpc.TestRpcSidecarLimits/SSL_TCP
I20260929 18:31:13.800123 6786 acceptor_pool.cc:254] collecting diagnostics on the listening RPC socket 0.0.0.0:39657 every 8 connection(s)
I20260929 18:31:13.800179 6787 acceptor_pool.cc:254] collecting diagnostics on the listening RPC socket 0.0.0.0:39657 every 8 connection(s)
W20260929 18:31:13.819579 6544 serialization.cc:72] Serialized kudu.rpc_test.PushStringsRequestPB (2147483654 bytes) is larger than the maximum configured RPC message size (52428800 bytes). Sending anyway, but peer may reject the data.
W20260929 18:31:13.823480 6783 connection.cc:535] server connection from 127.0.0.1:39022 recv error: Network error: RPC frame had a length of 2147483714, but we only support messages up to 52428800 bytes long.
W20260929 18:31:13.823536 6783 connection.cc:158] shutting down server connection from 127.0.0.1:39022 with pending inbound data: 4/2147483714 bytes received; last active 0 ns ago: status Network error: RPC frame had a length of 2147483714, but we only support messages up to 52428800 bytes long.
W20260929 18:31:13.823791 6799 connection.cc:196] Error closing socket: Network error: TlsSocket::Close: Connection reset by peer
I20260929 18:31:13.839998 6811 acceptor_pool.cc:254] collecting diagnostics on the listening RPC socket 0.0.0.0:41437 every 8 connection(s)
I20260929 18:31:13.840013 6812 acceptor_pool.cc:254] collecting diagnostics on the listening RPC socket 0.0.0.0:41437 every 8 connection(s)
W20260929 18:31:17.980827 6808 connection.cc:577] server connection from 127.0.0.1:37574: received bad data: 'Corruption: Invalid packet: message had a length of 2147483710, but we only support messages up to 2147483647 bytes
'
[ OK ] Parameters/TestRpc.TestRpcSidecarLimits/SSL_TCP (5907 ms)
[ RUN ] Parameters/TestRpc.TestCallTimeoutDoesntAffectNegotiation/SSL_TCP
I20260929 18:31:18.001704 6836 acceptor_pool.cc:254] collecting diagnostics on the listening RPC socket 0.0.0.0:39039 every 8 connection(s)
I20260929 18:31:18.001762 6837 acceptor_pool.cc:254] collecting diagnostics on the listening RPC socket 0.0.0.0:39039 every 8 connection(s)
W20260929 18:31:18.017596 6832 negotiation.cc:266] Injecting 500ms delay in negotiation
I20260929 18:31:18.067867 6544 rpc-test-base.h:595] status: Timed out: connection negotiation to 0.0.0.0:39039 for RPC Sleep timed out after 0.050s (ON_OUTBOUND_QUEUE), seconds elapsed: 0.0508231
[ OK ] Parameters/TestRpc.TestCallTimeoutDoesntAffectNegotiation/SSL_TCP (540 ms)
[ RUN ] Parameters/TestRpc.TestRpcHandlerLatencyMetric/SSL_TCP
I20260929 18:31:18.546314 6861 acceptor_pool.cc:254] collecting diagnostics on the listening RPC socket 0.0.0.0:32793 every 8 connection(s)
I20260929 18:31:18.546358 6862 acceptor_pool.cc:254] collecting diagnostics on the listening RPC socket 0.0.0.0:32793 every 8 connection(s)
I20260929 18:31:18.586993 6544 rpc-test.cc:1236] Sleep() min lat: 20319
I20260929 18:31:18.587054 6544 rpc-test.cc:1237] Sleep() mean lat: 20319
I20260929 18:31:18.587080 6544 rpc-test.cc:1238] Sleep() max lat: 20319
I20260929 18:31:18.587093 6544 rpc-test.cc:1239] Sleep() #calls: 1
[ OK ] Parameters/TestRpc.TestRpcHandlerLatencyMetric/SSL_TCP (64 ms)
[ RUN ] Parameters/TestRpc.TimedOutOnResponseMetricServiceQueue/SSL_TCP
I20260929 18:31:18.598423 6887 acceptor_pool.cc:254] collecting diagnostics on the listening RPC socket 0.0.0.0:36483 every 8 connection(s)
I20260929 18:31:18.598479 6888 acceptor_pool.cc:254] collecting diagnostics on the listening RPC socket 0.0.0.0:36483 every 8 connection(s)
W20260929 18:31:18.662554 6889 rpcz_store.cc:267] Call kudu.rpc_test.CalculatorService.Sleep from 127.0.0.1:46924 (request call id 2) took 20 ms (client timeout 20 ms). Trace:
W20260929 18:31:18.662671 6889 rpcz_store.cc:269] 0929 18:31:18.642262 (+ 0us) service_pool.cc:170] Inserting onto call queue
0929 18:31:18.662514 (+ 20252us) service_pool.cc:214] Skipping call since client already timed out
0929 18:31:18.662537 (+ 23us) inbound_call.cc:173] Queueing failure response
Metrics: {}
[ OK ] Parameters/TestRpc.TimedOutOnResponseMetricServiceQueue/SSL_TCP (75 ms)
[ RUN ] Parameters/TestRpc.RpcPendingConnectionsMetric/SSL_TCP
I20260929 18:31:18.667218 6910 acceptor_pool.cc:254] collecting diagnostics on the listening RPC socket 0.0.0.0:44155 every 8 connection(s)
I20260929 18:31:18.667318 6911 acceptor_pool.cc:254] collecting diagnostics on the listening RPC socket 0.0.0.0:44155 every 8 connection(s)
W20260929 18:31:18.668500 6906 negotiation.cc:337] Failed RPC negotiation. Trace:
0929 18:31:18.668094 (+ 0us) reactor.cc:625] Submitting negotiation task for server connection from 127.0.0.1:38122 (local address 127.0.0.1:44155)
0929 18:31:18.668193 (+ 99us) server_negotiation.cc:206] Beginning negotiation
0929 18:31:18.668196 (+ 3us) server_negotiation.cc:399] Waiting for connection header
0929 18:31:18.668292 (+ 96us) negotiation.cc:327] Negotiation complete: Network error: Server connection negotiation failed: server connection from 127.0.0.1:38122: BlockingRecv error: recv got EOF from 127.0.0.1:38122 (error 108)
Metrics: {"server-negotiator.queue_time_us":38}
[ OK ] Parameters/TestRpc.RpcPendingConnectionsMetric/SSL_TCP (14 ms)
[ RUN ] Parameters/TestRpc.TestRpcContextClientDeadline/SSL_TCP
I20260929 18:31:18.686780 6926 acceptor_pool.cc:254] collecting diagnostics on the listening RPC socket 0.0.0.0:42599 every 8 connection(s)
I20260929 18:31:18.686836 6927 acceptor_pool.cc:254] collecting diagnostics on the listening RPC socket 0.0.0.0:42599 every 8 connection(s)
[ OK ] Parameters/TestRpc.TestRpcContextClientDeadline/SSL_TCP (61 ms)
[ RUN ] Parameters/TestRpc.TestApplicationFeatureFlagUnsupportedServer/SSL_TCP
I20260929 18:31:18.760669 6951 acceptor_pool.cc:254] collecting diagnostics on the listening RPC socket 0.0.0.0:39905 every 8 connection(s)
I20260929 18:31:18.760675 6952 acceptor_pool.cc:254] collecting diagnostics on the listening RPC socket 0.0.0.0:39905 every 8 connection(s)
[ OK ] Parameters/TestRpc.TestApplicationFeatureFlagUnsupportedServer/SSL_TCP (34 ms)
[ RUN ] Parameters/TestRpc.TestCancellationAsync/SSL_TCP
I20260929 18:31:18.798071 6976 acceptor_pool.cc:254] collecting diagnostics on the listening RPC socket 0.0.0.0:36433 every 8 connection(s)
I20260929 18:31:18.798120 6977 acceptor_pool.cc:254] collecting diagnostics on the listening RPC socket 0.0.0.0:36433 every 8 connection(s)
I20260929 18:31:18.798391 6544 rpc-test.cc:1716] Connecting to 0.0.0.0:36433
I20260929 18:31:18.806690 6544 test_util.cc:268] Using random seed: 1669118112
I20260929 18:31:18.825297 6980 rpc-test-base.h:240] got call: sleep_micros: 500 pattern: 4294967295 num_repetitions: 2097152 sidecar_idx: 0
I20260929 18:31:18.840533 6979 rpc-test-base.h:240] got call: sleep_micros: 500 pattern: 4294967295 num_repetitions: 2097152 sidecar_idx: 0
I20260929 18:31:18.856815 6980 rpc-test-base.h:240] got call: sleep_micros: 500 pattern: 4294967295 num_repetitions: 2097152 sidecar_idx: 0
I20260929 18:31:18.873903 6979 rpc-test-base.h:240] got call: sleep_micros: 500 pattern: 4294967295 num_repetitions: 2097152 sidecar_idx: 0
I20260929 18:31:18.891996 6980 rpc-test-base.h:240] got call: sleep_micros: 500 pattern: 4294967295 num_repetitions: 2097152 sidecar_idx: 0
I20260929 18:31:18.909243 6979 rpc-test-base.h:240] got call: sleep_micros: 500 pattern: 4294967295 num_repetitions: 2097152 sidecar_idx: 0
I20260929 18:31:18.927142 6980 rpc-test-base.h:240] got call: sleep_micros: 500 pattern: 4294967295 num_repetitions: 2097152 sidecar_idx: 0
W20260929 18:31:18.933717 6975 connection.cc:441] server connection from 127.0.0.1:33906 torn down before Call kudu.rpc.GenericCalculatorService.SleepWithSidecar from 127.0.0.1:33906 (request call id 8) could send its response
W20260929 18:31:18.944936 6975 connection.cc:441] server connection from 127.0.0.1:33906 torn down before Call kudu.rpc.GenericCalculatorService.SleepWithSidecar from 127.0.0.1:33906 (request call id 9) could send its response
[ OK ] Parameters/TestRpc.TestCancellationAsync/SSL_TCP (171 ms)
[ RUN ] Parameters/TestRpc.TestPerformanceBySocketType/SSL_TCP
I20260929 18:31:18.969641 7001 acceptor_pool.cc:254] collecting diagnostics on the listening RPC socket 0.0.0.0:45989 every 8 connection(s)
I20260929 18:31:18.969660 7002 acceptor_pool.cc:254] collecting diagnostics on the listening RPC socket 0.0.0.0:45989 every 8 connection(s)
I20260929 18:31:18.969965 6544 rpc-test.cc:1846] Connecting to 0.0.0.0:45989
I20260929 18:31:21.106102 6544 rpc-test.cc:1859] Sending 1024MB via ssl-enabled tcp socket: real 2.124s user 2.171s sys 1.601s
I20260929 18:31:23.413913 6544 rpc-test.cc:1859] Sending 1024MB via ssl-enabled tcp socket: real 2.308s user 2.371s sys 1.714s
I20260929 18:31:25.792896 6544 rpc-test.cc:1859] Sending 1024MB via ssl-enabled tcp socket: real 2.379s user 2.456s sys 1.746s
I20260929 18:31:28.116006 6544 rpc-test.cc:1859] Sending 1024MB via ssl-enabled tcp socket: real 2.323s user 2.367s sys 1.754s
I20260929 18:31:30.264215 6544 rpc-test.cc:1859] Sending 1024MB via ssl-enabled tcp socket: real 2.148s user 2.140s sys 1.659s
[ OK ] Parameters/TestRpc.TestPerformanceBySocketType/SSL_TCP (11320 ms)
[----------] 20 tests from Parameters/TestRpc (35294 ms total)
[----------] 1 test from Parameters/TestRpcSocketTxRxQueue
[ RUN ] Parameters/TestRpcSocketTxRxQueue.OverCapacity/0
W20260929 18:31:30.539870 7027 negotiation.cc:337] Failed RPC negotiation. Trace:
0929 18:31:30.272799 (+ 0us) reactor.cc:625] Submitting negotiation task for client connection to 0.0.0.0:36717 (local address 127.0.0.1:39234)
0929 18:31:30.272900 (+ 101us) negotiation.cc:107] Waiting for socket to connect
0929 18:31:30.272911 (+ 11us) client_negotiation.cc:174] Beginning negotiation
0929 18:31:30.273019 (+ 108us) client_negotiation.cc:252] Sending NEGOTIATE NegotiatePB request
0929 18:31:30.539692 (+266673us) negotiation.cc:327] Negotiation complete: Network error: Client connection negotiation failed: client connection to 0.0.0.0:36717: BlockingRecv error: recv error from unknown peer: Transport endpoint is not connected (error 107)
Metrics: {"client-negotiator.queue_time_us":42}
W20260929 18:31:30.539904 7018 negotiation.cc:337] Failed RPC negotiation. Trace:
0929 18:31:30.271779 (+ 0us) reactor.cc:625] Submitting negotiation task for client connection to 0.0.0.0:36717 (local address 127.0.0.1:39226)
0929 18:31:30.271873 (+ 94us) negotiation.cc:107] Waiting for socket to connect
0929 18:31:30.271885 (+ 12us) client_negotiation.cc:174] Beginning negotiation
0929 18:31:30.271968 (+ 83us) client_negotiation.cc:252] Sending NEGOTIATE NegotiatePB request
0929 18:31:30.539700 (+267732us) negotiation.cc:327] Negotiation complete: Network error: Client connection negotiation failed: client connection to 0.0.0.0:36717: BlockingRecv error: recv error from unknown peer: Transport endpoint is not connected (error 107)
Metrics: {"client-negotiator.queue_time_us":26}
W20260929 18:31:30.539904 7045 negotiation.cc:337] Failed RPC negotiation. Trace:
0929 18:31:30.275182 (+ 0us) reactor.cc:625] Submitting negotiation task for client connection to 0.0.0.0:36717 (local address 127.0.0.1:39256)
0929 18:31:30.275311 (+ 129us) negotiation.cc:107] Waiting for socket to connect
0929 18:31:30.275324 (+ 13us) client_negotiation.cc:174] Beginning negotiation
0929 18:31:30.275406 (+ 82us) client_negotiation.cc:252] Sending NEGOTIATE NegotiatePB request
0929 18:31:30.539832 (+264426us) negotiation.cc:327] Negotiation complete: Network error: Client connection negotiation failed: client connection to 0.0.0.0:36717: BlockingRecv error: recv error from unknown peer: Transport endpoint is not connected (error 107)
Metrics: {"client-negotiator.queue_time_us":50}
W20260929 18:31:30.540093 7054 negotiation.cc:337] Failed RPC negotiation. Trace:
0929 18:31:30.276297 (+ 0us) reactor.cc:625] Submitting negotiation task for client connection to 0.0.0.0:36717 (local address 127.0.0.1:39258)
0929 18:31:30.276422 (+ 125us) negotiation.cc:107] Waiting for socket to connect
0929 18:31:30.276435 (+ 13us) client_negotiation.cc:174] Beginning negotiation
0929 18:31:30.276510 (+ 75us) client_negotiation.cc:252] Sending NEGOTIATE NegotiatePB request
0929 18:31:30.540004 (+263494us) negotiation.cc:327] Negotiation complete: Network error: Client connection negotiation failed: client connection to 0.0.0.0:36717: BlockingRecv error: recv error from unknown peer: Transport endpoint is not connected (error 107)
Metrics: {"client-negotiator.queue_time_us":42}
W20260929 18:31:30.540125 7036 negotiation.cc:337] Failed RPC negotiation. Trace:
0929 18:31:30.273966 (+ 0us) reactor.cc:625] Submitting negotiation task for client connection to 0.0.0.0:36717 (local address 127.0.0.1:39242)
0929 18:31:30.274069 (+ 103us) negotiation.cc:107] Waiting for socket to connect
0929 18:31:30.274081 (+ 12us) client_negotiation.cc:174] Beginning negotiation
0929 18:31:30.274152 (+ 71us) client_negotiation.cc:252] Sending NEGOTIATE NegotiatePB request
0929 18:31:30.539678 (+265526us) negotiation.cc:327] Negotiation complete: Network error: Client connection negotiation failed: client connection to 0.0.0.0:36717: BlockingRecv error: recv error from unknown peer: Transport endpoint is not connected (error 107)
Metrics: {"client-negotiator.queue_time_us":44}
W20260929 18:31:30.540551 7063 negotiation.cc:337] Failed RPC negotiation. Trace:
0929 18:31:30.277504 (+ 0us) reactor.cc:625] Submitting negotiation task for client connection to 0.0.0.0:36717 (local address 127.0.0.1:39272)
0929 18:31:30.277609 (+ 105us) negotiation.cc:107] Waiting for socket to connect
0929 18:31:30.277624 (+ 15us) client_negotiation.cc:174] Beginning negotiation
0929 18:31:30.277685 (+ 61us) client_negotiation.cc:252] Sending NEGOTIATE NegotiatePB request
0929 18:31:30.540479 (+262794us) negotiation.cc:327] Negotiation complete: Network error: Client connection negotiation failed: client connection to 0.0.0.0:36717: BlockingRecv error: recv error from unknown peer: Transport endpoint is not connected (error 107)
Metrics: {"client-negotiator.queue_time_us":44}
[ OK ] Parameters/TestRpcSocketTxRxQueue.OverCapacity/0 (1035 ms)
[----------] 1 test from Parameters/TestRpcSocketTxRxQueue (1035 ms total)
[----------] Global test environment tear-down
[==========] 21 tests from 2 test suites ran. (36330 ms total)
[ PASSED ] 20 tests.
[ FAILED ] 1 test, listed below:
[ FAILED ] Parameters/TestRpc.TestCallWithChainCertAndChainCA/SSL_TCP, where GetParam() = (true, false)
1 FAILED TEST