Parameters/TestRpc.TestCallWithChainCertAndRootCA/SSL_TCP: /data0/somelongdirectorytoavoidrpathissues/src/kudu/src/kudu/rpc/rpc-test.cc:303: Failure
Failed
Bad status: Runtime error: could not verify certificate chain (error with cert: subject=CN = localhost, ST = sadfjas, C = AS, emailAddress = sdflkdsajf, O = lskdfjlsad, OU = sldfkja, issuer=C = AS, ST = ASDfkjdhf, L = lskdjf, O = saldfja, OU = skdjf, CN = localhost, emailAddress = sadjflkadsj): : certificate has expired
Google Test trace:
/data0/somelongdirectorytoavoidrpathissues/src/kudu/src/kudu/rpc/rpc-test.cc:300: Connecting to 0.0.0.0:38437
I20260926 21:54:54.167667 3047 test_util.cc:175] -----------------------------------------------
I20260926 21:54:54.167845 3047 test_util.cc:176] Had fatal failures, leaving test files at /tmp/dist-test-task_CA41V/test-tmp/rpc-test.1.Parameters_TestRpc.TestCallWithChainCertAndRootCA_SSL_TCP.1790459692659762-3047-0
Note: This is test shard 2 of 8.
[==========] Running 21 tests from 2 test suites.
[----------] Global test environment set-up.
[----------] 1 test from TestRpc
[ RUN ] TestRpc.TestMethodsByName
[ OK ] TestRpc.TestMethodsByName (6 ms)
[----------] 1 test from TestRpc (6 ms total)
[----------] 20 tests from Parameters/TestRpc
[ RUN ] Parameters/TestRpc.TestAcceptorPoolStartStop/SSL_TCP
WARNING: Logging before InitGoogleLogging() is written to STDERR
I20260926 21:54:52.761684 3062 acceptor_pool.cc:254] collecting diagnostics on the listening RPC socket 0.0.0.0:40389 every 8 connection(s)
I20260926 21:54:52.763223 3063 acceptor_pool.cc:254] collecting diagnostics on the listening RPC socket 0.0.0.0:40389 every 8 connection(s)
I20260926 21:54:53.930539 3074 acceptor_pool.cc:254] collecting diagnostics on the listening RPC socket 0.0.0.0:34917 every 8 connection(s)
I20260926 21:54:53.932046 3075 acceptor_pool.cc:254] collecting diagnostics on the listening RPC socket 0.0.0.0:34917 every 8 connection(s)
I20260926 21:54:53.966552 3085 acceptor_pool.cc:254] collecting diagnostics on the listening RPC socket 0.0.0.0:37075 every 8 connection(s)
I20260926 21:54:53.967993 3086 acceptor_pool.cc:254] collecting diagnostics on the listening RPC socket 0.0.0.0:37075 every 8 connection(s)
I20260926 21:54:53.990986 3096 acceptor_pool.cc:254] collecting diagnostics on the listening RPC socket 0.0.0.0:45827 every 8 connection(s)
I20260926 21:54:53.991662 3097 acceptor_pool.cc:254] collecting diagnostics on the listening RPC socket 0.0.0.0:45827 every 8 connection(s)
I20260926 21:54:54.011570 3107 acceptor_pool.cc:254] collecting diagnostics on the listening RPC socket 0.0.0.0:41223 every 8 connection(s)
I20260926 21:54:54.012246 3108 acceptor_pool.cc:254] collecting diagnostics on the listening RPC socket 0.0.0.0:41223 every 8 connection(s)
[ OK ] Parameters/TestRpc.TestAcceptorPoolStartStop/SSL_TCP (1296 ms)
[ RUN ] Parameters/TestRpc.TestCall/SSL_TCP
I20260926 21:54:54.039448 3120 acceptor_pool.cc:254] collecting diagnostics on the listening RPC socket 0.0.0.0:34177 every 8 connection(s)
I20260926 21:54:54.041610 3121 acceptor_pool.cc:254] collecting diagnostics on the listening RPC socket 0.0.0.0:34177 every 8 connection(s)
I20260926 21:54:54.046468 3047 rpc-test.cc:234] Connecting to 0.0.0.0:34177
[ OK ] Parameters/TestRpc.TestCall/SSL_TCP (94 ms)
[ RUN ] Parameters/TestRpc.TestCallWithChainCertAndRootCA/SSL_TCP
I20260926 21:54:54.147737 3145 acceptor_pool.cc:254] collecting diagnostics on the listening RPC socket 0.0.0.0:38437 every 8 connection(s)
I20260926 21:54:54.148532 3146 acceptor_pool.cc:254] collecting diagnostics on the listening RPC socket 0.0.0.0:38437 every 8 connection(s)
/data0/somelongdirectorytoavoidrpathissues/src/kudu/src/kudu/rpc/rpc-test.cc:303: Failure
Failed
Bad status: Runtime error: could not verify certificate chain (error with cert: subject=CN = localhost, ST = sadfjas, C = AS, emailAddress = sdflkdsajf, O = lskdfjlsad, OU = sldfkja, issuer=C = AS, ST = ASDfkjdhf, L = lskdjf, O = saldfja, OU = skdjf, CN = localhost, emailAddress = sadjflkadsj): : certificate has expired
Google Test trace:
/data0/somelongdirectorytoavoidrpathissues/src/kudu/src/kudu/rpc/rpc-test.cc:300: Connecting to 0.0.0.0:38437
I20260926 21:54:54.167667 3047 test_util.cc:175] -----------------------------------------------
I20260926 21:54:54.167845 3047 test_util.cc:176] Had fatal failures, leaving test files at /tmp/dist-test-task_CA41V/test-tmp/rpc-test.1.Parameters_TestRpc.TestCallWithChainCertAndRootCA_SSL_TCP.1790459692659762-3047-0
[ FAILED ] Parameters/TestRpc.TestCallWithChainCertAndRootCA/SSL_TCP, where GetParam() = (true, false) (56 ms)
[ RUN ] Parameters/TestRpc.TestCallWithBadPasswordProtectedKey/SSL_TCP
[ OK ] Parameters/TestRpc.TestCallWithBadPasswordProtectedKey/SSL_TCP (30 ms)
[ RUN ] Parameters/TestRpc.TestInvalidMethodCall/SSL_TCP
I20260926 21:54:54.241176 3182 acceptor_pool.cc:254] collecting diagnostics on the listening RPC socket 0.0.0.0:35087 every 8 connection(s)
I20260926 21:54:54.242151 3183 acceptor_pool.cc:254] collecting diagnostics on the listening RPC socket 0.0.0.0:35087 every 8 connection(s)
I20260926 21:54:54.245587 3047 rpc-test.cc:406] Connecting to 0.0.0.0:35087
[ OK ] Parameters/TestRpc.TestInvalidMethodCall/SSL_TCP (86 ms)
[ RUN ] Parameters/TestRpc.TestHighFDs/SSL_TCP
I20260926 21:54:54.488334 3207 acceptor_pool.cc:254] collecting diagnostics on the listening RPC socket 0.0.0.0:36579 every 8 connection(s)
I20260926 21:54:54.489042 3208 acceptor_pool.cc:254] collecting diagnostics on the listening RPC socket 0.0.0.0:36579 every 8 connection(s)
[ OK ] Parameters/TestRpc.TestHighFDs/SSL_TCP (274 ms)
[ RUN ] Parameters/TestRpc.TestConnectionAlwaysKeepalive/SSL_TCP
I20260926 21:54:54.597280 3230 acceptor_pool.cc:254] collecting diagnostics on the listening RPC socket 0.0.0.0:45737 every 8 connection(s)
I20260926 21:54:54.598044 3231 acceptor_pool.cc:254] collecting diagnostics on the listening RPC socket 0.0.0.0:45737 every 8 connection(s)
I20260926 21:54:54.601118 3047 rpc-test.cc:532] Connecting to 0.0.0.0:45737
[ OK ] Parameters/TestRpc.TestConnectionAlwaysKeepalive/SSL_TCP (3091 ms)
[ RUN ] Parameters/TestRpc.TestReopenOutboundConnections/SSL_TCP
I20260926 21:54:57.669530 3253 acceptor_pool.cc:254] collecting diagnostics on the listening RPC socket 0.0.0.0:38209 every 8 connection(s)
I20260926 21:54:57.670295 3254 acceptor_pool.cc:254] collecting diagnostics on the listening RPC socket 0.0.0.0:38209 every 8 connection(s)
I20260926 21:54:57.673409 3047 rpc-test.cc:658] Connecting to 0.0.0.0:38209
[ OK ] Parameters/TestRpc.TestReopenOutboundConnections/SSL_TCP (379 ms)
[ RUN ] Parameters/TestRpc.TestConnectionNetworkPlane/SSL_TCP
I20260926 21:54:58.054504 3276 acceptor_pool.cc:254] collecting diagnostics on the listening RPC socket 0.0.0.0:39097 every 8 connection(s)
I20260926 21:54:58.055222 3277 acceptor_pool.cc:254] collecting diagnostics on the listening RPC socket 0.0.0.0:39097 every 8 connection(s)
I20260926 21:54:58.058283 3047 rpc-test.cc:772] Connecting to 0.0.0.0:39097
[ OK ] Parameters/TestRpc.TestConnectionNetworkPlane/SSL_TCP (81 ms)
[ RUN ] Parameters/TestRpc.TestTCPKeepalive/SSL_TCP
I20260926 21:54:58.146971 3301 acceptor_pool.cc:254] collecting diagnostics on the listening RPC socket 0.0.0.0:35979 every 8 connection(s)
I20260926 21:54:58.147666 3302 acceptor_pool.cc:254] collecting diagnostics on the listening RPC socket 0.0.0.0:35979 every 8 connection(s)
I20260926 21:54:58.211459 3305 rpc-test-base.h:222] got call: sleep_micros: 8000000 deferred: true
I20260926 21:55:06.215616 3305 rpcz_store.cc:275] Call kudu.rpc.GenericCalculatorService.Sleep from 127.0.0.1:38206 (request call id 0) took 8004 ms. Trace:
I20260926 21:55:06.216018 3305 rpcz_store.cc:276] 0926 21:54:58.211146 (+ 0us) service_pool.cc:170] Inserting onto call queue
0926 21:54:58.211276 (+ 130us) service_pool.cc:227] Handling call
0926 21:55:06.215455 (+8004179us) inbound_call.cc:173] Queueing success response
Metrics: {}
[ OK ] Parameters/TestRpc.TestTCPKeepalive/SSL_TCP (8117 ms)
[ RUN ] Parameters/TestRpc.TestMaxSmallSidecars/SSL_TCP
I20260926 21:55:06.246261 3327 acceptor_pool.cc:254] collecting diagnostics on the listening RPC socket 0.0.0.0:41495 every 8 connection(s)
I20260926 21:55:06.247011 3328 acceptor_pool.cc:254] collecting diagnostics on the listening RPC socket 0.0.0.0:41495 every 8 connection(s)
[ OK ] Parameters/TestRpc.TestMaxSmallSidecars/SSL_TCP (185 ms)
[ RUN ] Parameters/TestRpc.TestCallTimeout/SSL_TCP
I20260926 21:55:06.434552 3352 acceptor_pool.cc:254] collecting diagnostics on the listening RPC socket 0.0.0.0:35445 every 8 connection(s)
I20260926 21:55:06.435237 3353 acceptor_pool.cc:254] collecting diagnostics on the listening RPC socket 0.0.0.0:35445 every 8 connection(s)
I20260926 21:55:06.461843 3047 rpc-test-base.h:595] status: Timed out: connection negotiation to 0.0.0.0:35445 for RPC Sleep timed out after 0.000s (ON_OUTBOUND_QUEUE), seconds elapsed: 0.00293808
I20260926 21:55:06.468777 3356 rpc-test-base.h:222] got call: sleep_micros: 700000
I20260926 21:55:06.663616 3047 rpc-test-base.h:595] status: Timed out: Sleep RPC to 0.0.0.0:35445 timed out after 0.200s (SENT), seconds elapsed: 0.201327
I20260926 21:55:06.665009 3355 rpc-test-base.h:222] got call: sleep_micros: 2000000
W20260926 21:55:07.169442 3356 rpcz_store.cc:267] Call kudu.rpc.GenericCalculatorService.Sleep from 127.0.0.1:57554 (request call id 1) took 700 ms (client timeout 200 ms). Trace:
W20260926 21:55:07.169869 3356 rpcz_store.cc:269] 0926 21:55:06.468613 (+ 0us) service_pool.cc:170] Inserting onto call queue
0926 21:55:06.468721 (+ 108us) service_pool.cc:227] Handling call
0926 21:55:07.169383 (+700662us) inbound_call.cc:173] Queueing success response
Metrics: {}
I20260926 21:55:08.166076 3047 rpc-test-base.h:595] status: Timed out: Sleep RPC to 0.0.0.0:35445 timed out after 1.500s (SENT), seconds elapsed: 1.50213
W20260926 21:55:08.665530 3355 rpcz_store.cc:267] Call kudu.rpc.GenericCalculatorService.Sleep from 127.0.0.1:57554 (request call id 2) took 2000 ms (client timeout 1500 ms). Trace:
W20260926 21:55:08.665880 3355 rpcz_store.cc:269] 0926 21:55:06.664739 (+ 0us) service_pool.cc:170] Inserting onto call queue
0926 21:55:06.664858 (+ 119us) service_pool.cc:227] Handling call
0926 21:55:08.665480 (+2000622us) inbound_call.cc:173] Queueing success response
Metrics: {}
W20260926 21:55:08.666428 3349 connection.cc:441] server connection from 127.0.0.1:57554 torn down before Call kudu.rpc.GenericCalculatorService.Sleep from 127.0.0.1:57554 (request call id 2) could send its response
[ OK ] Parameters/TestRpc.TestCallTimeout/SSL_TCP (2257 ms)
[ RUN ] Parameters/TestRpc.TestServerShutsDown/SSL_TCP
I20260926 21:55:08.674046 3047 rpc-test.cc:1125] Connecting to 0.0.0.0:34395
W20260926 21:55:08.703627 3369 negotiation.cc:337] Failed RPC negotiation. Trace:
0926 21:55:08.702145 (+ 0us) reactor.cc:625] Submitting negotiation task for client connection to 0.0.0.0:34395 (local address 127.0.0.1:48964)
0926 21:55:08.702575 (+ 430us) negotiation.cc:107] Waiting for socket to connect
0926 21:55:08.702609 (+ 34us) client_negotiation.cc:174] Beginning negotiation
0926 21:55:08.702830 (+ 221us) client_negotiation.cc:252] Sending NEGOTIATE NegotiatePB request
0926 21:55:08.703057 (+ 227us) negotiation.cc:327] Negotiation complete: Network error: Client connection negotiation failed: client connection to 0.0.0.0:34395: BlockingWrite error: write error: Broken pipe (error 32)
Metrics: {"client-negotiator.queue_time_us":103}
[ OK ] Parameters/TestRpc.TestServerShutsDown/SSL_TCP (33 ms)
[ RUN ] Parameters/TestRpc.TimedOutOnResponseMetric/SSL_TCP
I20260926 21:55:08.725262 3386 acceptor_pool.cc:254] collecting diagnostics on the listening RPC socket 0.0.0.0:45771 every 8 connection(s)
I20260926 21:55:08.725980 3387 acceptor_pool.cc:254] collecting diagnostics on the listening RPC socket 0.0.0.0:45771 every 8 connection(s)
W20260926 21:55:08.972590 3390 rpcz_store.cc:267] Call kudu.rpc_test.CalculatorService.Sleep from 127.0.0.1:41238 (request call id 3) took 50 ms (client timeout 25 ms). Trace:
W20260926 21:55:08.972913 3390 rpcz_store.cc:269] 0926 21:55:08.922058 (+ 0us) service_pool.cc:170] Inserting onto call queue
0926 21:55:08.922183 (+ 125us) service_pool.cc:227] Handling call
0926 21:55:08.972531 (+ 50348us) inbound_call.cc:173] Queueing success response
Related trace 'test_child':
Metrics: {"test_sleep_us":50000,"child_traces":[["test_child",{"related_trace_metric":1}]]}
W20260926 21:55:09.031849 3390 rpcz_store.cc:267] Call kudu.rpc_test.CalculatorService.Sleep from 127.0.0.1:41238 (request call id 4) took 50 ms (client timeout 50 ms). Trace:
W20260926 21:55:09.032115 3390 rpcz_store.cc:269] 0926 21:55:08.981310 (+ 0us) service_pool.cc:170] Inserting onto call queue
0926 21:55:08.981446 (+ 136us) service_pool.cc:227] Handling call
0926 21:55:09.031787 (+ 50341us) inbound_call.cc:173] Queueing success response
Related trace 'test_child':
Metrics: {"test_sleep_us":50000,"child_traces":[["test_child",{"related_trace_metric":1}]]}
[ OK ] Parameters/TestRpc.TimedOutOnResponseMetric/SSL_TCP (333 ms)
[ RUN ] Parameters/TestRpc.AcceptorDispatchingTimesMetric/SSL_TCP
I20260926 21:55:09.051689 3411 acceptor_pool.cc:254] collecting diagnostics on the listening RPC socket 0.0.0.0:34489 every 8 connection(s)
I20260926 21:55:09.052361 3412 acceptor_pool.cc:254] collecting diagnostics on the listening RPC socket 0.0.0.0:34489 every 8 connection(s)
W20260926 21:55:09.058171 3407 negotiation.cc:337] Failed RPC negotiation. Trace:
0926 21:55:09.055848 (+ 0us) reactor.cc:625] Submitting negotiation task for server connection from 127.0.0.1:54224 (local address 127.0.0.1:34489)
0926 21:55:09.056500 (+ 652us) server_negotiation.cc:206] Beginning negotiation
0926 21:55:09.056550 (+ 50us) server_negotiation.cc:399] Waiting for connection header
0926 21:55:09.056841 (+ 291us) negotiation.cc:327] Negotiation complete: Network error: Server connection negotiation failed: server connection from 127.0.0.1:54224: BlockingRecv error: recv got EOF from 127.0.0.1:54224 (error 108)
Metrics: {"server-negotiator.queue_time_us":126}
[ OK ] Parameters/TestRpc.AcceptorDispatchingTimesMetric/SSL_TCP (20 ms)
[ RUN ] Parameters/TestRpc.TestRpcCallbackDestroysMessenger/SSL_TCP
[ OK ] Parameters/TestRpc.TestRpcCallbackDestroysMessenger/SSL_TCP (15 ms)
[ RUN ] Parameters/TestRpc.TestApplicationFeatureFlag/SSL_TCP
I20260926 21:55:09.114528 3436 acceptor_pool.cc:254] collecting diagnostics on the listening RPC socket 0.0.0.0:43705 every 8 connection(s)
I20260926 21:55:09.115258 3437 acceptor_pool.cc:254] collecting diagnostics on the listening RPC socket 0.0.0.0:43705 every 8 connection(s)
W20260926 21:55:09.141396 3435 messenger.cc:357] Unable to handle RPC call: Not implemented: call requires unsupported application feature flags: 99
[ OK ] Parameters/TestRpc.TestApplicationFeatureFlag/SSL_TCP (71 ms)
[ RUN ] Parameters/TestRpc.TestCancellation/SSL_TCP
I20260926 21:55:09.177894 3461 acceptor_pool.cc:254] collecting diagnostics on the listening RPC socket 0.0.0.0:35515 every 8 connection(s)
I20260926 21:55:09.178618 3462 acceptor_pool.cc:254] collecting diagnostics on the listening RPC socket 0.0.0.0:35515 every 8 connection(s)
I20260926 21:55:09.181574 3047 rpc-test.cc:1648] Connecting to 0.0.0.0:35515
I20260926 21:55:09.280934 3047 rpc-test-base.h:595] status: Aborted: Sleep RPC to 0.0.0.0:35515 is cancelled in state READY, seconds elapsed: 0.000319375
I20260926 21:55:09.427496 3047 rpc-test-base.h:595] status: Aborted: Sleep RPC to 0.0.0.0:35515 is cancelled in state SENT, seconds elapsed: 0.000812811
I20260926 21:55:09.466192 3464 rpc-test-base.h:222] got call: sleep_micros: 510000
I20260926 21:55:09.585944 3047 rpc-test-base.h:595] status: Aborted: Sleep RPC to 0.0.0.0:35515 is cancelled in state SENT, seconds elapsed: 0.000792363
I20260926 21:55:09.625667 3463 rpc-test-base.h:222] got call: sleep_micros: 510000
I20260926 21:55:09.745105 3047 rpc-test-base.h:595] status: Aborted: Sleep RPC to 0.0.0.0:35515 is cancelled in state SENT, seconds elapsed: 0.000808133
W20260926 21:55:09.783018 3465 rpcz_store.cc:267] Call kudu.rpc.GenericCalculatorService.Sleep from 127.0.0.1:37972 (request call id 11) took 15 ms (client timeout 10 ms). Trace:
W20260926 21:55:09.783316 3465 rpcz_store.cc:269] 0926 21:55:09.767889 (+ 0us) service_pool.cc:170] Inserting onto call queue
0926 21:55:09.782732 (+ 14843us) service_pool.cc:214] Skipping call since client already timed out
0926 21:55:09.782846 (+ 114us) inbound_call.cc:173] Queueing failure response
Metrics: {}
I20260926 21:55:09.783846 3465 rpc-test-base.h:222] got call: sleep_micros: 1500000
W20260926 21:55:09.976917 3464 rpcz_store.cc:267] Call kudu.rpc.GenericCalculatorService.Sleep from 127.0.0.1:37972 (request call id 3) took 511 ms (client timeout 10 ms). Trace:
W20260926 21:55:09.977228 3464 rpcz_store.cc:269] 0926 21:55:09.465898 (+ 0us) service_pool.cc:170] Inserting onto call queue
0926 21:55:09.466090 (+ 192us) service_pool.cc:227] Handling call
0926 21:55:09.976857 (+510767us) inbound_call.cc:173] Queueing success response
Metrics: {}
W20260926 21:55:10.136356 3463 rpcz_store.cc:267] Call kudu.rpc.GenericCalculatorService.Sleep from 127.0.0.1:37972 (request call id 7) took 511 ms (client timeout 10 ms). Trace:
W20260926 21:55:10.136673 3463 rpcz_store.cc:269] 0926 21:55:09.625420 (+ 0us) service_pool.cc:170] Inserting onto call queue
0926 21:55:09.625595 (+ 175us) service_pool.cc:227] Handling call
0926 21:55:10.136298 (+510703us) inbound_call.cc:173] Queueing success response
Metrics: {}
I20260926 21:55:10.747634 3047 rpc-test-base.h:595] status: Timed out: Sleep RPC to 0.0.0.0:35515 timed out after 1.000s (SENT), seconds elapsed: 1.00214
I20260926 21:55:10.748912 3463 rpc-test-base.h:222] got call: sleep_micros: 1500000
W20260926 21:55:11.284368 3465 rpcz_store.cc:267] Call kudu.rpc.GenericCalculatorService.Sleep from 127.0.0.1:37972 (request call id 12) took 1516 ms (client timeout 1000 ms). Trace:
W20260926 21:55:11.284713 3465 rpcz_store.cc:269] 0926 21:55:09.768225 (+ 0us) service_pool.cc:170] Inserting onto call queue
0926 21:55:09.783816 (+ 15591us) service_pool.cc:227] Handling call
0926 21:55:11.284320 (+1500504us) inbound_call.cc:173] Queueing success response
Metrics: {}
I20260926 21:55:11.749784 3047 rpc-test-base.h:595] status: Timed out: Sleep RPC to 0.0.0.0:35515 timed out after 1.000s (SENT), seconds elapsed: 1.00186
W20260926 21:55:11.751219 3458 messenger.cc:357] Unable to handle RPC call: Not implemented: call requires unsupported application feature flags: 99, 1
W20260926 21:55:11.752700 3458 messenger.cc:357] Unable to handle RPC call: Not implemented: call requires unsupported application feature flags: 99, 1
W20260926 21:55:12.249374 3463 rpcz_store.cc:267] Call kudu.rpc.GenericCalculatorService.Sleep from 127.0.0.1:37972 (request call id 13) took 1500 ms (client timeout 1000 ms). Trace:
W20260926 21:55:12.249689 3463 rpcz_store.cc:269] 0926 21:55:10.748721 (+ 0us) service_pool.cc:170] Inserting onto call queue
0926 21:55:10.748862 (+ 141us) service_pool.cc:227] Handling call
0926 21:55:12.249322 (+1500460us) inbound_call.cc:173] Queueing success response
Metrics: {}
W20260926 21:55:12.250355 3458 connection.cc:441] server connection from 127.0.0.1:37972 torn down before Call kudu.rpc.GenericCalculatorService.Sleep from 127.0.0.1:37972 (request call id 13) could send its response
[ OK ] Parameters/TestRpc.TestCancellation/SSL_TCP (3107 ms)
[ RUN ] Parameters/TestRpc.TestCancellationMultiThreads/SSL_TCP
I20260926 21:55:12.283700 3486 acceptor_pool.cc:254] collecting diagnostics on the listening RPC socket 0.0.0.0:45677 every 8 connection(s)
I20260926 21:55:12.284430 3487 acceptor_pool.cc:254] collecting diagnostics on the listening RPC socket 0.0.0.0:45677 every 8 connection(s)
I20260926 21:55:12.287563 3047 rpc-test.cc:1808] Connecting to 0.0.0.0:45677
I20260926 21:55:12.428759 3500 test_util.cc:268] Using random seed: -484123971
I20260926 21:55:12.430413 3501 test_util.cc:268] Using random seed: -484122318
I20260926 21:55:12.432235 3502 test_util.cc:268] Using random seed: -484120491
I20260926 21:55:12.433478 3503 test_util.cc:268] Using random seed: -484119265
I20260926 21:55:12.434934 3504 test_util.cc:268] Using random seed: -484117924
I20260926 21:55:12.436192 3505 test_util.cc:268] Using random seed: -484116635
I20260926 21:55:12.437423 3506 test_util.cc:268] Using random seed: -484115405
I20260926 21:55:12.440227 3507 test_util.cc:268] Using random seed: -484112609
I20260926 21:55:12.441762 3508 test_util.cc:268] Using random seed: -484111122
I20260926 21:55:12.443419 3509 test_util.cc:268] Using random seed: -484109475
I20260926 21:55:12.444950 3510 test_util.cc:268] Using random seed: -484107935
I20260926 21:55:12.446939 3511 test_util.cc:268] Using random seed: -484105964
I20260926 21:55:12.452013 3512 test_util.cc:268] Using random seed: -484100885
I20260926 21:55:12.457031 3513 test_util.cc:268] Using random seed: -484095844
I20260926 21:55:12.460717 3515 test_util.cc:268] Using random seed: -484092159
I20260926 21:55:12.462486 3516 test_util.cc:268] Using random seed: -484090368
I20260926 21:55:12.459323 3514 test_util.cc:268] Using random seed: -484094193
I20260926 21:55:12.464102 3517 test_util.cc:268] Using random seed: -484088800
I20260926 21:55:12.466169 3518 test_util.cc:268] Using random seed: -484086736
I20260926 21:55:12.467752 3519 test_util.cc:268] Using random seed: -484085122
I20260926 21:55:12.469823 3520 test_util.cc:268] Using random seed: -484083049
I20260926 21:55:12.471431 3521 test_util.cc:268] Using random seed: -484081473
I20260926 21:55:12.472994 3522 test_util.cc:268] Using random seed: -484079905
I20260926 21:55:12.475003 3523 test_util.cc:268] Using random seed: -484077864
I20260926 21:55:12.476660 3524 test_util.cc:268] Using random seed: -484076243
I20260926 21:55:12.478271 3525 test_util.cc:268] Using random seed: -484074638
I20260926 21:55:12.479921 3526 test_util.cc:268] Using random seed: -484072952
I20260926 21:55:12.481623 3527 test_util.cc:268] Using random seed: -484071282
I20260926 21:55:12.483711 3528 test_util.cc:268] Using random seed: -484069194
I20260926 21:55:12.485360 3529 test_util.cc:268] Using random seed: -484067499
[ OK ] Parameters/TestRpc.TestCancellationMultiThreads/SSL_TCP (17445 ms)
[ RUN ] Parameters/TestRpc.TestCallId/SSL_TCP
I20260926 21:55:29.732111 3543 acceptor_pool.cc:254] collecting diagnostics on the listening RPC socket 0.0.0.0:33727 every 8 connection(s)
I20260926 21:55:29.732864 3544 acceptor_pool.cc:254] collecting diagnostics on the listening RPC socket 0.0.0.0:33727 every 8 connection(s)
[ OK ] Parameters/TestRpc.TestCallId/SSL_TCP (91 ms)
[----------] 20 tests from Parameters/TestRpc (37073 ms total)
[----------] Global test environment tear-down
[==========] 21 tests from 2 test suites ran. (37081 ms total)
[ PASSED ] 20 tests.
[ FAILED ] 1 test, listed below:
[ FAILED ] Parameters/TestRpc.TestCallWithChainCertAndRootCA/SSL_TCP, where GetParam() = (true, false)
1 FAILED TEST