Diagnosed failure

Parameters/TestRpc.TestCallWithChainCertAndChainCA/SSL_TCP: /data0/somelongdirectorytoavoidrpathissues/src/kudu/src/kudu/rpc/rpc-test.cc:270: Failure
Failed
Bad status: Runtime error: could not verify certificate chain (error with cert: subject=CN = localhost, ST = sadfjas, C = AS, emailAddress = sdflkdsajf, O = lskdfjlsad, OU = sldfkja, issuer=C = AS, ST = ASDfkjdhf, L = lskdjf, O = saldfja, OU = skdjf, CN = localhost, emailAddress = sadjflkadsj): : certificate has expired
Google Test trace:
/data0/somelongdirectorytoavoidrpathissues/src/kudu/src/kudu/rpc/rpc-test.cc:267: Connecting to 0.0.0.0:42187
I20260927 06:59:01.070261  4619 test_util.cc:175] -----------------------------------------------
I20260927 06:59:01.070341  4619 test_util.cc:176] Had fatal failures, leaving test files at /tmp/dist-test-taskLPii9i/test-tmp/rpc-test.5.Parameters_TestRpc.TestCallWithChainCertAndChainCA_SSL_TCP.1790492340989232-4619-0

Full log

Note: This is test shard 6 of 8.
[==========] Running 21 tests from 2 test suites.
[----------] Global test environment set-up.
[----------] 20 tests from Parameters/TestRpc
[ RUN      ] Parameters/TestRpc.TestMessengerCreateDestroy/SSL_TCP
WARNING: Logging before InitGoogleLogging() is written to STDERR
I20260927 06:59:01.039398  4619 rpc-test.cc:169] started messenger TestCreateDestroy
[       OK ] Parameters/TestRpc.TestMessengerCreateDestroy/SSL_TCP (48 ms)
[ RUN      ] Parameters/TestRpc.TestNegotiationDeadlock/SSL_TCP
I20260927 06:59:01.050639  4639 acceptor_pool.cc:254] collecting diagnostics on the listening RPC socket 0.0.0.0:34107 every 8 connection(s)
I20260927 06:59:01.050645  4640 acceptor_pool.cc:254] collecting diagnostics on the listening RPC socket 0.0.0.0:34107 every 8 connection(s)
[       OK ] Parameters/TestRpc.TestNegotiationDeadlock/SSL_TCP (18 ms)
[ RUN      ] Parameters/TestRpc.TestCallWithChainCertAndChainCA/SSL_TCP
I20260927 06:59:01.066093  4655 acceptor_pool.cc:254] collecting diagnostics on the listening RPC socket 0.0.0.0:42187 every 8 connection(s)
I20260927 06:59:01.066123  4656 acceptor_pool.cc:254] collecting diagnostics on the listening RPC socket 0.0.0.0:42187 every 8 connection(s)
/data0/somelongdirectorytoavoidrpathissues/src/kudu/src/kudu/rpc/rpc-test.cc:270: Failure
Failed
Bad status: Runtime error: could not verify certificate chain (error with cert: subject=CN = localhost, ST = sadfjas, C = AS, emailAddress = sdflkdsajf, O = lskdfjlsad, OU = sldfkja, issuer=C = AS, ST = ASDfkjdhf, L = lskdjf, O = saldfja, OU = skdjf, CN = localhost, emailAddress = sadjflkadsj): : certificate has expired
Google Test trace:
/data0/somelongdirectorytoavoidrpathissues/src/kudu/src/kudu/rpc/rpc-test.cc:267: Connecting to 0.0.0.0:42187
I20260927 06:59:01.070261  4619 test_util.cc:175] -----------------------------------------------
I20260927 06:59:01.070341  4619 test_util.cc:176] Had fatal failures, leaving test files at /tmp/dist-test-taskLPii9i/test-tmp/rpc-test.5.Parameters_TestRpc.TestCallWithChainCertAndChainCA_SSL_TCP.1790492340989232-4619-0
[  FAILED  ] Parameters/TestRpc.TestCallWithChainCertAndChainCA/SSL_TCP, where GetParam() = (true, false) (11 ms)
[ RUN      ] Parameters/TestRpc.TestCallWithPasswordProtectedKey/SSL_TCP
I20260927 06:59:01.080101  4680 acceptor_pool.cc:254] collecting diagnostics on the listening RPC socket 0.0.0.0:33835 every 8 connection(s)
I20260927 06:59:01.080150  4681 acceptor_pool.cc:254] collecting diagnostics on the listening RPC socket 0.0.0.0:33835 every 8 connection(s)
[       OK ] Parameters/TestRpc.TestCallWithPasswordProtectedKey/SSL_TCP (22 ms)
[ RUN      ] Parameters/TestRpc.TestCallToBadServer/SSL_TCP
I20260927 06:59:01.107793  4619 rpc-test.cc:394] Status: Network error: Client connection negotiation failed: client connection to 0.0.0.0:0: connect: Connection refused (error 111)
I20260927 06:59:01.108037  4619 rpc-test.cc:394] Status: Network error: Client connection negotiation failed: client connection to 0.0.0.0:0: connect: Connection refused (error 111)
I20260927 06:59:01.108269  4619 rpc-test.cc:394] Status: Network error: Client connection negotiation failed: client connection to 0.0.0.0:0: connect: Connection refused (error 111)
I20260927 06:59:01.108477  4619 rpc-test.cc:394] Status: Network error: Client connection negotiation failed: client connection to 0.0.0.0:0: connect: Connection refused (error 111)
I20260927 06:59:01.108657  4619 rpc-test.cc:394] Status: Network error: Client connection negotiation failed: client connection to 0.0.0.0:0: connect: Connection refused (error 111)
[       OK ] Parameters/TestRpc.TestCallToBadServer/SSL_TCP (16 ms)
[ RUN      ] Parameters/TestRpc.TestWrongService/SSL_TCP
I20260927 06:59:01.126024  4715 acceptor_pool.cc:254] collecting diagnostics on the listening RPC socket 0.0.0.0:44601 every 8 connection(s)
I20260927 06:59:01.126065  4716 acceptor_pool.cc:254] collecting diagnostics on the listening RPC socket 0.0.0.0:44601 every 8 connection(s)
I20260927 06:59:01.164633  4713 messenger.cc:345] service WrongServiceName not registered on TestServer
[       OK ] Parameters/TestRpc.TestWrongService/SSL_TCP (57 ms)
[ RUN      ] Parameters/TestRpc.TestConnectionKeepalive/SSL_TCP
I20260927 06:59:01.182060  4738 acceptor_pool.cc:254] collecting diagnostics on the listening RPC socket 0.0.0.0:40937 every 8 connection(s)
I20260927 06:59:01.182101  4739 acceptor_pool.cc:254] collecting diagnostics on the listening RPC socket 0.0.0.0:40937 every 8 connection(s)
I20260927 06:59:01.182305  4619 rpc-test.cc:488] Connecting to 0.0.0.0:40937
[       OK ] Parameters/TestRpc.TestConnectionKeepalive/SSL_TCP (1044 ms)
[ RUN      ] Parameters/TestRpc.TestClientConnectionMetrics/SSL_TCP
I20260927 06:59:02.222316  4763 acceptor_pool.cc:254] collecting diagnostics on the listening RPC socket 0.0.0.0:39951 every 8 connection(s)
I20260927 06:59:02.222543  4619 rpc-test.cc:569] Connecting to 0.0.0.0:39951
I20260927 06:59:02.223161  4764 acceptor_pool.cc:254] collecting diagnostics on the listening RPC socket 0.0.0.0:39951 every 8 connection(s)
[       OK ] Parameters/TestRpc.TestClientConnectionMetrics/SSL_TCP (9204 ms)
[ RUN      ] Parameters/TestRpc.TestCredentialsPolicy/SSL_TCP
I20260927 06:59:11.429343  4786 acceptor_pool.cc:254] collecting diagnostics on the listening RPC socket 0.0.0.0:41263 every 8 connection(s)
I20260927 06:59:11.429512  4787 acceptor_pool.cc:254] collecting diagnostics on the listening RPC socket 0.0.0.0:41263 every 8 connection(s)
I20260927 06:59:11.429636  4619 rpc-test.cc:700] Connecting to 0.0.0.0:41263
[       OK ] Parameters/TestRpc.TestCredentialsPolicy/SSL_TCP (50 ms)
[ RUN      ] Parameters/TestRpc.TestCallLongerThanKeepalive/SSL_TCP
I20260927 06:59:11.474718  4811 acceptor_pool.cc:254] collecting diagnostics on the listening RPC socket 0.0.0.0:33885 every 8 connection(s)
I20260927 06:59:11.474746  4812 acceptor_pool.cc:254] collecting diagnostics on the listening RPC socket 0.0.0.0:33885 every 8 connection(s)
I20260927 06:59:11.486501  4815 rpc-test-base.h:222] got call: sleep_micros: 3000000 deferred: true
I20260927 06:59:14.487219  4815 rpcz_store.cc:275] Call kudu.rpc.GenericCalculatorService.Sleep from 127.0.0.1:40264 (request call id 0) took 3000 ms. Trace:
I20260927 06:59:14.487323  4815 rpcz_store.cc:276] 0927 06:59:11.486378 (+     0us) service_pool.cc:170] Inserting onto call queue
0927 06:59:11.486480 (+   102us) service_pool.cc:227] Handling call
0927 06:59:14.487202 (+3000722us) inbound_call.cc:173] Queueing success response
Metrics: {}
[       OK ] Parameters/TestRpc.TestCallLongerThanKeepalive/SSL_TCP (3023 ms)
[ RUN      ] Parameters/TestRpc.TestRpcSidecar/SSL_TCP
I20260927 06:59:14.499596  4836 acceptor_pool.cc:254] collecting diagnostics on the listening RPC socket 0.0.0.0:41477 every 8 connection(s)
I20260927 06:59:14.499677  4837 acceptor_pool.cc:254] collecting diagnostics on the listening RPC socket 0.0.0.0:41477 every 8 connection(s)
[       OK ] Parameters/TestRpc.TestRpcSidecar/SSL_TCP (66 ms)
[ RUN      ] Parameters/TestRpc.TestRpcSidecarLimits/SSL_TCP
I20260927 06:59:16.354058  4861 acceptor_pool.cc:254] collecting diagnostics on the listening RPC socket 0.0.0.0:36649 every 8 connection(s)
I20260927 06:59:16.354066  4862 acceptor_pool.cc:254] collecting diagnostics on the listening RPC socket 0.0.0.0:36649 every 8 connection(s)
W20260927 06:59:16.367447  4619 serialization.cc:72] Serialized kudu.rpc_test.PushStringsRequestPB (2147483654 bytes) is larger than the maximum configured RPC message size (52428800 bytes). Sending anyway, but peer may reject the data.
W20260927 06:59:16.371114  4860 connection.cc:535] server connection from 127.0.0.1:51436 recv error: Network error: RPC frame had a length of 2147483714, but we only support messages up to 52428800 bytes long.
W20260927 06:59:16.371188  4860 connection.cc:158] shutting down server connection from 127.0.0.1:51436 with pending inbound data: 4/2147483714 bytes received; last active 0 ns ago: status Network error: RPC frame had a length of 2147483714, but we only support messages up to 52428800 bytes long.
W20260927 06:59:16.371493  4874 connection.cc:196] Error closing socket: Network error: TlsSocket::Close: Connection reset by peer
I20260927 06:59:16.379077  4886 acceptor_pool.cc:254] collecting diagnostics on the listening RPC socket 0.0.0.0:39875 every 8 connection(s)
I20260927 06:59:16.379106  4887 acceptor_pool.cc:254] collecting diagnostics on the listening RPC socket 0.0.0.0:39875 every 8 connection(s)
W20260927 06:59:20.427867  4883 connection.cc:577] server connection from 127.0.0.1:38628: received bad data: 'Corruption: Invalid packet: message had a length of 2147483710, but we only support messages up to 2147483647 bytes
'
[       OK ] Parameters/TestRpc.TestRpcSidecarLimits/SSL_TCP (5874 ms)
[ RUN      ] Parameters/TestRpc.TestCallTimeoutDoesntAffectNegotiation/SSL_TCP
I20260927 06:59:20.453135  4911 acceptor_pool.cc:254] collecting diagnostics on the listening RPC socket 0.0.0.0:43821 every 8 connection(s)
I20260927 06:59:20.453228  4912 acceptor_pool.cc:254] collecting diagnostics on the listening RPC socket 0.0.0.0:43821 every 8 connection(s)
W20260927 06:59:20.457839  4907 negotiation.cc:266] Injecting 500ms delay in negotiation
I20260927 06:59:20.508215  4619 rpc-test-base.h:595] status: Timed out: connection negotiation to 0.0.0.0:43821 for RPC Sleep timed out after 0.050s (ON_OUTBOUND_QUEUE), seconds elapsed: 0.0507775
[       OK ] Parameters/TestRpc.TestCallTimeoutDoesntAffectNegotiation/SSL_TCP (532 ms)
[ RUN      ] Parameters/TestRpc.TestRpcHandlerLatencyMetric/SSL_TCP
I20260927 06:59:20.972949  4936 acceptor_pool.cc:254] collecting diagnostics on the listening RPC socket 0.0.0.0:32811 every 8 connection(s)
I20260927 06:59:20.973081  4937 acceptor_pool.cc:254] collecting diagnostics on the listening RPC socket 0.0.0.0:32811 every 8 connection(s)
I20260927 06:59:21.007153  4619 rpc-test.cc:1236] Sleep() min lat: 20287
I20260927 06:59:21.007223  4619 rpc-test.cc:1237] Sleep() mean lat: 20287
I20260927 06:59:21.007282  4619 rpc-test.cc:1238] Sleep() max lat: 20287
I20260927 06:59:21.007296  4619 rpc-test.cc:1239] Sleep() #calls: 1
[       OK ] Parameters/TestRpc.TestRpcHandlerLatencyMetric/SSL_TCP (45 ms)
[ RUN      ] Parameters/TestRpc.TimedOutOnResponseMetricServiceQueue/SSL_TCP
I20260927 06:59:21.037856  4962 acceptor_pool.cc:254] collecting diagnostics on the listening RPC socket 0.0.0.0:39499 every 8 connection(s)
I20260927 06:59:21.037901  4963 acceptor_pool.cc:254] collecting diagnostics on the listening RPC socket 0.0.0.0:39499 every 8 connection(s)
W20260927 06:59:21.092643  4964 rpcz_store.cc:267] Call kudu.rpc_test.CalculatorService.Sleep from 127.0.0.1:58430 (request call id 2) took 20 ms (client timeout 20 ms). Trace:
W20260927 06:59:21.092761  4964 rpcz_store.cc:269] 0927 06:59:21.072320 (+     0us) service_pool.cc:170] Inserting onto call queue
0927 06:59:21.092584 (+ 20264us) service_pool.cc:214] Skipping call since client already timed out
0927 06:59:21.092598 (+    14us) inbound_call.cc:173] Queueing failure response
Metrics: {}
[       OK ] Parameters/TestRpc.TimedOutOnResponseMetricServiceQueue/SSL_TCP (85 ms)
[ RUN      ] Parameters/TestRpc.RpcPendingConnectionsMetric/SSL_TCP
I20260927 06:59:21.096724  4985 acceptor_pool.cc:254] collecting diagnostics on the listening RPC socket 0.0.0.0:45711 every 8 connection(s)
I20260927 06:59:21.096745  4986 acceptor_pool.cc:254] collecting diagnostics on the listening RPC socket 0.0.0.0:45711 every 8 connection(s)
W20260927 06:59:21.106657  4981 negotiation.cc:337] Failed RPC negotiation. Trace:
0927 06:59:21.106357 (+     0us) reactor.cc:625] Submitting negotiation task for server connection from 127.0.0.1:46864 (local address 127.0.0.1:45711)
0927 06:59:21.106419 (+    62us) server_negotiation.cc:206] Beginning negotiation
0927 06:59:21.106437 (+    18us) server_negotiation.cc:399] Waiting for connection header
0927 06:59:21.106547 (+   110us) negotiation.cc:327] Negotiation complete: Network error: Server connection negotiation failed: server connection from 127.0.0.1:46864: BlockingRecv error: recv got EOF from 127.0.0.1:46864 (error 108)
Metrics: {"server-negotiator.queue_time_us":25}
[       OK ] Parameters/TestRpc.RpcPendingConnectionsMetric/SSL_TCP (22 ms)
[ RUN      ] Parameters/TestRpc.TestRpcContextClientDeadline/SSL_TCP
I20260927 06:59:21.146525  5001 acceptor_pool.cc:254] collecting diagnostics on the listening RPC socket 0.0.0.0:38443 every 8 connection(s)
I20260927 06:59:21.146569  5002 acceptor_pool.cc:254] collecting diagnostics on the listening RPC socket 0.0.0.0:38443 every 8 connection(s)
[       OK ] Parameters/TestRpc.TestRpcContextClientDeadline/SSL_TCP (64 ms)
[ RUN      ] Parameters/TestRpc.TestApplicationFeatureFlagUnsupportedServer/SSL_TCP
I20260927 06:59:21.189939  5027 acceptor_pool.cc:254] collecting diagnostics on the listening RPC socket 0.0.0.0:42037 every 8 connection(s)
I20260927 06:59:21.189908  5026 acceptor_pool.cc:254] collecting diagnostics on the listening RPC socket 0.0.0.0:42037 every 8 connection(s)
[       OK ] Parameters/TestRpc.TestApplicationFeatureFlagUnsupportedServer/SSL_TCP (33 ms)
[ RUN      ] Parameters/TestRpc.TestCancellationAsync/SSL_TCP
I20260927 06:59:21.225689  5051 acceptor_pool.cc:254] collecting diagnostics on the listening RPC socket 0.0.0.0:34443 every 8 connection(s)
I20260927 06:59:21.225726  5052 acceptor_pool.cc:254] collecting diagnostics on the listening RPC socket 0.0.0.0:34443 every 8 connection(s)
I20260927 06:59:21.225896  4619 rpc-test.cc:1716] Connecting to 0.0.0.0:34443
I20260927 06:59:21.237229  4619 test_util.cc:268] Using random seed: 2099913451
I20260927 06:59:21.253592  5055 rpc-test-base.h:240] got call: sleep_micros: 500 pattern: 4294967295 num_repetitions: 2097152 sidecar_idx: 0
I20260927 06:59:21.265908  5055 rpc-test-base.h:240] got call: sleep_micros: 500 pattern: 4294967295 num_repetitions: 2097152 sidecar_idx: 0
I20260927 06:59:21.278590  5055 rpc-test-base.h:240] got call: sleep_micros: 500 pattern: 4294967295 num_repetitions: 2097152 sidecar_idx: 0
I20260927 06:59:21.291631  5055 rpc-test-base.h:240] got call: sleep_micros: 500 pattern: 4294967295 num_repetitions: 2097152 sidecar_idx: 0
I20260927 06:59:21.304462  5055 rpc-test-base.h:240] got call: sleep_micros: 500 pattern: 4294967295 num_repetitions: 2097152 sidecar_idx: 0
I20260927 06:59:21.324956  5055 rpc-test-base.h:240] got call: sleep_micros: 500 pattern: 4294967295 num_repetitions: 2097152 sidecar_idx: 0
I20260927 06:59:21.343580  5055 rpc-test-base.h:240] got call: sleep_micros: 500 pattern: 4294967295 num_repetitions: 2097152 sidecar_idx: 0
I20260927 06:59:21.360666  5055 rpc-test-base.h:240] got call: sleep_micros: 500 pattern: 4294967295 num_repetitions: 2097152 sidecar_idx: 0
W20260927 06:59:21.364056  5050 connection.cc:441] server connection from 127.0.0.1:44238 torn down before Call kudu.rpc.GenericCalculatorService.SleepWithSidecar from 127.0.0.1:44238 (request call id 9) could send its response
[       OK ] Parameters/TestRpc.TestCancellationAsync/SSL_TCP (149 ms)
[ RUN      ] Parameters/TestRpc.TestPerformanceBySocketType/SSL_TCP
I20260927 06:59:21.382992  5076 acceptor_pool.cc:254] collecting diagnostics on the listening RPC socket 0.0.0.0:36721 every 8 connection(s)
I20260927 06:59:21.383025  5077 acceptor_pool.cc:254] collecting diagnostics on the listening RPC socket 0.0.0.0:36721 every 8 connection(s)
I20260927 06:59:21.383177  4619 rpc-test.cc:1846] Connecting to 0.0.0.0:36721
I20260927 06:59:23.173612  4619 rpc-test.cc:1859] Sending 1024MB via ssl-enabled tcp socket: real 1.765s	user 1.673s	sys 1.434s
I20260927 06:59:24.998644  4619 rpc-test.cc:1859] Sending 1024MB via ssl-enabled tcp socket: real 1.825s	user 1.782s	sys 1.401s
I20260927 06:59:26.897166  4619 rpc-test.cc:1859] Sending 1024MB via ssl-enabled tcp socket: real 1.898s	user 1.817s	sys 1.520s
I20260927 06:59:28.695358  4619 rpc-test.cc:1859] Sending 1024MB via ssl-enabled tcp socket: real 1.798s	user 1.566s	sys 1.595s
I20260927 06:59:30.475148  4619 rpc-test.cc:1859] Sending 1024MB via ssl-enabled tcp socket: real 1.780s	user 1.631s	sys 1.514s
[       OK ] Parameters/TestRpc.TestPerformanceBySocketType/SSL_TCP (9111 ms)
[----------] 20 tests from Parameters/TestRpc (29485 ms total)

[----------] 1 test from Parameters/TestRpcSocketTxRxQueue
[ RUN      ] Parameters/TestRpcSocketTxRxQueue.OverCapacity/0
W20260927 06:59:30.742976  5111 negotiation.cc:337] Failed RPC negotiation. Trace:
0927 06:59:30.480537 (+     0us) reactor.cc:625] Submitting negotiation task for client connection to 0.0.0.0:44287 (local address 127.0.0.1:59784)
0927 06:59:30.480596 (+    59us) negotiation.cc:107] Waiting for socket to connect
0927 06:59:30.480605 (+     9us) client_negotiation.cc:174] Beginning negotiation
0927 06:59:30.480649 (+    44us) client_negotiation.cc:252] Sending NEGOTIATE NegotiatePB request
0927 06:59:30.742777 (+262128us) negotiation.cc:327] Negotiation complete: Network error: Client connection negotiation failed: client connection to 0.0.0.0:44287: BlockingRecv error: recv error from unknown peer: Transport endpoint is not connected (error 107)
Metrics: {"client-negotiator.queue_time_us":36}
W20260927 06:59:30.743094  5129 negotiation.cc:337] Failed RPC negotiation. Trace:
0927 06:59:30.482463 (+     0us) reactor.cc:625] Submitting negotiation task for client connection to 0.0.0.0:44287 (local address 127.0.0.1:59808)
0927 06:59:30.482532 (+    69us) negotiation.cc:107] Waiting for socket to connect
0927 06:59:30.482541 (+     9us) client_negotiation.cc:174] Beginning negotiation
0927 06:59:30.482609 (+    68us) client_negotiation.cc:252] Sending NEGOTIATE NegotiatePB request
0927 06:59:30.743055 (+260446us) negotiation.cc:327] Negotiation complete: Network error: Client connection negotiation failed: client connection to 0.0.0.0:44287: BlockingRecv error: recv error from unknown peer: Transport endpoint is not connected (error 107)
Metrics: {"client-negotiator.queue_time_us":40}
W20260927 06:59:30.742986  5093 negotiation.cc:337] Failed RPC negotiation. Trace:
0927 06:59:30.478718 (+     0us) reactor.cc:625] Submitting negotiation task for client connection to 0.0.0.0:44287 (local address 127.0.0.1:59768)
0927 06:59:30.478792 (+    74us) negotiation.cc:107] Waiting for socket to connect
0927 06:59:30.478802 (+    10us) client_negotiation.cc:174] Beginning negotiation
0927 06:59:30.478893 (+    91us) client_negotiation.cc:252] Sending NEGOTIATE NegotiatePB request
0927 06:59:30.742778 (+263885us) negotiation.cc:327] Negotiation complete: Network error: Client connection negotiation failed: client connection to 0.0.0.0:44287: BlockingRecv error: recv error from unknown peer: Transport endpoint is not connected (error 107)
Metrics: {"client-negotiator.queue_time_us":43}
W20260927 06:59:30.742986  5102 negotiation.cc:337] Failed RPC negotiation. Trace:
0927 06:59:30.479714 (+     0us) reactor.cc:625] Submitting negotiation task for client connection to 0.0.0.0:44287 (local address 127.0.0.1:59774)
0927 06:59:30.479756 (+    42us) negotiation.cc:107] Waiting for socket to connect
0927 06:59:30.479766 (+    10us) client_negotiation.cc:174] Beginning negotiation
0927 06:59:30.479811 (+    45us) client_negotiation.cc:252] Sending NEGOTIATE NegotiatePB request
0927 06:59:30.742777 (+262966us) negotiation.cc:327] Negotiation complete: Network error: Client connection negotiation failed: client connection to 0.0.0.0:44287: BlockingRecv error: recv error from unknown peer: Transport endpoint is not connected (error 107)
Metrics: {"client-negotiator.queue_time_us":16}
W20260927 06:59:30.742976  5120 negotiation.cc:337] Failed RPC negotiation. Trace:
0927 06:59:30.481586 (+     0us) reactor.cc:625] Submitting negotiation task for client connection to 0.0.0.0:44287 (local address 127.0.0.1:59800)
0927 06:59:30.481650 (+    64us) negotiation.cc:107] Waiting for socket to connect
0927 06:59:30.481661 (+    11us) client_negotiation.cc:174] Beginning negotiation
0927 06:59:30.481710 (+    49us) client_negotiation.cc:252] Sending NEGOTIATE NegotiatePB request
0927 06:59:30.742797 (+261087us) negotiation.cc:327] Negotiation complete: Network error: Client connection negotiation failed: client connection to 0.0.0.0:44287: BlockingRecv error: recv error from unknown peer: Transport endpoint is not connected (error 107)
Metrics: {"client-negotiator.queue_time_us":36}
W20260927 06:59:30.743388  5138 negotiation.cc:337] Failed RPC negotiation. Trace:
0927 06:59:30.483328 (+     0us) reactor.cc:625] Submitting negotiation task for client connection to 0.0.0.0:44287 (local address 127.0.0.1:59812)
0927 06:59:30.483361 (+    33us) negotiation.cc:107] Waiting for socket to connect
0927 06:59:30.483369 (+     8us) client_negotiation.cc:174] Beginning negotiation
0927 06:59:30.483403 (+    34us) client_negotiation.cc:252] Sending NEGOTIATE NegotiatePB request
0927 06:59:30.743077 (+259674us) negotiation.cc:327] Negotiation complete: Network error: Client connection negotiation failed: client connection to 0.0.0.0:44287: BlockingRecv error: recv error from unknown peer: Transport endpoint is not connected (error 107)
Metrics: {"client-negotiator.queue_time_us":17}
[       OK ] Parameters/TestRpcSocketTxRxQueue.OverCapacity/0 (1040 ms)
[----------] 1 test from Parameters/TestRpcSocketTxRxQueue (1040 ms total)

[----------] Global test environment tear-down
[==========] 21 tests from 2 test suites ran. (30526 ms total)
[  PASSED  ] 20 tests.
[  FAILED  ] 1 test, listed below:
[  FAILED  ] Parameters/TestRpc.TestCallWithChainCertAndChainCA/SSL_TCP, where GetParam() = (true, false)

 1 FAILED TEST