Diagnosed failure
Parameters/TestRpc.TestCallWithChainCertAndChainCA/SSL_UnixSocket: /data0/somelongdirectorytoavoidrpathissues/src/kudu/src/kudu/rpc/rpc-test.cc:270: Failure
Failed
Bad status: Runtime error: could not verify certificate chain (error with cert: subject=CN = localhost, ST = sadfjas, C = AS, emailAddress = sdflkdsajf, O = lskdfjlsad, OU = sldfkja, issuer=C = AS, ST = ASDfkjdhf, L = lskdjf, O = saldfja, OU = skdjf, CN = localhost, emailAddress = sadjflkadsj): : certificate has expired
Google Test trace:
/data0/somelongdirectorytoavoidrpathissues/src/kudu/src/kudu/rpc/rpc-test.cc:267: Connecting to unix:/tmp/dist-test-taskLFhaxK/test-tmp/rpc-test-6ef9006b474d45c796c8ba61bc132204.sock
I20260926 22:05:15.628746 8226 test_util.cc:175] -----------------------------------------------
I20260926 22:05:15.628917 8226 test_util.cc:176] Had fatal failures, leaving test files at /tmp/dist-test-taskLFhaxK/test-tmp/rpc-test.6.Parameters_TestRpc.TestCallWithChainCertAndChainCA_SSL_UnixSocket.1790460314250180-8226-0
Full log
Note: This is test shard 7 of 8.
[==========] Running 21 tests from 2 test suites.
[----------] Global test environment set-up.
[----------] 20 tests from Parameters/TestRpc
[ RUN ] Parameters/TestRpc.TestMessengerCreateDestroy/SSL_UnixSocket
WARNING: Logging before InitGoogleLogging() is written to STDERR
I20260926 22:05:14.348913 8226 rpc-test.cc:169] started messenger TestCreateDestroy
[ OK ] Parameters/TestRpc.TestMessengerCreateDestroy/SSL_UnixSocket (1192 ms)
[ RUN ] Parameters/TestRpc.TestNegotiationDeadlock/SSL_UnixSocket
I20260926 22:05:15.518738 8248 acceptor_pool.cc:254] collecting diagnostics on the listening RPC socket unix:/tmp/dist-test-taskLFhaxK/test-tmp/rpc-test-0ae695c94aa3425f9bccd3f8c07c95ad.sock every 8 connection(s)
I20260926 22:05:15.520335 8249 acceptor_pool.cc:254] collecting diagnostics on the listening RPC socket unix:/tmp/dist-test-taskLFhaxK/test-tmp/rpc-test-0ae695c94aa3425f9bccd3f8c07c95ad.sock every 8 connection(s)
[ OK ] Parameters/TestRpc.TestNegotiationDeadlock/SSL_UnixSocket (76 ms)
[ RUN ] Parameters/TestRpc.TestCallWithChainCertAndChainCA/SSL_UnixSocket
I20260926 22:05:15.600061 8264 acceptor_pool.cc:254] collecting diagnostics on the listening RPC socket unix:/tmp/dist-test-taskLFhaxK/test-tmp/rpc-test-6ef9006b474d45c796c8ba61bc132204.sock every 8 connection(s)
I20260926 22:05:15.602232 8265 acceptor_pool.cc:254] collecting diagnostics on the listening RPC socket unix:/tmp/dist-test-taskLFhaxK/test-tmp/rpc-test-6ef9006b474d45c796c8ba61bc132204.sock every 8 connection(s)
/data0/somelongdirectorytoavoidrpathissues/src/kudu/src/kudu/rpc/rpc-test.cc:270: Failure
Failed
Bad status: Runtime error: could not verify certificate chain (error with cert: subject=CN = localhost, ST = sadfjas, C = AS, emailAddress = sdflkdsajf, O = lskdfjlsad, OU = sldfkja, issuer=C = AS, ST = ASDfkjdhf, L = lskdjf, O = saldfja, OU = skdjf, CN = localhost, emailAddress = sadjflkadsj): : certificate has expired
Google Test trace:
/data0/somelongdirectorytoavoidrpathissues/src/kudu/src/kudu/rpc/rpc-test.cc:267: Connecting to unix:/tmp/dist-test-taskLFhaxK/test-tmp/rpc-test-6ef9006b474d45c796c8ba61bc132204.sock
I20260926 22:05:15.628746 8226 test_util.cc:175] -----------------------------------------------
I20260926 22:05:15.628917 8226 test_util.cc:176] Had fatal failures, leaving test files at /tmp/dist-test-taskLFhaxK/test-tmp/rpc-test.6.Parameters_TestRpc.TestCallWithChainCertAndChainCA_SSL_UnixSocket.1790460314250180-8226-0
[ FAILED ] Parameters/TestRpc.TestCallWithChainCertAndChainCA/SSL_UnixSocket, where GetParam() = (true, true) (57 ms)
[ RUN ] Parameters/TestRpc.TestCallWithPasswordProtectedKey/SSL_UnixSocket
I20260926 22:05:15.649842 8289 acceptor_pool.cc:254] collecting diagnostics on the listening RPC socket unix:/tmp/dist-test-taskLFhaxK/test-tmp/rpc-test-435ffba247c04821a1354ffae3c1acc6.sock every 8 connection(s)
I20260926 22:05:15.650578 8290 acceptor_pool.cc:254] collecting diagnostics on the listening RPC socket unix:/tmp/dist-test-taskLFhaxK/test-tmp/rpc-test-435ffba247c04821a1354ffae3c1acc6.sock every 8 connection(s)
W20260926 22:05:15.692618 8286 connection.cc:196] Error closing socket: Network error: TlsSocket::Close: Broken pipe
[ OK ] Parameters/TestRpc.TestCallWithPasswordProtectedKey/SSL_UnixSocket (69 ms)
[ RUN ] Parameters/TestRpc.TestCallToBadServer/SSL_UnixSocket
I20260926 22:05:15.719175 8226 rpc-test.cc:394] Status: Network error: Client connection negotiation failed: client connection to 0.0.0.0:0: connect: Connection refused (error 111)
I20260926 22:05:15.720721 8226 rpc-test.cc:394] Status: Network error: Client connection negotiation failed: client connection to 0.0.0.0:0: connect: Connection refused (error 111)
I20260926 22:05:15.722010 8226 rpc-test.cc:394] Status: Network error: Client connection negotiation failed: client connection to 0.0.0.0:0: connect: Connection refused (error 111)
I20260926 22:05:15.723445 8226 rpc-test.cc:394] Status: Network error: Client connection negotiation failed: client connection to 0.0.0.0:0: connect: Connection refused (error 111)
I20260926 22:05:15.724714 8226 rpc-test.cc:394] Status: Network error: Client connection negotiation failed: client connection to 0.0.0.0:0: connect: Connection refused (error 111)
[ OK ] Parameters/TestRpc.TestCallToBadServer/SSL_UnixSocket (29 ms)
[ RUN ] Parameters/TestRpc.TestWrongService/SSL_UnixSocket
I20260926 22:05:15.769855 8324 acceptor_pool.cc:254] collecting diagnostics on the listening RPC socket unix:/tmp/dist-test-taskLFhaxK/test-tmp/rpc-test-249f0a4d80f342f58d81ca02881df5bf.sock every 8 connection(s)
I20260926 22:05:15.770722 8325 acceptor_pool.cc:254] collecting diagnostics on the listening RPC socket unix:/tmp/dist-test-taskLFhaxK/test-tmp/rpc-test-249f0a4d80f342f58d81ca02881df5bf.sock every 8 connection(s)
I20260926 22:05:15.801904 8321 messenger.cc:345] service WrongServiceName not registered on TestServer
[ OK ] Parameters/TestRpc.TestWrongService/SSL_UnixSocket (82 ms)
[ RUN ] Parameters/TestRpc.TestConnectionKeepalive/SSL_UnixSocket
I20260926 22:05:15.847715 8347 acceptor_pool.cc:254] collecting diagnostics on the listening RPC socket unix:/tmp/dist-test-taskLFhaxK/test-tmp/rpc-test-68ed22357de74f9bb3eb3fae84a0d3cb.sock every 8 connection(s)
I20260926 22:05:15.848460 8348 acceptor_pool.cc:254] collecting diagnostics on the listening RPC socket unix:/tmp/dist-test-taskLFhaxK/test-tmp/rpc-test-68ed22357de74f9bb3eb3fae84a0d3cb.sock every 8 connection(s)
I20260926 22:05:15.851720 8226 rpc-test.cc:488] Connecting to unix:/tmp/dist-test-taskLFhaxK/test-tmp/rpc-test-68ed22357de74f9bb3eb3fae84a0d3cb.sock
W20260926 22:05:16.313628 8360 connection.cc:196] Error closing socket: Network error: TlsSocket::Close: Broken pipe
[ OK ] Parameters/TestRpc.TestConnectionKeepalive/SSL_UnixSocket (1090 ms)
[ RUN ] Parameters/TestRpc.TestClientConnectionMetrics/SSL_UnixSocket
I20260926 22:05:16.936951 8372 acceptor_pool.cc:254] collecting diagnostics on the listening RPC socket unix:/tmp/dist-test-taskLFhaxK/test-tmp/rpc-test-d048820cf5bc4834ae2de5278f414dcf.sock every 8 connection(s)
I20260926 22:05:16.937676 8373 acceptor_pool.cc:254] collecting diagnostics on the listening RPC socket unix:/tmp/dist-test-taskLFhaxK/test-tmp/rpc-test-d048820cf5bc4834ae2de5278f414dcf.sock every 8 connection(s)
I20260926 22:05:16.941125 8226 rpc-test.cc:569] Connecting to unix:/tmp/dist-test-taskLFhaxK/test-tmp/rpc-test-d048820cf5bc4834ae2de5278f414dcf.sock
W20260926 22:07:33.359405 8369 connection.cc:196] Error closing socket: Network error: TlsSocket::Close: Broken pipe
[ OK ] Parameters/TestRpc.TestClientConnectionMetrics/SSL_UnixSocket (136466 ms)
[ RUN ] Parameters/TestRpc.TestCredentialsPolicy/SSL_UnixSocket
I20260926 22:07:33.387867 8408 acceptor_pool.cc:254] collecting diagnostics on the listening RPC socket unix:/tmp/dist-test-taskLFhaxK/test-tmp/rpc-test-f35ab3204c4546e4a942ab1688229b36.sock every 8 connection(s)
I20260926 22:07:33.388716 8409 acceptor_pool.cc:254] collecting diagnostics on the listening RPC socket unix:/tmp/dist-test-taskLFhaxK/test-tmp/rpc-test-f35ab3204c4546e4a942ab1688229b36.sock every 8 connection(s)
I20260926 22:07:33.391999 8226 rpc-test.cc:700] Connecting to unix:/tmp/dist-test-taskLFhaxK/test-tmp/rpc-test-f35ab3204c4546e4a942ab1688229b36.sock
W20260926 22:07:33.424446 8407 connection.cc:196] Error closing socket: Network error: TlsSocket::Close: Broken pipe
[ OK ] Parameters/TestRpc.TestCredentialsPolicy/SSL_UnixSocket (78 ms)
[ RUN ] Parameters/TestRpc.TestCallLongerThanKeepalive/SSL_UnixSocket
I20260926 22:07:33.497861 8433 acceptor_pool.cc:254] collecting diagnostics on the listening RPC socket unix:/tmp/dist-test-taskLFhaxK/test-tmp/rpc-test-004c3c5c5adf497385a7babda2d815af.sock every 8 connection(s)
I20260926 22:07:33.498467 8434 acceptor_pool.cc:254] collecting diagnostics on the listening RPC socket unix:/tmp/dist-test-taskLFhaxK/test-tmp/rpc-test-004c3c5c5adf497385a7babda2d815af.sock every 8 connection(s)
I20260926 22:07:33.524482 8437 rpc-test-base.h:222] got call: sleep_micros: 3000000 deferred: true
I20260926 22:07:36.529155 8437 rpcz_store.cc:275] Call kudu.rpc.GenericCalculatorService.Sleep from unix:<unnamed> (request call id 0) took 3004 ms. Trace:
I20260926 22:07:36.529649 8437 rpcz_store.cc:276] 0926 22:07:33.524276 (+ 0us) service_pool.cc:170] Inserting onto call queue
0926 22:07:33.524424 (+ 148us) service_pool.cc:227] Handling call
0926 22:07:36.528956 (+3004532us) inbound_call.cc:173] Queueing success response
Metrics: {}
W20260926 22:07:36.535336 8430 connection.cc:196] Error closing socket: Network error: TlsSocket::Close: Broken pipe
[ OK ] Parameters/TestRpc.TestCallLongerThanKeepalive/SSL_UnixSocket (3098 ms)
[ RUN ] Parameters/TestRpc.TestRpcSidecar/SSL_UnixSocket
I20260926 22:07:36.577483 8459 acceptor_pool.cc:254] collecting diagnostics on the listening RPC socket unix:/tmp/dist-test-taskLFhaxK/test-tmp/rpc-test-81100c9d8854491cbff79ba426415506.sock every 8 connection(s)
I20260926 22:07:36.578365 8460 acceptor_pool.cc:254] collecting diagnostics on the listening RPC socket unix:/tmp/dist-test-taskLFhaxK/test-tmp/rpc-test-81100c9d8854491cbff79ba426415506.sock every 8 connection(s)
W20260926 22:07:37.069733 8456 connection.cc:196] Error closing socket: Network error: TlsSocket::Close: Broken pipe
[ OK ] Parameters/TestRpc.TestRpcSidecar/SSL_UnixSocket (529 ms)
[ RUN ] Parameters/TestRpc.TestRpcSidecarLimits/SSL_UnixSocket
I20260926 22:07:55.215112 8486 acceptor_pool.cc:254] collecting diagnostics on the listening RPC socket unix:/tmp/dist-test-taskLFhaxK/test-tmp/rpc-test-ee4b818182b945ee817383a0803d61d9.sock every 8 connection(s)
I20260926 22:07:55.215564 8487 acceptor_pool.cc:254] collecting diagnostics on the listening RPC socket unix:/tmp/dist-test-taskLFhaxK/test-tmp/rpc-test-ee4b818182b945ee817383a0803d61d9.sock every 8 connection(s)
W20260926 22:07:55.250794 8226 serialization.cc:72] Serialized kudu.rpc_test.PushStringsRequestPB (2147483654 bytes) is larger than the maximum configured RPC message size (52428800 bytes). Sending anyway, but peer may reject the data.
W20260926 22:07:55.262022 8483 connection.cc:535] server connection from unix:<unnamed> recv error: Network error: RPC frame had a length of 2147483714, but we only support messages up to 52428800 bytes long.
W20260926 22:07:55.262480 8483 connection.cc:158] shutting down server connection from unix:<unnamed> with pending inbound data: 4/2147483714 bytes received; last active 0 ns ago: status Network error: RPC frame had a length of 2147483714, but we only support messages up to 52428800 bytes long.
W20260926 22:07:55.263581 8499 connection.cc:698] client connection to unix:/tmp/dist-test-taskLFhaxK/test-tmp/rpc-test-ee4b818182b945ee817383a0803d61d9.sock send error: Network error: failed to write to TLS socket: Broken pipe
W20260926 22:07:55.264243 8499 connection.cc:196] Error closing socket: Network error: TlsSocket::Close: Success
[ OK ] Parameters/TestRpc.TestRpcSidecarLimits/SSL_UnixSocket (18809 ms)
[ RUN ] Parameters/TestRpc.TestCallTimeoutDoesntAffectNegotiation/SSL_UnixSocket
I20260926 22:07:55.909063 8511 acceptor_pool.cc:254] collecting diagnostics on the listening RPC socket unix:/tmp/dist-test-taskLFhaxK/test-tmp/rpc-test-e847721ac39749d08d1ad02ca3abafbe.sock every 8 connection(s)
I20260926 22:07:55.909744 8512 acceptor_pool.cc:254] collecting diagnostics on the listening RPC socket unix:/tmp/dist-test-taskLFhaxK/test-tmp/rpc-test-e847721ac39749d08d1ad02ca3abafbe.sock every 8 connection(s)
W20260926 22:07:55.937083 8507 negotiation.cc:266] Injecting 500ms delay in negotiation
I20260926 22:07:55.986680 8226 rpc-test-base.h:595] status: Timed out: connection negotiation to unix:/tmp/dist-test-taskLFhaxK/test-tmp/rpc-test-e847721ac39749d08d1ad02ca3abafbe.sock for RPC Sleep timed out after 0.050s (ON_OUTBOUND_QUEUE), seconds elapsed: 0.0506315
W20260926 22:07:56.450121 8508 connection.cc:196] Error closing socket: Network error: TlsSocket::Close: Broken pipe
[ OK ] Parameters/TestRpc.TestCallTimeoutDoesntAffectNegotiation/SSL_UnixSocket (569 ms)
[ RUN ] Parameters/TestRpc.TestRpcHandlerLatencyMetric/SSL_UnixSocket
I20260926 22:07:56.481495 8536 acceptor_pool.cc:254] collecting diagnostics on the listening RPC socket unix:/tmp/dist-test-taskLFhaxK/test-tmp/rpc-test-3790fd9b30e54bbf8a2b498a9f647c25.sock every 8 connection(s)
I20260926 22:07:56.482241 8537 acceptor_pool.cc:254] collecting diagnostics on the listening RPC socket unix:/tmp/dist-test-taskLFhaxK/test-tmp/rpc-test-3790fd9b30e54bbf8a2b498a9f647c25.sock every 8 connection(s)
I20260926 22:07:56.554472 8226 rpc-test.cc:1236] Sleep() min lat: 22006
I20260926 22:07:56.554672 8226 rpc-test.cc:1237] Sleep() mean lat: 22006
I20260926 22:07:56.554808 8226 rpc-test.cc:1238] Sleep() max lat: 22006
I20260926 22:07:56.554929 8226 rpc-test.cc:1239] Sleep() #calls: 1
[ OK ] Parameters/TestRpc.TestRpcHandlerLatencyMetric/SSL_UnixSocket (107 ms)
[ RUN ] Parameters/TestRpc.TimedOutOnResponseMetricServiceQueue/SSL_UnixSocket
I20260926 22:07:56.582608 8562 acceptor_pool.cc:254] collecting diagnostics on the listening RPC socket unix:/tmp/dist-test-taskLFhaxK/test-tmp/rpc-test-3788378fa66342d8a263c6d1b780cad1.sock every 8 connection(s)
I20260926 22:07:56.583374 8563 acceptor_pool.cc:254] collecting diagnostics on the listening RPC socket unix:/tmp/dist-test-taskLFhaxK/test-tmp/rpc-test-3788378fa66342d8a263c6d1b780cad1.sock every 8 connection(s)
W20260926 22:07:56.680574 8564 rpcz_store.cc:267] Call kudu.rpc_test.CalculatorService.Sleep from unix:<unnamed> (request call id 2) took 20 ms (client timeout 20 ms). Trace:
W20260926 22:07:56.680923 8564 rpcz_store.cc:269] 0926 22:07:56.659948 (+ 0us) service_pool.cc:170] Inserting onto call queue
0926 22:07:56.680374 (+ 20426us) service_pool.cc:214] Skipping call since client already timed out
0926 22:07:56.680513 (+ 139us) inbound_call.cc:173] Queueing failure response
Metrics: {}
[ OK ] Parameters/TestRpc.TimedOutOnResponseMetricServiceQueue/SSL_UnixSocket (126 ms)
[ RUN ] Parameters/TestRpc.RpcPendingConnectionsMetric/SSL_UnixSocket
I20260926 22:07:56.698423 8585 acceptor_pool.cc:254] collecting diagnostics on the listening RPC socket 0.0.0.0:43845 every 8 connection(s)
I20260926 22:07:56.699239 8586 acceptor_pool.cc:254] collecting diagnostics on the listening RPC socket 0.0.0.0:43845 every 8 connection(s)
W20260926 22:07:56.704478 8581 negotiation.cc:337] Failed RPC negotiation. Trace:
0926 22:07:56.703335 (+ 0us) reactor.cc:625] Submitting negotiation task for server connection from 127.0.0.1:59458 (local address 127.0.0.1:43845)
0926 22:07:56.703696 (+ 361us) server_negotiation.cc:206] Beginning negotiation
0926 22:07:56.703713 (+ 17us) server_negotiation.cc:399] Waiting for connection header
0926 22:07:56.703944 (+ 231us) negotiation.cc:327] Negotiation complete: Network error: Server connection negotiation failed: server connection from 127.0.0.1:59458: BlockingRecv error: recv got EOF from 127.0.0.1:59458 (error 108)
Metrics: {"server-negotiator.queue_time_us":89}
[ OK ] Parameters/TestRpc.RpcPendingConnectionsMetric/SSL_UnixSocket (29 ms)
[ RUN ] Parameters/TestRpc.TestRpcContextClientDeadline/SSL_UnixSocket
I20260926 22:07:56.738662 8601 acceptor_pool.cc:254] collecting diagnostics on the listening RPC socket unix:/tmp/dist-test-taskLFhaxK/test-tmp/rpc-test-e9636b1d9fd640acb02e2d690698b52b.sock every 8 connection(s)
I20260926 22:07:56.739430 8602 acceptor_pool.cc:254] collecting diagnostics on the listening RPC socket unix:/tmp/dist-test-taskLFhaxK/test-tmp/rpc-test-e9636b1d9fd640acb02e2d690698b52b.sock every 8 connection(s)
[ OK ] Parameters/TestRpc.TestRpcContextClientDeadline/SSL_UnixSocket (83 ms)
[ RUN ] Parameters/TestRpc.TestApplicationFeatureFlagUnsupportedServer/SSL_UnixSocket
I20260926 22:07:56.827513 8626 acceptor_pool.cc:254] collecting diagnostics on the listening RPC socket unix:/tmp/dist-test-taskLFhaxK/test-tmp/rpc-test-336d8f6918b442ffaad61a9a7b31988d.sock every 8 connection(s)
I20260926 22:07:56.828328 8627 acceptor_pool.cc:254] collecting diagnostics on the listening RPC socket unix:/tmp/dist-test-taskLFhaxK/test-tmp/rpc-test-336d8f6918b442ffaad61a9a7b31988d.sock every 8 connection(s)
[ OK ] Parameters/TestRpc.TestApplicationFeatureFlagUnsupportedServer/SSL_UnixSocket (68 ms)
[ RUN ] Parameters/TestRpc.TestCancellationAsync/SSL_UnixSocket
I20260926 22:07:56.894735 8651 acceptor_pool.cc:254] collecting diagnostics on the listening RPC socket unix:/tmp/dist-test-taskLFhaxK/test-tmp/rpc-test-bcef730f6c5a4170a545f15ae7826a2d.sock every 8 connection(s)
I20260926 22:07:56.895500 8652 acceptor_pool.cc:254] collecting diagnostics on the listening RPC socket unix:/tmp/dist-test-taskLFhaxK/test-tmp/rpc-test-bcef730f6c5a4170a545f15ae7826a2d.sock every 8 connection(s)
I20260926 22:07:56.898767 8226 rpc-test.cc:1716] Connecting to unix:/tmp/dist-test-taskLFhaxK/test-tmp/rpc-test-bcef730f6c5a4170a545f15ae7826a2d.sock
I20260926 22:07:56.918885 8226 test_util.cc:268] Using random seed: 280366160
I20260926 22:07:57.142807 8655 rpc-test-base.h:240] got call: sleep_micros: 500 pattern: 4294967295 num_repetitions: 2097152 sidecar_idx: 0
I20260926 22:07:57.365597 8655 rpc-test-base.h:240] got call: sleep_micros: 500 pattern: 4294967295 num_repetitions: 2097152 sidecar_idx: 0
I20260926 22:07:57.565653 8654 rpc-test-base.h:240] got call: sleep_micros: 500 pattern: 4294967295 num_repetitions: 2097152 sidecar_idx: 0
I20260926 22:07:57.779073 8655 rpc-test-base.h:240] got call: sleep_micros: 500 pattern: 4294967295 num_repetitions: 2097152 sidecar_idx: 0
I20260926 22:07:57.999682 8655 rpc-test-base.h:240] got call: sleep_micros: 500 pattern: 4294967295 num_repetitions: 2097152 sidecar_idx: 0
I20260926 22:07:58.223392 8655 rpc-test-base.h:240] got call: sleep_micros: 500 pattern: 4294967295 num_repetitions: 2097152 sidecar_idx: 0
I20260926 22:07:58.428418 8655 rpc-test-base.h:240] got call: sleep_micros: 500 pattern: 4294967295 num_repetitions: 2097152 sidecar_idx: 0
I20260926 22:07:58.628592 8654 rpc-test-base.h:240] got call: sleep_micros: 500 pattern: 4294967295 num_repetitions: 2097152 sidecar_idx: 0
I20260926 22:07:58.826828 8655 rpc-test-base.h:240] got call: sleep_micros: 500 pattern: 4294967295 num_repetitions: 2097152 sidecar_idx: 0
W20260926 22:07:58.850979 8648 connection.cc:196] Error closing socket: Network error: TlsSocket::Close: Broken pipe
W20260926 22:07:58.873564 8648 connection.cc:441] server connection from unix:<unnamed> torn down before Call kudu.rpc.GenericCalculatorService.SleepWithSidecar from unix:<unnamed> (request call id 8) could send its response
W20260926 22:07:58.964998 8648 connection.cc:441] server connection from unix:<unnamed> torn down before Call kudu.rpc.GenericCalculatorService.SleepWithSidecar from unix:<unnamed> (request call id 9) could send its response
[ OK ] Parameters/TestRpc.TestCancellationAsync/SSL_UnixSocket (2104 ms)
[ RUN ] Parameters/TestRpc.TestPerformanceBySocketType/SSL_UnixSocket
I20260926 22:07:59.065860 8676 acceptor_pool.cc:254] collecting diagnostics on the listening RPC socket unix:/tmp/dist-test-taskLFhaxK/test-tmp/rpc-test-893945fd5046412881e1806242489e95.sock every 8 connection(s)
I20260926 22:07:59.066642 8677 acceptor_pool.cc:254] collecting diagnostics on the listening RPC socket unix:/tmp/dist-test-taskLFhaxK/test-tmp/rpc-test-893945fd5046412881e1806242489e95.sock every 8 connection(s)
I20260926 22:07:59.069757 8226 rpc-test.cc:1846] Connecting to unix:/tmp/dist-test-taskLFhaxK/test-tmp/rpc-test-893945fd5046412881e1806242489e95.sock
I20260926 22:08:20.567791 8226 rpc-test.cc:1859] Sending 1024MB via ssl-enabled unix socket: real 21.487s user 19.297s sys 12.881s
I20260926 22:08:41.972853 8226 rpc-test.cc:1859] Sending 1024MB via ssl-enabled unix socket: real 21.405s user 19.052s sys 12.939s
I20260926 22:09:03.472896 8226 rpc-test.cc:1859] Sending 1024MB via ssl-enabled unix socket: real 21.499s user 19.325s sys 12.861s
I20260926 22:09:25.046257 8226 rpc-test.cc:1859] Sending 1024MB via ssl-enabled unix socket: real 21.573s user 19.332s sys 13.010s
I20260926 22:09:46.398538 8226 rpc-test.cc:1859] Sending 1024MB via ssl-enabled unix socket: real 21.352s user 19.168s sys 12.826s
[ OK ] Parameters/TestRpc.TestPerformanceBySocketType/SSL_UnixSocket (107441 ms)
[----------] 20 tests from Parameters/TestRpc (272114 ms total)
[----------] 1 test from Parameters/TestRpcSocketTxRxQueue
[ RUN ] Parameters/TestRpcSocketTxRxQueue.AcceptorRxQueueSizeMetric/0
I20260926 22:09:46.427666 8712 acceptor_pool.cc:254] collecting diagnostics on the listening RPC socket 0.0.0.0:34567 every 1 connection(s)
I20260926 22:09:46.428498 8713 acceptor_pool.cc:254] collecting diagnostics on the listening RPC socket 0.0.0.0:34567 every 1 connection(s)
W20260926 22:09:46.434017 8708 negotiation.cc:337] Failed RPC negotiation. Trace:
0926 22:09:46.432528 (+ 0us) reactor.cc:625] Submitting negotiation task for server connection from 127.0.0.1:56866 (local address 127.0.0.1:34567)
0926 22:09:46.433109 (+ 581us) server_negotiation.cc:206] Beginning negotiation
0926 22:09:46.433138 (+ 29us) server_negotiation.cc:399] Waiting for connection header
0926 22:09:46.433394 (+ 256us) negotiation.cc:327] Negotiation complete: Network error: Server connection negotiation failed: server connection from 127.0.0.1:56866: BlockingRecv error: recv got EOF from 127.0.0.1:56866 (error 108)
Metrics: {"server-negotiator.queue_time_us":144}
[ OK ] Parameters/TestRpcSocketTxRxQueue.AcceptorRxQueueSizeMetric/0 (22 ms)
[----------] 1 test from Parameters/TestRpcSocketTxRxQueue (22 ms total)
[----------] Global test environment tear-down
[==========] 21 tests from 2 test suites ran. (272137 ms total)
[ PASSED ] 20 tests.
[ FAILED ] 1 test, listed below:
[ FAILED ] Parameters/TestRpc.TestCallWithChainCertAndChainCA/SSL_UnixSocket, where GetParam() = (true, true)
1 FAILED TEST