Diagnosed failure
Parameters/TestRpc.TestCallWithChainCertAndChainCA/SSL_UnixSocket: /data0/somelongdirectorytoavoidrpathissues/src/kudu/src/kudu/rpc/rpc-test.cc:270: Failure
Failed
Bad status: Runtime error: could not verify certificate chain (error with cert: subject=CN = localhost, ST = sadfjas, C = AS, emailAddress = sdflkdsajf, O = lskdfjlsad, OU = sldfkja, issuer=C = AS, ST = ASDfkjdhf, L = lskdjf, O = saldfja, OU = skdjf, CN = localhost, emailAddress = sadjflkadsj): : certificate has expired
Google Test trace:
/data0/somelongdirectorytoavoidrpathissues/src/kudu/src/kudu/rpc/rpc-test.cc:267: Connecting to unix:/tmp/dist-test-taskrzARaL/test-tmp/rpc-test-ef7d8f37d80540bca511286388314f2d.sock
I20260926 04:01:18.404991 22163 test_util.cc:175] -----------------------------------------------
I20260926 04:01:18.405038 22163 test_util.cc:176] Had fatal failures, leaving test files at /tmp/dist-test-taskrzARaL/test-tmp/rpc-test.6.Parameters_TestRpc.TestCallWithChainCertAndChainCA_SSL_UnixSocket.1790395278348288-22163-0
Full log
Note: This is test shard 7 of 8.
[==========] Running 21 tests from 2 test suites.
[----------] Global test environment set-up.
[----------] 20 tests from Parameters/TestRpc
[ RUN ] Parameters/TestRpc.TestMessengerCreateDestroy/SSL_UnixSocket
WARNING: Logging before InitGoogleLogging() is written to STDERR
I20260926 04:01:18.367081 22163 rpc-test.cc:169] started messenger TestCreateDestroy
[ OK ] Parameters/TestRpc.TestMessengerCreateDestroy/SSL_UnixSocket (17 ms)
[ RUN ] Parameters/TestRpc.TestNegotiationDeadlock/SSL_UnixSocket
I20260926 04:01:18.378744 22184 acceptor_pool.cc:254] collecting diagnostics on the listening RPC socket unix:/tmp/dist-test-taskrzARaL/test-tmp/rpc-test-9d56b1fa30d74f169cd15b0d2a9a1ed9.sock every 8 connection(s)
I20260926 04:01:18.378753 22183 acceptor_pool.cc:254] collecting diagnostics on the listening RPC socket unix:/tmp/dist-test-taskrzARaL/test-tmp/rpc-test-9d56b1fa30d74f169cd15b0d2a9a1ed9.sock every 8 connection(s)
[ OK ] Parameters/TestRpc.TestNegotiationDeadlock/SSL_UnixSocket (18 ms)
[ RUN ] Parameters/TestRpc.TestCallWithChainCertAndChainCA/SSL_UnixSocket
I20260926 04:01:18.400683 22199 acceptor_pool.cc:254] collecting diagnostics on the listening RPC socket unix:/tmp/dist-test-taskrzARaL/test-tmp/rpc-test-ef7d8f37d80540bca511286388314f2d.sock every 8 connection(s)
I20260926 04:01:18.400712 22200 acceptor_pool.cc:254] collecting diagnostics on the listening RPC socket unix:/tmp/dist-test-taskrzARaL/test-tmp/rpc-test-ef7d8f37d80540bca511286388314f2d.sock every 8 connection(s)
/data0/somelongdirectorytoavoidrpathissues/src/kudu/src/kudu/rpc/rpc-test.cc:270: Failure
Failed
Bad status: Runtime error: could not verify certificate chain (error with cert: subject=CN = localhost, ST = sadfjas, C = AS, emailAddress = sdflkdsajf, O = lskdfjlsad, OU = sldfkja, issuer=C = AS, ST = ASDfkjdhf, L = lskdjf, O = saldfja, OU = skdjf, CN = localhost, emailAddress = sadjflkadsj): : certificate has expired
Google Test trace:
/data0/somelongdirectorytoavoidrpathissues/src/kudu/src/kudu/rpc/rpc-test.cc:267: Connecting to unix:/tmp/dist-test-taskrzARaL/test-tmp/rpc-test-ef7d8f37d80540bca511286388314f2d.sock
I20260926 04:01:18.404991 22163 test_util.cc:175] -----------------------------------------------
I20260926 04:01:18.405038 22163 test_util.cc:176] Had fatal failures, leaving test files at /tmp/dist-test-taskrzARaL/test-tmp/rpc-test.6.Parameters_TestRpc.TestCallWithChainCertAndChainCA_SSL_UnixSocket.1790395278348288-22163-0
[ FAILED ] Parameters/TestRpc.TestCallWithChainCertAndChainCA/SSL_UnixSocket, where GetParam() = (true, true) (18 ms)
[ RUN ] Parameters/TestRpc.TestCallWithPasswordProtectedKey/SSL_UnixSocket
I20260926 04:01:18.414516 22224 acceptor_pool.cc:254] collecting diagnostics on the listening RPC socket unix:/tmp/dist-test-taskrzARaL/test-tmp/rpc-test-b00b7d212cf84627b6d2bc76a10e2b92.sock every 8 connection(s)
I20260926 04:01:18.414541 22225 acceptor_pool.cc:254] collecting diagnostics on the listening RPC socket unix:/tmp/dist-test-taskrzARaL/test-tmp/rpc-test-b00b7d212cf84627b6d2bc76a10e2b92.sock every 8 connection(s)
W20260926 04:01:18.425911 22221 connection.cc:196] Error closing socket: Network error: TlsSocket::Close: Broken pipe
[ OK ] Parameters/TestRpc.TestCallWithPasswordProtectedKey/SSL_UnixSocket (22 ms)
[ RUN ] Parameters/TestRpc.TestCallToBadServer/SSL_UnixSocket
I20260926 04:01:18.444392 22163 rpc-test.cc:394] Status: Network error: Client connection negotiation failed: client connection to 0.0.0.0:0: connect: Connection refused (error 111)
I20260926 04:01:18.444747 22163 rpc-test.cc:394] Status: Network error: Client connection negotiation failed: client connection to 0.0.0.0:0: connect: Connection refused (error 111)
I20260926 04:01:18.445004 22163 rpc-test.cc:394] Status: Network error: Client connection negotiation failed: client connection to 0.0.0.0:0: connect: Connection refused (error 111)
I20260926 04:01:18.445222 22163 rpc-test.cc:394] Status: Network error: Client connection negotiation failed: client connection to 0.0.0.0:0: connect: Connection refused (error 111)
I20260926 04:01:18.445405 22163 rpc-test.cc:394] Status: Network error: Client connection negotiation failed: client connection to 0.0.0.0:0: connect: Connection refused (error 111)
[ OK ] Parameters/TestRpc.TestCallToBadServer/SSL_UnixSocket (18 ms)
[ RUN ] Parameters/TestRpc.TestWrongService/SSL_UnixSocket
I20260926 04:01:18.459327 22260 acceptor_pool.cc:254] collecting diagnostics on the listening RPC socket unix:/tmp/dist-test-taskrzARaL/test-tmp/rpc-test-2d825f19b2cc43dc835f42cf8da23626.sock every 8 connection(s)
I20260926 04:01:18.459327 22259 acceptor_pool.cc:254] collecting diagnostics on the listening RPC socket unix:/tmp/dist-test-taskrzARaL/test-tmp/rpc-test-2d825f19b2cc43dc835f42cf8da23626.sock every 8 connection(s)
I20260926 04:01:18.470929 22256 messenger.cc:345] service WrongServiceName not registered on TestServer
[ OK ] Parameters/TestRpc.TestWrongService/SSL_UnixSocket (26 ms)
[ RUN ] Parameters/TestRpc.TestConnectionKeepalive/SSL_UnixSocket
I20260926 04:01:18.482599 22282 acceptor_pool.cc:254] collecting diagnostics on the listening RPC socket unix:/tmp/dist-test-taskrzARaL/test-tmp/rpc-test-ded0e42ad3cc4cfab151caa41eb480d1.sock every 8 connection(s)
I20260926 04:01:18.482681 22283 acceptor_pool.cc:254] collecting diagnostics on the listening RPC socket unix:/tmp/dist-test-taskrzARaL/test-tmp/rpc-test-ded0e42ad3cc4cfab151caa41eb480d1.sock every 8 connection(s)
I20260926 04:01:18.482867 22163 rpc-test.cc:488] Connecting to unix:/tmp/dist-test-taskrzARaL/test-tmp/rpc-test-ded0e42ad3cc4cfab151caa41eb480d1.sock
W20260926 04:01:18.974329 22295 connection.cc:196] Error closing socket: Network error: TlsSocket::Close: Broken pipe
[ OK ] Parameters/TestRpc.TestConnectionKeepalive/SSL_UnixSocket (1040 ms)
[ RUN ] Parameters/TestRpc.TestClientConnectionMetrics/SSL_UnixSocket
I20260926 04:01:19.540957 22307 acceptor_pool.cc:254] collecting diagnostics on the listening RPC socket unix:/tmp/dist-test-taskrzARaL/test-tmp/rpc-test-2a3561f8f4a64ebbb7c6eb769f8333a3.sock every 8 connection(s)
I20260926 04:01:19.541002 22308 acceptor_pool.cc:254] collecting diagnostics on the listening RPC socket unix:/tmp/dist-test-taskrzARaL/test-tmp/rpc-test-2a3561f8f4a64ebbb7c6eb769f8333a3.sock every 8 connection(s)
I20260926 04:01:19.541181 22163 rpc-test.cc:569] Connecting to unix:/tmp/dist-test-taskrzARaL/test-tmp/rpc-test-2a3561f8f4a64ebbb7c6eb769f8333a3.sock
W20260926 04:01:27.890918 22304 connection.cc:196] Error closing socket: Network error: TlsSocket::Close: Broken pipe
[ OK ] Parameters/TestRpc.TestClientConnectionMetrics/SSL_UnixSocket (8379 ms)
[ RUN ] Parameters/TestRpc.TestCredentialsPolicy/SSL_UnixSocket
I20260926 04:01:27.906330 22330 acceptor_pool.cc:254] collecting diagnostics on the listening RPC socket unix:/tmp/dist-test-taskrzARaL/test-tmp/rpc-test-435b5fb65d274934bbaa53d7a9e9f2fd.sock every 8 connection(s)
I20260926 04:01:27.906364 22331 acceptor_pool.cc:254] collecting diagnostics on the listening RPC socket unix:/tmp/dist-test-taskrzARaL/test-tmp/rpc-test-435b5fb65d274934bbaa53d7a9e9f2fd.sock every 8 connection(s)
I20260926 04:01:27.906621 22163 rpc-test.cc:700] Connecting to unix:/tmp/dist-test-taskrzARaL/test-tmp/rpc-test-435b5fb65d274934bbaa53d7a9e9f2fd.sock
W20260926 04:01:27.919245 22329 connection.cc:196] Error closing socket: Network error: TlsSocket::Close: Broken pipe
[ OK ] Parameters/TestRpc.TestCredentialsPolicy/SSL_UnixSocket (31 ms)
[ RUN ] Parameters/TestRpc.TestCallLongerThanKeepalive/SSL_UnixSocket
I20260926 04:01:27.935123 22355 acceptor_pool.cc:254] collecting diagnostics on the listening RPC socket unix:/tmp/dist-test-taskrzARaL/test-tmp/rpc-test-3b087a2b13024ddf8bd671041b5bf4a7.sock every 8 connection(s)
I20260926 04:01:27.935174 22356 acceptor_pool.cc:254] collecting diagnostics on the listening RPC socket unix:/tmp/dist-test-taskrzARaL/test-tmp/rpc-test-3b087a2b13024ddf8bd671041b5bf4a7.sock every 8 connection(s)
I20260926 04:01:27.950309 22359 rpc-test-base.h:222] got call: sleep_micros: 3000000 deferred: true
I20260926 04:01:30.950955 22359 rpcz_store.cc:275] Call kudu.rpc.GenericCalculatorService.Sleep from unix:<unnamed> (request call id 0) took 3000 ms. Trace:
I20260926 04:01:30.951047 22359 rpcz_store.cc:276] 0926 04:01:27.950257 (+ 0us) service_pool.cc:170] Inserting onto call queue
0926 04:01:27.950296 (+ 39us) service_pool.cc:227] Handling call
0926 04:01:30.950940 (+3000644us) inbound_call.cc:173] Queueing success response
Metrics: {}
[ OK ] Parameters/TestRpc.TestCallLongerThanKeepalive/SSL_UnixSocket (3029 ms)
[ RUN ] Parameters/TestRpc.TestRpcSidecar/SSL_UnixSocket
I20260926 04:01:30.968055 22381 acceptor_pool.cc:254] collecting diagnostics on the listening RPC socket unix:/tmp/dist-test-taskrzARaL/test-tmp/rpc-test-ea34eaa52895427892150e417ea3fa78.sock every 8 connection(s)
I20260926 04:01:30.968089 22380 acceptor_pool.cc:254] collecting diagnostics on the listening RPC socket unix:/tmp/dist-test-taskrzARaL/test-tmp/rpc-test-ea34eaa52895427892150e417ea3fa78.sock every 8 connection(s)
W20260926 04:01:31.017120 22377 connection.cc:196] Error closing socket: Network error: TlsSocket::Close: Broken pipe
[ OK ] Parameters/TestRpc.TestRpcSidecar/SSL_UnixSocket (64 ms)
[ RUN ] Parameters/TestRpc.TestRpcSidecarLimits/SSL_UnixSocket
I20260926 04:01:32.586227 22406 acceptor_pool.cc:254] collecting diagnostics on the listening RPC socket unix:/tmp/dist-test-taskrzARaL/test-tmp/rpc-test-61fefdcf6e6e4447a5304f95ecec88fa.sock every 8 connection(s)
I20260926 04:01:32.586247 22405 acceptor_pool.cc:254] collecting diagnostics on the listening RPC socket unix:/tmp/dist-test-taskrzARaL/test-tmp/rpc-test-61fefdcf6e6e4447a5304f95ecec88fa.sock every 8 connection(s)
W20260926 04:01:32.606110 22163 serialization.cc:72] Serialized kudu.rpc_test.PushStringsRequestPB (2147483654 bytes) is larger than the maximum configured RPC message size (52428800 bytes). Sending anyway, but peer may reject the data.
W20260926 04:01:32.608956 22402 connection.cc:535] server connection from unix:<unnamed> recv error: Network error: RPC frame had a length of 2147483714, but we only support messages up to 52428800 bytes long.
W20260926 04:01:32.609017 22402 connection.cc:158] shutting down server connection from unix:<unnamed> with pending inbound data: 4/2147483714 bytes received; last active 0 ns ago: status Network error: RPC frame had a length of 2147483714, but we only support messages up to 52428800 bytes long.
W20260926 04:01:32.609172 22418 connection.cc:196] Error closing socket: Network error: TlsSocket::Close: Broken pipe
I20260926 04:01:32.621235 22431 acceptor_pool.cc:254] collecting diagnostics on the listening RPC socket unix:/tmp/dist-test-taskrzARaL/test-tmp/rpc-test-61fefdcf6e6e4447a5304f95ecec88fa.sock every 8 connection(s)
I20260926 04:01:32.621292 22430 acceptor_pool.cc:254] collecting diagnostics on the listening RPC socket unix:/tmp/dist-test-taskrzARaL/test-tmp/rpc-test-61fefdcf6e6e4447a5304f95ecec88fa.sock every 8 connection(s)
W20260926 04:01:36.691215 22427 connection.cc:577] server connection from unix:<unnamed>: received bad data: 'Corruption: Invalid packet: message had a length of 2147483710, but we only support messages up to 2147483647 bytes
'
W20260926 04:01:36.691578 22443 connection.cc:196] Error closing socket: Network error: TlsSocket::Close: Broken pipe
[ OK ] Parameters/TestRpc.TestRpcSidecarLimits/SSL_UnixSocket (5675 ms)
[ RUN ] Parameters/TestRpc.TestCallTimeoutDoesntAffectNegotiation/SSL_UnixSocket
I20260926 04:01:36.723544 22455 acceptor_pool.cc:254] collecting diagnostics on the listening RPC socket unix:/tmp/dist-test-taskrzARaL/test-tmp/rpc-test-07b4c95946804328aa969d5cf9592bd5.sock every 8 connection(s)
I20260926 04:01:36.723610 22456 acceptor_pool.cc:254] collecting diagnostics on the listening RPC socket unix:/tmp/dist-test-taskrzARaL/test-tmp/rpc-test-07b4c95946804328aa969d5cf9592bd5.sock every 8 connection(s)
W20260926 04:01:36.741575 22451 negotiation.cc:266] Injecting 500ms delay in negotiation
I20260926 04:01:36.791842 22163 rpc-test-base.h:595] status: Timed out: connection negotiation to unix:/tmp/dist-test-taskrzARaL/test-tmp/rpc-test-07b4c95946804328aa969d5cf9592bd5.sock for RPC Sleep timed out after 0.050s (ON_OUTBOUND_QUEUE), seconds elapsed: 0.0506473
W20260926 04:01:37.245316 22452 connection.cc:196] Error closing socket: Network error: TlsSocket::Close: Broken pipe
[ OK ] Parameters/TestRpc.TestCallTimeoutDoesntAffectNegotiation/SSL_UnixSocket (552 ms)
[ RUN ] Parameters/TestRpc.TestRpcHandlerLatencyMetric/SSL_UnixSocket
I20260926 04:01:37.274071 22480 acceptor_pool.cc:254] collecting diagnostics on the listening RPC socket unix:/tmp/dist-test-taskrzARaL/test-tmp/rpc-test-92a56239f1224599b35aed16f14971f1.sock every 8 connection(s)
I20260926 04:01:37.274096 22481 acceptor_pool.cc:254] collecting diagnostics on the listening RPC socket unix:/tmp/dist-test-taskrzARaL/test-tmp/rpc-test-92a56239f1224599b35aed16f14971f1.sock every 8 connection(s)
I20260926 04:01:37.306097 22163 rpc-test.cc:1236] Sleep() min lat: 20304
I20260926 04:01:37.306155 22163 rpc-test.cc:1237] Sleep() mean lat: 20304
I20260926 04:01:37.306180 22163 rpc-test.cc:1238] Sleep() max lat: 20304
I20260926 04:01:37.306193 22163 rpc-test.cc:1239] Sleep() #calls: 1
W20260926 04:01:37.306907 22477 connection.cc:196] Error closing socket: Network error: TlsSocket::Close: Broken pipe
[ OK ] Parameters/TestRpc.TestRpcHandlerLatencyMetric/SSL_UnixSocket (61 ms)
[ RUN ] Parameters/TestRpc.TimedOutOnResponseMetricServiceQueue/SSL_UnixSocket
I20260926 04:01:37.320340 22506 acceptor_pool.cc:254] collecting diagnostics on the listening RPC socket unix:/tmp/dist-test-taskrzARaL/test-tmp/rpc-test-997854480b80477d9f8ab94c76352063.sock every 8 connection(s)
I20260926 04:01:37.320389 22507 acceptor_pool.cc:254] collecting diagnostics on the listening RPC socket unix:/tmp/dist-test-taskrzARaL/test-tmp/rpc-test-997854480b80477d9f8ab94c76352063.sock every 8 connection(s)
W20260926 04:01:37.383675 22508 rpcz_store.cc:267] Call kudu.rpc_test.CalculatorService.Sleep from unix:<unnamed> (request call id 2) took 20 ms (client timeout 20 ms). Trace:
W20260926 04:01:37.383774 22508 rpcz_store.cc:269] 0926 04:01:37.363353 (+ 0us) service_pool.cc:170] Inserting onto call queue
0926 04:01:37.383633 (+ 20280us) service_pool.cc:214] Skipping call since client already timed out
0926 04:01:37.383643 (+ 10us) inbound_call.cc:173] Queueing failure response
Metrics: {}
[ OK ] Parameters/TestRpc.TimedOutOnResponseMetricServiceQueue/SSL_UnixSocket (77 ms)
[ RUN ] Parameters/TestRpc.RpcPendingConnectionsMetric/SSL_UnixSocket
I20260926 04:01:37.387133 22529 acceptor_pool.cc:254] collecting diagnostics on the listening RPC socket 0.0.0.0:45851 every 8 connection(s)
I20260926 04:01:37.387207 22530 acceptor_pool.cc:254] collecting diagnostics on the listening RPC socket 0.0.0.0:45851 every 8 connection(s)
W20260926 04:01:37.387717 22525 negotiation.cc:337] Failed RPC negotiation. Trace:
0926 04:01:37.387568 (+ 0us) reactor.cc:625] Submitting negotiation task for server connection from 127.0.0.1:50688 (local address 127.0.0.1:45851)
0926 04:01:37.387609 (+ 41us) server_negotiation.cc:206] Beginning negotiation
0926 04:01:37.387611 (+ 2us) server_negotiation.cc:399] Waiting for connection header
0926 04:01:37.387674 (+ 63us) negotiation.cc:327] Negotiation complete: Network error: Server connection negotiation failed: server connection from 127.0.0.1:50688: BlockingRecv error: recv got EOF from 127.0.0.1:50688 (error 108)
Metrics: {"server-negotiator.queue_time_us":13}
[ OK ] Parameters/TestRpc.RpcPendingConnectionsMetric/SSL_UnixSocket (13 ms)
[ RUN ] Parameters/TestRpc.TestRpcContextClientDeadline/SSL_UnixSocket
I20260926 04:01:37.403375 22545 acceptor_pool.cc:254] collecting diagnostics on the listening RPC socket unix:/tmp/dist-test-taskrzARaL/test-tmp/rpc-test-b59cc7240c3b4909bd4e94ed1f589120.sock every 8 connection(s)
I20260926 04:01:37.403439 22546 acceptor_pool.cc:254] collecting diagnostics on the listening RPC socket unix:/tmp/dist-test-taskrzARaL/test-tmp/rpc-test-b59cc7240c3b4909bd4e94ed1f589120.sock every 8 connection(s)
W20260926 04:01:37.453836 22542 connection.cc:196] Error closing socket: Network error: TlsSocket::Close: Broken pipe
[ OK ] Parameters/TestRpc.TestRpcContextClientDeadline/SSL_UnixSocket (55 ms)
[ RUN ] Parameters/TestRpc.TestApplicationFeatureFlagUnsupportedServer/SSL_UnixSocket
I20260926 04:01:37.462541 22570 acceptor_pool.cc:254] collecting diagnostics on the listening RPC socket unix:/tmp/dist-test-taskrzARaL/test-tmp/rpc-test-e332beb3532b4eeb9b1ad2fc129d1a8f.sock every 8 connection(s)
I20260926 04:01:37.462568 22571 acceptor_pool.cc:254] collecting diagnostics on the listening RPC socket unix:/tmp/dist-test-taskrzARaL/test-tmp/rpc-test-e332beb3532b4eeb9b1ad2fc129d1a8f.sock every 8 connection(s)
[ OK ] Parameters/TestRpc.TestApplicationFeatureFlagUnsupportedServer/SSL_UnixSocket (60 ms)
[ RUN ] Parameters/TestRpc.TestCancellationAsync/SSL_UnixSocket
I20260926 04:01:37.520766 22595 acceptor_pool.cc:254] collecting diagnostics on the listening RPC socket unix:/tmp/dist-test-taskrzARaL/test-tmp/rpc-test-3cb6b964d3814fe78b2ddb8f51e0faf8.sock every 8 connection(s)
I20260926 04:01:37.520824 22596 acceptor_pool.cc:254] collecting diagnostics on the listening RPC socket unix:/tmp/dist-test-taskrzARaL/test-tmp/rpc-test-3cb6b964d3814fe78b2ddb8f51e0faf8.sock every 8 connection(s)
I20260926 04:01:37.520973 22163 rpc-test.cc:1716] Connecting to unix:/tmp/dist-test-taskrzARaL/test-tmp/rpc-test-3cb6b964d3814fe78b2ddb8f51e0faf8.sock
I20260926 04:01:37.533581 22163 test_util.cc:268] Using random seed: -474509685
I20260926 04:01:37.550944 22599 rpc-test-base.h:240] got call: sleep_micros: 500 pattern: 4294967295 num_repetitions: 2097152 sidecar_idx: 0
I20260926 04:01:37.565231 22599 rpc-test-base.h:240] got call: sleep_micros: 500 pattern: 4294967295 num_repetitions: 2097152 sidecar_idx: 0
I20260926 04:01:37.577816 22599 rpc-test-base.h:240] got call: sleep_micros: 500 pattern: 4294967295 num_repetitions: 2097152 sidecar_idx: 0
I20260926 04:01:37.590698 22599 rpc-test-base.h:240] got call: sleep_micros: 500 pattern: 4294967295 num_repetitions: 2097152 sidecar_idx: 0
I20260926 04:01:37.601454 22599 rpc-test-base.h:240] got call: sleep_micros: 500 pattern: 4294967295 num_repetitions: 2097152 sidecar_idx: 0
I20260926 04:01:37.611608 22599 rpc-test-base.h:240] got call: sleep_micros: 500 pattern: 4294967295 num_repetitions: 2097152 sidecar_idx: 0
I20260926 04:01:37.621590 22599 rpc-test-base.h:240] got call: sleep_micros: 500 pattern: 4294967295 num_repetitions: 2097152 sidecar_idx: 0
I20260926 04:01:37.631822 22599 rpc-test-base.h:240] got call: sleep_micros: 500 pattern: 4294967295 num_repetitions: 2097152 sidecar_idx: 0
W20260926 04:01:37.633198 22592 connection.cc:196] Error closing socket: Network error: TlsSocket::Close: Broken pipe
W20260926 04:01:37.634886 22592 connection.cc:441] server connection from unix:<unnamed> torn down before Call kudu.rpc.GenericCalculatorService.SleepWithSidecar from unix:<unnamed> (request call id 9) could send its response
[ OK ] Parameters/TestRpc.TestCancellationAsync/SSL_UnixSocket (122 ms)
[ RUN ] Parameters/TestRpc.TestPerformanceBySocketType/SSL_UnixSocket
I20260926 04:01:37.672830 22620 acceptor_pool.cc:254] collecting diagnostics on the listening RPC socket unix:/tmp/dist-test-taskrzARaL/test-tmp/rpc-test-967c567ab7144c69bd5c71532181305f.sock every 8 connection(s)
I20260926 04:01:37.672883 22621 acceptor_pool.cc:254] collecting diagnostics on the listening RPC socket unix:/tmp/dist-test-taskrzARaL/test-tmp/rpc-test-967c567ab7144c69bd5c71532181305f.sock every 8 connection(s)
I20260926 04:01:37.673034 22163 rpc-test.cc:1846] Connecting to unix:/tmp/dist-test-taskrzARaL/test-tmp/rpc-test-967c567ab7144c69bd5c71532181305f.sock
I20260926 04:01:38.872514 22163 rpc-test.cc:1859] Sending 1024MB via ssl-enabled unix socket: real 1.185s user 1.312s sys 0.830s
I20260926 04:01:40.026701 22163 rpc-test.cc:1859] Sending 1024MB via ssl-enabled unix socket: real 1.154s user 1.394s sys 0.702s
I20260926 04:01:41.255973 22163 rpc-test.cc:1859] Sending 1024MB via ssl-enabled unix socket: real 1.229s user 1.395s sys 0.841s
I20260926 04:01:42.408874 22163 rpc-test.cc:1859] Sending 1024MB via ssl-enabled unix socket: real 1.153s user 1.166s sys 0.922s
I20260926 04:01:43.581513 22163 rpc-test.cc:1859] Sending 1024MB via ssl-enabled unix socket: real 1.173s user 1.267s sys 0.859s
W20260926 04:01:43.582311 22617 connection.cc:196] Error closing socket: Network error: TlsSocket::Close: Broken pipe
[ OK ] Parameters/TestRpc.TestPerformanceBySocketType/SSL_UnixSocket (5946 ms)
[----------] 20 tests from Parameters/TestRpc (25232 ms total)
[----------] 1 test from Parameters/TestRpcSocketTxRxQueue
[ RUN ] Parameters/TestRpcSocketTxRxQueue.AcceptorRxQueueSizeMetric/0
I20260926 04:01:43.584800 22645 acceptor_pool.cc:254] collecting diagnostics on the listening RPC socket 0.0.0.0:33065 every 1 connection(s)
I20260926 04:01:43.584868 22646 acceptor_pool.cc:254] collecting diagnostics on the listening RPC socket 0.0.0.0:33065 every 1 connection(s)
W20260926 04:01:43.585371 22641 negotiation.cc:337] Failed RPC negotiation. Trace:
0926 04:01:43.585243 (+ 0us) reactor.cc:625] Submitting negotiation task for server connection from 127.0.0.1:35402 (local address 127.0.0.1:33065)
0926 04:01:43.585279 (+ 36us) server_negotiation.cc:206] Beginning negotiation
0926 04:01:43.585281 (+ 2us) server_negotiation.cc:399] Waiting for connection header
0926 04:01:43.585342 (+ 61us) negotiation.cc:327] Negotiation complete: Network error: Server connection negotiation failed: server connection from 127.0.0.1:35402: BlockingRecv error: recv got EOF from 127.0.0.1:35402 (error 108)
Metrics: {"server-negotiator.queue_time_us":14}
[ OK ] Parameters/TestRpcSocketTxRxQueue.AcceptorRxQueueSizeMetric/0 (4 ms)
[----------] 1 test from Parameters/TestRpcSocketTxRxQueue (4 ms total)
[----------] Global test environment tear-down
[==========] 21 tests from 2 test suites ran. (25236 ms total)
[ PASSED ] 20 tests.
[ FAILED ] 1 test, listed below:
[ FAILED ] Parameters/TestRpc.TestCallWithChainCertAndChainCA/SSL_UnixSocket, where GetParam() = (true, true)
1 FAILED TEST