Diagnosed failure

Parameters/TestRpc.TestCallWithChainCertAndChainCA/SSL_TCP: /data0/somelongdirectorytoavoidrpathissues/src/kudu/src/kudu/rpc/rpc-test.cc:270: Failure
Failed
Bad status: Runtime error: could not verify certificate chain (error with cert: subject=CN = localhost, ST = sadfjas, C = AS, emailAddress = sdflkdsajf, O = lskdfjlsad, OU = sldfkja, issuer=C = AS, ST = ASDfkjdhf, L = lskdjf, O = saldfja, OU = skdjf, CN = localhost, emailAddress = sadjflkadsj): : certificate has expired
Google Test trace:
/data0/somelongdirectorytoavoidrpathissues/src/kudu/src/kudu/rpc/rpc-test.cc:267: Connecting to 0.0.0.0:35791
I20260924 12:45:49.791096   856 test_util.cc:175] -----------------------------------------------
I20260924 12:45:49.791227   856 test_util.cc:176] Had fatal failures, leaving test files at /tmp/dist-test-taskHCpcRa/test-tmp/rpc-test.5.Parameters_TestRpc.TestCallWithChainCertAndChainCA_SSL_TCP.1790253949662072-856-0

Full log

Note: This is test shard 6 of 8.
[==========] Running 21 tests from 2 test suites.
[----------] Global test environment set-up.
[----------] 20 tests from Parameters/TestRpc
[ RUN      ] Parameters/TestRpc.TestMessengerCreateDestroy/SSL_TCP
WARNING: Logging before InitGoogleLogging() is written to STDERR
I20260924 12:45:49.722249   856 rpc-test.cc:169] started messenger TestCreateDestroy
[       OK ] Parameters/TestRpc.TestMessengerCreateDestroy/SSL_TCP (43 ms)
[ RUN      ] Parameters/TestRpc.TestNegotiationDeadlock/SSL_TCP
I20260924 12:45:49.741391   876 acceptor_pool.cc:254] collecting diagnostics on the listening RPC socket 0.0.0.0:39525 every 8 connection(s)
I20260924 12:45:49.741727   877 acceptor_pool.cc:254] collecting diagnostics on the listening RPC socket 0.0.0.0:39525 every 8 connection(s)
[       OK ] Parameters/TestRpc.TestNegotiationDeadlock/SSL_TCP (35 ms)
[ RUN      ] Parameters/TestRpc.TestCallWithChainCertAndChainCA/SSL_TCP
I20260924 12:45:49.779533   892 acceptor_pool.cc:254] collecting diagnostics on the listening RPC socket 0.0.0.0:35791 every 8 connection(s)
I20260924 12:45:49.779865   893 acceptor_pool.cc:254] collecting diagnostics on the listening RPC socket 0.0.0.0:35791 every 8 connection(s)
/data0/somelongdirectorytoavoidrpathissues/src/kudu/src/kudu/rpc/rpc-test.cc:270: Failure
Failed
Bad status: Runtime error: could not verify certificate chain (error with cert: subject=CN = localhost, ST = sadfjas, C = AS, emailAddress = sdflkdsajf, O = lskdfjlsad, OU = sldfkja, issuer=C = AS, ST = ASDfkjdhf, L = lskdjf, O = saldfja, OU = skdjf, CN = localhost, emailAddress = sadjflkadsj): : certificate has expired
Google Test trace:
/data0/somelongdirectorytoavoidrpathissues/src/kudu/src/kudu/rpc/rpc-test.cc:267: Connecting to 0.0.0.0:35791
I20260924 12:45:49.791096   856 test_util.cc:175] -----------------------------------------------
I20260924 12:45:49.791227   856 test_util.cc:176] Had fatal failures, leaving test files at /tmp/dist-test-taskHCpcRa/test-tmp/rpc-test.5.Parameters_TestRpc.TestCallWithChainCertAndChainCA_SSL_TCP.1790253949662072-856-0
[  FAILED  ] Parameters/TestRpc.TestCallWithChainCertAndChainCA/SSL_TCP, where GetParam() = (true, false) (29 ms)
[ RUN      ] Parameters/TestRpc.TestCallWithPasswordProtectedKey/SSL_TCP
I20260924 12:45:49.804196   917 acceptor_pool.cc:254] collecting diagnostics on the listening RPC socket 0.0.0.0:38625 every 8 connection(s)
I20260924 12:45:49.804431   918 acceptor_pool.cc:254] collecting diagnostics on the listening RPC socket 0.0.0.0:38625 every 8 connection(s)
[       OK ] Parameters/TestRpc.TestCallWithPasswordProtectedKey/SSL_TCP (48 ms)
[ RUN      ] Parameters/TestRpc.TestCallToBadServer/SSL_TCP
I20260924 12:45:49.856871   856 rpc-test.cc:394] Status: Network error: Client connection negotiation failed: client connection to 0.0.0.0:0: connect: Connection refused (error 111)
I20260924 12:45:49.857648   856 rpc-test.cc:394] Status: Network error: Client connection negotiation failed: client connection to 0.0.0.0:0: connect: Connection refused (error 111)
I20260924 12:45:49.858316   856 rpc-test.cc:394] Status: Network error: Client connection negotiation failed: client connection to 0.0.0.0:0: connect: Connection refused (error 111)
I20260924 12:45:49.858947   856 rpc-test.cc:394] Status: Network error: Client connection negotiation failed: client connection to 0.0.0.0:0: connect: Connection refused (error 111)
I20260924 12:45:49.859579   856 rpc-test.cc:394] Status: Network error: Client connection negotiation failed: client connection to 0.0.0.0:0: connect: Connection refused (error 111)
[       OK ] Parameters/TestRpc.TestCallToBadServer/SSL_TCP (21 ms)
[ RUN      ] Parameters/TestRpc.TestWrongService/SSL_TCP
I20260924 12:45:49.890657   952 acceptor_pool.cc:254] collecting diagnostics on the listening RPC socket 0.0.0.0:45545 every 8 connection(s)
I20260924 12:45:49.890964   953 acceptor_pool.cc:254] collecting diagnostics on the listening RPC socket 0.0.0.0:45545 every 8 connection(s)
I20260924 12:45:49.914346   950 messenger.cc:345] service WrongServiceName not registered on TestServer
[       OK ] Parameters/TestRpc.TestWrongService/SSL_TCP (57 ms)
[ RUN      ] Parameters/TestRpc.TestConnectionKeepalive/SSL_TCP
I20260924 12:45:49.948514   975 acceptor_pool.cc:254] collecting diagnostics on the listening RPC socket 0.0.0.0:41967 every 8 connection(s)
I20260924 12:45:49.948818   976 acceptor_pool.cc:254] collecting diagnostics on the listening RPC socket 0.0.0.0:41967 every 8 connection(s)
I20260924 12:45:49.949730   856 rpc-test.cc:488] Connecting to 0.0.0.0:41967
[       OK ] Parameters/TestRpc.TestConnectionKeepalive/SSL_TCP (1060 ms)
[ RUN      ] Parameters/TestRpc.TestClientConnectionMetrics/SSL_TCP
I20260924 12:45:50.997680  1000 acceptor_pool.cc:254] collecting diagnostics on the listening RPC socket 0.0.0.0:41169 every 8 connection(s)
I20260924 12:45:50.997933  1001 acceptor_pool.cc:254] collecting diagnostics on the listening RPC socket 0.0.0.0:41169 every 8 connection(s)
I20260924 12:45:50.998845   856 rpc-test.cc:569] Connecting to 0.0.0.0:41169
[       OK ] Parameters/TestRpc.TestClientConnectionMetrics/SSL_TCP (19787 ms)
[ RUN      ] Parameters/TestRpc.TestCredentialsPolicy/SSL_TCP
I20260924 12:46:10.795780  1023 acceptor_pool.cc:254] collecting diagnostics on the listening RPC socket 0.0.0.0:44347 every 8 connection(s)
I20260924 12:46:10.796111  1024 acceptor_pool.cc:254] collecting diagnostics on the listening RPC socket 0.0.0.0:44347 every 8 connection(s)
I20260924 12:46:10.797019   856 rpc-test.cc:700] Connecting to 0.0.0.0:44347
[       OK ] Parameters/TestRpc.TestCredentialsPolicy/SSL_TCP (75 ms)
[ RUN      ] Parameters/TestRpc.TestCallLongerThanKeepalive/SSL_TCP
I20260924 12:46:10.854004  1048 acceptor_pool.cc:254] collecting diagnostics on the listening RPC socket 0.0.0.0:44199 every 8 connection(s)
I20260924 12:46:10.854246  1049 acceptor_pool.cc:254] collecting diagnostics on the listening RPC socket 0.0.0.0:44199 every 8 connection(s)
I20260924 12:46:10.876403  1052 rpc-test-base.h:222] got call: sleep_micros: 3000000 deferred: true
I20260924 12:46:13.878062  1052 rpcz_store.cc:275] Call kudu.rpc.GenericCalculatorService.Sleep from 127.0.0.1:52974 (request call id 0) took 3001 ms. Trace:
I20260924 12:46:13.878257  1052 rpcz_store.cc:276] 0924 12:46:10.876295 (+     0us) service_pool.cc:170] Inserting onto call queue
0924 12:46:10.876355 (+    60us) service_pool.cc:227] Handling call
0924 12:46:13.878011 (+3001656us) inbound_call.cc:173] Queueing success response
Metrics: {}
[       OK ] Parameters/TestRpc.TestCallLongerThanKeepalive/SSL_TCP (3041 ms)
[ RUN      ] Parameters/TestRpc.TestRpcSidecar/SSL_TCP
I20260924 12:46:13.905424  1073 acceptor_pool.cc:254] collecting diagnostics on the listening RPC socket 0.0.0.0:34669 every 8 connection(s)
I20260924 12:46:13.905663  1074 acceptor_pool.cc:254] collecting diagnostics on the listening RPC socket 0.0.0.0:34669 every 8 connection(s)
[       OK ] Parameters/TestRpc.TestRpcSidecar/SSL_TCP (129 ms)
[ RUN      ] Parameters/TestRpc.TestRpcSidecarLimits/SSL_TCP
I20260924 12:46:16.141400  1098 acceptor_pool.cc:254] collecting diagnostics on the listening RPC socket 0.0.0.0:40359 every 8 connection(s)
I20260924 12:46:16.141664  1099 acceptor_pool.cc:254] collecting diagnostics on the listening RPC socket 0.0.0.0:40359 every 8 connection(s)
W20260924 12:46:16.157240   856 serialization.cc:72] Serialized kudu.rpc_test.PushStringsRequestPB (2147483654 bytes) is larger than the maximum configured RPC message size (52428800 bytes). Sending anyway, but peer may reject the data.
W20260924 12:46:16.163638  1096 connection.cc:535] server connection from 127.0.0.1:43856 recv error: Network error: RPC frame had a length of 2147483714, but we only support messages up to 52428800 bytes long.
W20260924 12:46:16.163815  1096 connection.cc:158] shutting down server connection from 127.0.0.1:43856 with pending inbound data: 4/2147483714 bytes received; last active 0 ns ago: status Network error: RPC frame had a length of 2147483714, but we only support messages up to 52428800 bytes long.
W20260924 12:46:16.164317  1111 connection.cc:196] Error closing socket: Network error: TlsSocket::Close: Connection reset by peer
I20260924 12:46:16.179205  1123 acceptor_pool.cc:254] collecting diagnostics on the listening RPC socket 0.0.0.0:36191 every 8 connection(s)
I20260924 12:46:16.179425  1124 acceptor_pool.cc:254] collecting diagnostics on the listening RPC socket 0.0.0.0:36191 every 8 connection(s)
W20260924 12:46:21.577435  1122 connection.cc:577] server connection from 127.0.0.1:54354: received bad data: 'Corruption: Invalid packet: message had a length of 2147483710, but we only support messages up to 2147483647 bytes
'
[       OK ] Parameters/TestRpc.TestRpcSidecarLimits/SSL_TCP (8043 ms)
[ RUN      ] Parameters/TestRpc.TestCallTimeoutDoesntAffectNegotiation/SSL_TCP
I20260924 12:46:22.079221  1148 acceptor_pool.cc:254] collecting diagnostics on the listening RPC socket 0.0.0.0:39605 every 8 connection(s)
I20260924 12:46:22.079458  1149 acceptor_pool.cc:254] collecting diagnostics on the listening RPC socket 0.0.0.0:39605 every 8 connection(s)
W20260924 12:46:22.095836  1144 negotiation.cc:266] Injecting 500ms delay in negotiation
I20260924 12:46:22.146377   856 rpc-test-base.h:595] status: Timed out: connection negotiation to 0.0.0.0:39605 for RPC Sleep timed out after 0.050s (ON_OUTBOUND_QUEUE), seconds elapsed: 0.051102
[       OK ] Parameters/TestRpc.TestCallTimeoutDoesntAffectNegotiation/SSL_TCP (548 ms)
[ RUN      ] Parameters/TestRpc.TestRpcHandlerLatencyMetric/SSL_TCP
I20260924 12:46:22.628131  1173 acceptor_pool.cc:254] collecting diagnostics on the listening RPC socket 0.0.0.0:38565 every 8 connection(s)
I20260924 12:46:22.628342  1174 acceptor_pool.cc:254] collecting diagnostics on the listening RPC socket 0.0.0.0:38565 every 8 connection(s)
I20260924 12:46:22.668084   856 rpc-test.cc:1236] Sleep() min lat: 20658
I20260924 12:46:22.668170   856 rpc-test.cc:1237] Sleep() mean lat: 20658
I20260924 12:46:22.668208   856 rpc-test.cc:1238] Sleep() max lat: 20658
I20260924 12:46:22.668226   856 rpc-test.cc:1239] Sleep() #calls: 1
[       OK ] Parameters/TestRpc.TestRpcHandlerLatencyMetric/SSL_TCP (67 ms)
[ RUN      ] Parameters/TestRpc.TimedOutOnResponseMetricServiceQueue/SSL_TCP
I20260924 12:46:22.688261  1199 acceptor_pool.cc:254] collecting diagnostics on the listening RPC socket 0.0.0.0:42063 every 8 connection(s)
I20260924 12:46:22.688450  1200 acceptor_pool.cc:254] collecting diagnostics on the listening RPC socket 0.0.0.0:42063 every 8 connection(s)
W20260924 12:46:22.760164  1201 rpcz_store.cc:267] Call kudu.rpc_test.CalculatorService.Sleep from 127.0.0.1:34298 (request call id 2) took 20 ms (client timeout 20 ms). Trace:
W20260924 12:46:22.760349  1201 rpcz_store.cc:269] 0924 12:46:22.739720 (+     0us) service_pool.cc:170] Inserting onto call queue
0924 12:46:22.760105 (+ 20385us) service_pool.cc:214] Skipping call since client already timed out
0924 12:46:22.760146 (+    41us) inbound_call.cc:173] Queueing failure response
Metrics: {}
[       OK ] Parameters/TestRpc.TimedOutOnResponseMetricServiceQueue/SSL_TCP (90 ms)
[ RUN      ] Parameters/TestRpc.RpcPendingConnectionsMetric/SSL_TCP
I20260924 12:46:22.769068  1222 acceptor_pool.cc:254] collecting diagnostics on the listening RPC socket 0.0.0.0:39291 every 8 connection(s)
I20260924 12:46:22.769289  1223 acceptor_pool.cc:254] collecting diagnostics on the listening RPC socket 0.0.0.0:39291 every 8 connection(s)
W20260924 12:46:22.785754  1218 negotiation.cc:337] Failed RPC negotiation. Trace:
0924 12:46:22.784832 (+     0us) reactor.cc:625] Submitting negotiation task for server connection from 127.0.0.1:35744 (local address 127.0.0.1:39291)
0924 12:46:22.785042 (+   210us) server_negotiation.cc:206] Beginning negotiation
0924 12:46:22.785050 (+     8us) server_negotiation.cc:399] Waiting for connection header
0924 12:46:22.785251 (+   201us) negotiation.cc:327] Negotiation complete: Network error: Server connection negotiation failed: server connection from 127.0.0.1:35744: BlockingRecv error: recv got EOF from 127.0.0.1:35744 (error 108)
Metrics: {"server-negotiator.queue_time_us":43}
[       OK ] Parameters/TestRpc.RpcPendingConnectionsMetric/SSL_TCP (33 ms)
[ RUN      ] Parameters/TestRpc.TestRpcContextClientDeadline/SSL_TCP
I20260924 12:46:22.834776  1238 acceptor_pool.cc:254] collecting diagnostics on the listening RPC socket 0.0.0.0:42707 every 8 connection(s)
I20260924 12:46:22.834975  1239 acceptor_pool.cc:254] collecting diagnostics on the listening RPC socket 0.0.0.0:42707 every 8 connection(s)
[       OK ] Parameters/TestRpc.TestRpcContextClientDeadline/SSL_TCP (88 ms)
[ RUN      ] Parameters/TestRpc.TestApplicationFeatureFlagUnsupportedServer/SSL_TCP
I20260924 12:46:22.900812  1263 acceptor_pool.cc:254] collecting diagnostics on the listening RPC socket 0.0.0.0:35681 every 8 connection(s)
I20260924 12:46:22.901031  1264 acceptor_pool.cc:254] collecting diagnostics on the listening RPC socket 0.0.0.0:35681 every 8 connection(s)
[       OK ] Parameters/TestRpc.TestApplicationFeatureFlagUnsupportedServer/SSL_TCP (38 ms)
[ RUN      ] Parameters/TestRpc.TestCancellationAsync/SSL_TCP
I20260924 12:46:22.941262  1288 acceptor_pool.cc:254] collecting diagnostics on the listening RPC socket 0.0.0.0:33407 every 8 connection(s)
I20260924 12:46:22.941496  1289 acceptor_pool.cc:254] collecting diagnostics on the listening RPC socket 0.0.0.0:33407 every 8 connection(s)
I20260924 12:46:22.942399   856 rpc-test.cc:1716] Connecting to 0.0.0.0:33407
I20260924 12:46:22.965634   856 test_util.cc:268] Using random seed: -55156891
I20260924 12:46:22.999441  1292 rpc-test-base.h:240] got call: sleep_micros: 500 pattern: 4294967295 num_repetitions: 2097152 sidecar_idx: 0
I20260924 12:46:23.020206  1291 rpc-test-base.h:240] got call: sleep_micros: 500 pattern: 4294967295 num_repetitions: 2097152 sidecar_idx: 0
I20260924 12:46:23.046083  1290 rpc-test-base.h:240] got call: sleep_micros: 500 pattern: 4294967295 num_repetitions: 2097152 sidecar_idx: 0
I20260924 12:46:23.084770  1291 rpc-test-base.h:240] got call: sleep_micros: 500 pattern: 4294967295 num_repetitions: 2097152 sidecar_idx: 0
I20260924 12:46:23.117255  1290 rpc-test-base.h:240] got call: sleep_micros: 500 pattern: 4294967295 num_repetitions: 2097152 sidecar_idx: 0
I20260924 12:46:23.149868  1291 rpc-test-base.h:240] got call: sleep_micros: 500 pattern: 4294967295 num_repetitions: 2097152 sidecar_idx: 0
W20260924 12:46:23.174857  1286 connection.cc:698] server connection from 127.0.0.1:42176 send error: Network error: failed to write to TLS socket: Broken pipe
W20260924 12:46:23.175000  1286 connection.cc:441] server connection from 127.0.0.1:42176 torn down before Call kudu.rpc.GenericCalculatorService.SleepWithSidecar from 127.0.0.1:42176 (request call id 9) could send its response
W20260924 12:46:23.175365  1286 connection.cc:196] Error closing socket: Network error: TlsSocket::Close: Success
W20260924 12:46:23.194826  1286 connection.cc:441] server connection from 127.0.0.1:42176 torn down before Call kudu.rpc.GenericCalculatorService.SleepWithSidecar from 127.0.0.1:42176 (request call id 8) could send its response
[       OK ] Parameters/TestRpc.TestCancellationAsync/SSL_TCP (272 ms)
[ RUN      ] Parameters/TestRpc.TestPerformanceBySocketType/SSL_TCP
I20260924 12:46:23.224931  1313 acceptor_pool.cc:254] collecting diagnostics on the listening RPC socket 0.0.0.0:33707 every 8 connection(s)
I20260924 12:46:23.225149  1314 acceptor_pool.cc:254] collecting diagnostics on the listening RPC socket 0.0.0.0:33707 every 8 connection(s)
I20260924 12:46:23.226037   856 rpc-test.cc:1846] Connecting to 0.0.0.0:33707
I20260924 12:46:26.116201   856 rpc-test.cc:1859] Sending 1024MB via ssl-enabled tcp socket: real 2.873s	user 2.648s	sys 2.121s
I20260924 12:46:28.995183   856 rpc-test.cc:1859] Sending 1024MB via ssl-enabled tcp socket: real 2.879s	user 2.643s	sys 2.130s
I20260924 12:46:31.942229   856 rpc-test.cc:1859] Sending 1024MB via ssl-enabled tcp socket: real 2.947s	user 2.612s	sys 2.273s
I20260924 12:46:34.844498   856 rpc-test.cc:1859] Sending 1024MB via ssl-enabled tcp socket: real 2.902s	user 2.588s	sys 2.211s
I20260924 12:46:37.811923   856 rpc-test.cc:1859] Sending 1024MB via ssl-enabled tcp socket: real 2.967s	user 2.724s	sys 2.214s
[       OK ] Parameters/TestRpc.TestPerformanceBySocketType/SSL_TCP (14619 ms)
[----------] 20 tests from Parameters/TestRpc (48137 ms total)

[----------] 1 test from Parameters/TestRpcSocketTxRxQueue
[ RUN      ] Parameters/TestRpcSocketTxRxQueue.OverCapacity/0
W20260924 12:46:38.115427  1339 negotiation.cc:337] Failed RPC negotiation. Trace:
0924 12:46:37.825715 (+     0us) reactor.cc:625] Submitting negotiation task for client connection to 0.0.0.0:45303 (local address 127.0.0.1:44718)
0924 12:46:37.825877 (+   162us) negotiation.cc:107] Waiting for socket to connect
0924 12:46:37.825898 (+    21us) client_negotiation.cc:174] Beginning negotiation
0924 12:46:37.825989 (+    91us) client_negotiation.cc:252] Sending NEGOTIATE NegotiatePB request
0924 12:46:38.114810 (+288821us) negotiation.cc:327] Negotiation complete: Network error: Client connection negotiation failed: client connection to 0.0.0.0:45303: BlockingRecv error: recv error from unknown peer: Transport endpoint is not connected (error 107)
Metrics: {"client-negotiator.queue_time_us":55}
W20260924 12:46:38.115797  1330 negotiation.cc:337] Failed RPC negotiation. Trace:
0924 12:46:37.822819 (+     0us) reactor.cc:625] Submitting negotiation task for client connection to 0.0.0.0:45303 (local address 127.0.0.1:44712)
0924 12:46:37.823025 (+   206us) negotiation.cc:107] Waiting for socket to connect
0924 12:46:37.823043 (+    18us) client_negotiation.cc:174] Beginning negotiation
0924 12:46:37.823190 (+   147us) client_negotiation.cc:252] Sending NEGOTIATE NegotiatePB request
0924 12:46:38.114691 (+291501us) negotiation.cc:327] Negotiation complete: Network error: Client connection negotiation failed: client connection to 0.0.0.0:45303: BlockingRecv error: recv error from unknown peer: Transport endpoint is not connected (error 107)
Metrics: {"client-negotiator.queue_time_us":66}
W20260924 12:46:38.115980  1348 negotiation.cc:337] Failed RPC negotiation. Trace:
0924 12:46:37.828186 (+     0us) reactor.cc:625] Submitting negotiation task for client connection to 0.0.0.0:45303 (local address 127.0.0.1:44726)
0924 12:46:37.828355 (+   169us) negotiation.cc:107] Waiting for socket to connect
0924 12:46:37.828370 (+    15us) client_negotiation.cc:174] Beginning negotiation
0924 12:46:37.828469 (+    99us) client_negotiation.cc:252] Sending NEGOTIATE NegotiatePB request
0924 12:46:38.114763 (+286294us) negotiation.cc:327] Negotiation complete: Network error: Client connection negotiation failed: client connection to 0.0.0.0:45303: BlockingRecv error: recv error from unknown peer: Transport endpoint is not connected (error 107)
Metrics: {"client-negotiator.queue_time_us":59}
W20260924 12:46:38.116535  1366 negotiation.cc:337] Failed RPC negotiation. Trace:
0924 12:46:37.833269 (+     0us) reactor.cc:625] Submitting negotiation task for client connection to 0.0.0.0:45303 (local address 127.0.0.1:44742)
0924 12:46:37.833428 (+   159us) negotiation.cc:107] Waiting for socket to connect
0924 12:46:37.833450 (+    22us) client_negotiation.cc:174] Beginning negotiation
0924 12:46:37.833548 (+    98us) client_negotiation.cc:252] Sending NEGOTIATE NegotiatePB request
0924 12:46:38.114691 (+281143us) negotiation.cc:327] Negotiation complete: Network error: Client connection negotiation failed: client connection to 0.0.0.0:45303: BlockingRecv error: recv error from unknown peer: Transport endpoint is not connected (error 107)
Metrics: {"client-negotiator.queue_time_us":55}
W20260924 12:46:38.117673  1375 negotiation.cc:337] Failed RPC negotiation. Trace:
0924 12:46:37.836057 (+     0us) reactor.cc:625] Submitting negotiation task for client connection to 0.0.0.0:45303 (local address 127.0.0.1:44748)
0924 12:46:37.836255 (+   198us) negotiation.cc:107] Waiting for socket to connect
0924 12:46:37.836279 (+    24us) client_negotiation.cc:174] Beginning negotiation
0924 12:46:37.836376 (+    97us) client_negotiation.cc:252] Sending NEGOTIATE NegotiatePB request
0924 12:46:38.115306 (+278930us) negotiation.cc:327] Negotiation complete: Network error: Client connection negotiation failed: client connection to 0.0.0.0:45303: BlockingRecv error: recv error from unknown peer: Transport endpoint is not connected (error 107)
Metrics: {"client-negotiator.queue_time_us":54}
W20260924 12:46:38.121872  1357 negotiation.cc:337] Failed RPC negotiation. Trace:
0924 12:46:37.830713 (+     0us) reactor.cc:625] Submitting negotiation task for client connection to 0.0.0.0:45303 (local address 127.0.0.1:44740)
0924 12:46:37.830888 (+   175us) negotiation.cc:107] Waiting for socket to connect
0924 12:46:37.830907 (+    19us) client_negotiation.cc:174] Beginning negotiation
0924 12:46:37.830991 (+    84us) client_negotiation.cc:252] Sending NEGOTIATE NegotiatePB request
0924 12:46:38.115438 (+284447us) negotiation.cc:327] Negotiation complete: Network error: Client connection negotiation failed: client connection to 0.0.0.0:45303: BlockingRecv error: recv error from unknown peer: Transport endpoint is not connected (error 107)
Metrics: {"client-negotiator.queue_time_us":69}
[       OK ] Parameters/TestRpcSocketTxRxQueue.OverCapacity/0 (1061 ms)
[----------] 1 test from Parameters/TestRpcSocketTxRxQueue (1061 ms total)

[----------] Global test environment tear-down
[==========] 21 tests from 2 test suites ran. (49198 ms total)
[  PASSED  ] 20 tests.
[  FAILED  ] 1 test, listed below:
[  FAILED  ] Parameters/TestRpc.TestCallWithChainCertAndChainCA/SSL_TCP, where GetParam() = (true, false)

 1 FAILED TEST