Diagnosed failure

Parameters/TestRpc.TestCallWithChainCertAndChainCA/SSL_UnixSocket: /data0/somelongdirectorytoavoidrpathissues/src/kudu/src/kudu/rpc/rpc-test.cc:270: Failure
Failed
Bad status: Runtime error: could not verify certificate chain (error with cert: subject=CN = localhost, ST = sadfjas, C = AS, emailAddress = sdflkdsajf, O = lskdfjlsad, OU = sldfkja, issuer=C = AS, ST = ASDfkjdhf, L = lskdjf, O = saldfja, OU = skdjf, CN = localhost, emailAddress = sadjflkadsj): : certificate has expired
Google Test trace:
/data0/somelongdirectorytoavoidrpathissues/src/kudu/src/kudu/rpc/rpc-test.cc:267: Connecting to unix:/tmp/dist-test-taskZ5QskU/test-tmp/rpc-test-471fa59579ba4812b0a05fa036c8f235.sock
I20260929 06:28:02.790257  1245 test_util.cc:175] -----------------------------------------------
I20260929 06:28:02.790300  1245 test_util.cc:176] Had fatal failures, leaving test files at /tmp/dist-test-taskZ5QskU/test-tmp/rpc-test.6.Parameters_TestRpc.TestCallWithChainCertAndChainCA_SSL_UnixSocket.1790663282728626-1245-0

Full log

Note: This is test shard 7 of 8.
[==========] Running 21 tests from 2 test suites.
[----------] Global test environment set-up.
[----------] 20 tests from Parameters/TestRpc
[ RUN      ] Parameters/TestRpc.TestMessengerCreateDestroy/SSL_UnixSocket
WARNING: Logging before InitGoogleLogging() is written to STDERR
I20260929 06:28:02.761425  1245 rpc-test.cc:169] started messenger TestCreateDestroy
[       OK ] Parameters/TestRpc.TestMessengerCreateDestroy/SSL_UnixSocket (31 ms)
[ RUN      ] Parameters/TestRpc.TestNegotiationDeadlock/SSL_UnixSocket
I20260929 06:28:02.770583  1266 acceptor_pool.cc:254] collecting diagnostics on the listening RPC socket unix:/tmp/dist-test-taskZ5QskU/test-tmp/rpc-test-2b5b8e06eb2d4045aabe23158caf2dc1.sock every 8 connection(s)
I20260929 06:28:02.770583  1265 acceptor_pool.cc:254] collecting diagnostics on the listening RPC socket unix:/tmp/dist-test-taskZ5QskU/test-tmp/rpc-test-2b5b8e06eb2d4045aabe23158caf2dc1.sock every 8 connection(s)
[       OK ] Parameters/TestRpc.TestNegotiationDeadlock/SSL_UnixSocket (14 ms)
[ RUN      ] Parameters/TestRpc.TestCallWithChainCertAndChainCA/SSL_UnixSocket
I20260929 06:28:02.786450  1281 acceptor_pool.cc:254] collecting diagnostics on the listening RPC socket unix:/tmp/dist-test-taskZ5QskU/test-tmp/rpc-test-471fa59579ba4812b0a05fa036c8f235.sock every 8 connection(s)
I20260929 06:28:02.786497  1282 acceptor_pool.cc:254] collecting diagnostics on the listening RPC socket unix:/tmp/dist-test-taskZ5QskU/test-tmp/rpc-test-471fa59579ba4812b0a05fa036c8f235.sock every 8 connection(s)
/data0/somelongdirectorytoavoidrpathissues/src/kudu/src/kudu/rpc/rpc-test.cc:270: Failure
Failed
Bad status: Runtime error: could not verify certificate chain (error with cert: subject=CN = localhost, ST = sadfjas, C = AS, emailAddress = sdflkdsajf, O = lskdfjlsad, OU = sldfkja, issuer=C = AS, ST = ASDfkjdhf, L = lskdjf, O = saldfja, OU = skdjf, CN = localhost, emailAddress = sadjflkadsj): : certificate has expired
Google Test trace:
/data0/somelongdirectorytoavoidrpathissues/src/kudu/src/kudu/rpc/rpc-test.cc:267: Connecting to unix:/tmp/dist-test-taskZ5QskU/test-tmp/rpc-test-471fa59579ba4812b0a05fa036c8f235.sock
I20260929 06:28:02.790257  1245 test_util.cc:175] -----------------------------------------------
I20260929 06:28:02.790300  1245 test_util.cc:176] Had fatal failures, leaving test files at /tmp/dist-test-taskZ5QskU/test-tmp/rpc-test.6.Parameters_TestRpc.TestCallWithChainCertAndChainCA_SSL_UnixSocket.1790663282728626-1245-0
[  FAILED  ] Parameters/TestRpc.TestCallWithChainCertAndChainCA/SSL_UnixSocket, where GetParam() = (true, true) (13 ms)
[ RUN      ] Parameters/TestRpc.TestCallWithPasswordProtectedKey/SSL_UnixSocket
I20260929 06:28:02.812637  1306 acceptor_pool.cc:254] collecting diagnostics on the listening RPC socket unix:/tmp/dist-test-taskZ5QskU/test-tmp/rpc-test-aef75e2257184eefa43b70e7f72ea038.sock every 8 connection(s)
I20260929 06:28:02.812664  1307 acceptor_pool.cc:254] collecting diagnostics on the listening RPC socket unix:/tmp/dist-test-taskZ5QskU/test-tmp/rpc-test-aef75e2257184eefa43b70e7f72ea038.sock every 8 connection(s)
W20260929 06:28:02.823179  1303 connection.cc:196] Error closing socket: Network error: TlsSocket::Close: Broken pipe
[       OK ] Parameters/TestRpc.TestCallWithPasswordProtectedKey/SSL_UnixSocket (33 ms)
[ RUN      ] Parameters/TestRpc.TestCallToBadServer/SSL_UnixSocket
I20260929 06:28:02.839752  1245 rpc-test.cc:394] Status: Network error: Client connection negotiation failed: client connection to 0.0.0.0:0: connect: Connection refused (error 111)
I20260929 06:28:02.840049  1245 rpc-test.cc:394] Status: Network error: Client connection negotiation failed: client connection to 0.0.0.0:0: connect: Connection refused (error 111)
I20260929 06:28:02.840220  1245 rpc-test.cc:394] Status: Network error: Client connection negotiation failed: client connection to 0.0.0.0:0: connect: Connection refused (error 111)
I20260929 06:28:02.840452  1245 rpc-test.cc:394] Status: Network error: Client connection negotiation failed: client connection to 0.0.0.0:0: connect: Connection refused (error 111)
I20260929 06:28:02.840679  1245 rpc-test.cc:394] Status: Network error: Client connection negotiation failed: client connection to 0.0.0.0:0: connect: Connection refused (error 111)
[       OK ] Parameters/TestRpc.TestCallToBadServer/SSL_UnixSocket (17 ms)
[ RUN      ] Parameters/TestRpc.TestWrongService/SSL_UnixSocket
I20260929 06:28:02.868628  1341 acceptor_pool.cc:254] collecting diagnostics on the listening RPC socket unix:/tmp/dist-test-taskZ5QskU/test-tmp/rpc-test-bc2b63f3302840d088da98763f94001b.sock every 8 connection(s)
I20260929 06:28:02.868628  1342 acceptor_pool.cc:254] collecting diagnostics on the listening RPC socket unix:/tmp/dist-test-taskZ5QskU/test-tmp/rpc-test-bc2b63f3302840d088da98763f94001b.sock every 8 connection(s)
I20260929 06:28:02.881743  1338 messenger.cc:345] service WrongServiceName not registered on TestServer
[       OK ] Parameters/TestRpc.TestWrongService/SSL_UnixSocket (41 ms)
[ RUN      ] Parameters/TestRpc.TestConnectionKeepalive/SSL_UnixSocket
I20260929 06:28:02.896494  1364 acceptor_pool.cc:254] collecting diagnostics on the listening RPC socket unix:/tmp/dist-test-taskZ5QskU/test-tmp/rpc-test-1edb8b27b432438e86e5aba5e8f13a5e.sock every 8 connection(s)
I20260929 06:28:02.896519  1365 acceptor_pool.cc:254] collecting diagnostics on the listening RPC socket unix:/tmp/dist-test-taskZ5QskU/test-tmp/rpc-test-1edb8b27b432438e86e5aba5e8f13a5e.sock every 8 connection(s)
I20260929 06:28:02.896730  1245 rpc-test.cc:488] Connecting to unix:/tmp/dist-test-taskZ5QskU/test-tmp/rpc-test-1edb8b27b432438e86e5aba5e8f13a5e.sock
W20260929 06:28:03.384373  1377 connection.cc:196] Error closing socket: Network error: TlsSocket::Close: Broken pipe
[       OK ] Parameters/TestRpc.TestConnectionKeepalive/SSL_UnixSocket (1044 ms)
[ RUN      ] Parameters/TestRpc.TestClientConnectionMetrics/SSL_UnixSocket
I20260929 06:28:03.945945  1389 acceptor_pool.cc:254] collecting diagnostics on the listening RPC socket unix:/tmp/dist-test-taskZ5QskU/test-tmp/rpc-test-9786deafde7e4e37b9cd81ab0ceaced2.sock every 8 connection(s)
I20260929 06:28:03.946017  1390 acceptor_pool.cc:254] collecting diagnostics on the listening RPC socket unix:/tmp/dist-test-taskZ5QskU/test-tmp/rpc-test-9786deafde7e4e37b9cd81ab0ceaced2.sock every 8 connection(s)
I20260929 06:28:03.946165  1245 rpc-test.cc:569] Connecting to unix:/tmp/dist-test-taskZ5QskU/test-tmp/rpc-test-9786deafde7e4e37b9cd81ab0ceaced2.sock
W20260929 06:28:12.301155  1386 connection.cc:196] Error closing socket: Network error: TlsSocket::Close: Broken pipe
[       OK ] Parameters/TestRpc.TestClientConnectionMetrics/SSL_UnixSocket (8374 ms)
[ RUN      ] Parameters/TestRpc.TestCredentialsPolicy/SSL_UnixSocket
I20260929 06:28:12.313898  1412 acceptor_pool.cc:254] collecting diagnostics on the listening RPC socket unix:/tmp/dist-test-taskZ5QskU/test-tmp/rpc-test-06d33687af694da49fc7510702ecb68e.sock every 8 connection(s)
I20260929 06:28:12.314010  1413 acceptor_pool.cc:254] collecting diagnostics on the listening RPC socket unix:/tmp/dist-test-taskZ5QskU/test-tmp/rpc-test-06d33687af694da49fc7510702ecb68e.sock every 8 connection(s)
I20260929 06:28:12.314167  1245 rpc-test.cc:700] Connecting to unix:/tmp/dist-test-taskZ5QskU/test-tmp/rpc-test-06d33687af694da49fc7510702ecb68e.sock
W20260929 06:28:12.334472  1411 connection.cc:196] Error closing socket: Network error: TlsSocket::Close: Broken pipe
[       OK ] Parameters/TestRpc.TestCredentialsPolicy/SSL_UnixSocket (36 ms)
[ RUN      ] Parameters/TestRpc.TestCallLongerThanKeepalive/SSL_UnixSocket
I20260929 06:28:12.360013  1437 acceptor_pool.cc:254] collecting diagnostics on the listening RPC socket unix:/tmp/dist-test-taskZ5QskU/test-tmp/rpc-test-028f24f45af243a7b761479f04798c44.sock every 8 connection(s)
I20260929 06:28:12.360044  1438 acceptor_pool.cc:254] collecting diagnostics on the listening RPC socket unix:/tmp/dist-test-taskZ5QskU/test-tmp/rpc-test-028f24f45af243a7b761479f04798c44.sock every 8 connection(s)
I20260929 06:28:12.372395  1441 rpc-test-base.h:222] got call: sleep_micros: 3000000 deferred: true
I20260929 06:28:15.373102  1441 rpcz_store.cc:275] Call kudu.rpc.GenericCalculatorService.Sleep from unix:<unnamed> (request call id 0) took 3000 ms. Trace:
I20260929 06:28:15.373206  1441 rpcz_store.cc:276] 0929 06:28:12.372341 (+     0us) service_pool.cc:170] Inserting onto call queue
0929 06:28:12.372380 (+    39us) service_pool.cc:227] Handling call
0929 06:28:15.373087 (+3000707us) inbound_call.cc:173] Queueing success response
Metrics: {}
[       OK ] Parameters/TestRpc.TestCallLongerThanKeepalive/SSL_UnixSocket (3036 ms)
[ RUN      ] Parameters/TestRpc.TestRpcSidecar/SSL_UnixSocket
I20260929 06:28:15.407366  1462 acceptor_pool.cc:254] collecting diagnostics on the listening RPC socket unix:/tmp/dist-test-taskZ5QskU/test-tmp/rpc-test-b4eb17ca56f3475fb5af79e65f50379a.sock every 8 connection(s)
I20260929 06:28:15.407369  1463 acceptor_pool.cc:254] collecting diagnostics on the listening RPC socket unix:/tmp/dist-test-taskZ5QskU/test-tmp/rpc-test-b4eb17ca56f3475fb5af79e65f50379a.sock every 8 connection(s)
W20260929 06:28:15.449277  1459 connection.cc:196] Error closing socket: Network error: TlsSocket::Close: Broken pipe
[       OK ] Parameters/TestRpc.TestRpcSidecar/SSL_UnixSocket (74 ms)
[ RUN      ] Parameters/TestRpc.TestRpcSidecarLimits/SSL_UnixSocket
I20260929 06:28:17.131251  1487 acceptor_pool.cc:254] collecting diagnostics on the listening RPC socket unix:/tmp/dist-test-taskZ5QskU/test-tmp/rpc-test-8289f4f40f5a44bda69ead0ce3eef073.sock every 8 connection(s)
I20260929 06:28:17.131305  1488 acceptor_pool.cc:254] collecting diagnostics on the listening RPC socket unix:/tmp/dist-test-taskZ5QskU/test-tmp/rpc-test-8289f4f40f5a44bda69ead0ce3eef073.sock every 8 connection(s)
W20260929 06:28:17.156005  1245 serialization.cc:72] Serialized kudu.rpc_test.PushStringsRequestPB (2147483654 bytes) is larger than the maximum configured RPC message size (52428800 bytes). Sending anyway, but peer may reject the data.
W20260929 06:28:17.158778  1484 connection.cc:535] server connection from unix:<unnamed> recv error: Network error: RPC frame had a length of 2147483714, but we only support messages up to 52428800 bytes long.
W20260929 06:28:17.158823  1484 connection.cc:158] shutting down server connection from unix:<unnamed> with pending inbound data: 4/2147483714 bytes received; last active 0 ns ago: status Network error: RPC frame had a length of 2147483714, but we only support messages up to 52428800 bytes long.
W20260929 06:28:17.158947  1500 connection.cc:698] client connection to unix:/tmp/dist-test-taskZ5QskU/test-tmp/rpc-test-8289f4f40f5a44bda69ead0ce3eef073.sock send error: Network error: failed to write to TLS socket: Broken pipe
W20260929 06:28:17.159081  1500 connection.cc:196] Error closing socket: Network error: TlsSocket::Close: Success
I20260929 06:28:17.180866  1512 acceptor_pool.cc:254] collecting diagnostics on the listening RPC socket unix:/tmp/dist-test-taskZ5QskU/test-tmp/rpc-test-8289f4f40f5a44bda69ead0ce3eef073.sock every 8 connection(s)
I20260929 06:28:17.180972  1513 acceptor_pool.cc:254] collecting diagnostics on the listening RPC socket unix:/tmp/dist-test-taskZ5QskU/test-tmp/rpc-test-8289f4f40f5a44bda69ead0ce3eef073.sock every 8 connection(s)
W20260929 06:28:21.407851  1509 connection.cc:577] server connection from unix:<unnamed>: received bad data: 'Corruption: Invalid packet: message had a length of 2147483710, but we only support messages up to 2147483647 bytes
'
W20260929 06:28:21.408123  1525 connection.cc:196] Error closing socket: Network error: TlsSocket::Close: Broken pipe
[       OK ] Parameters/TestRpc.TestRpcSidecarLimits/SSL_UnixSocket (5961 ms)
[ RUN      ] Parameters/TestRpc.TestCallTimeoutDoesntAffectNegotiation/SSL_UnixSocket
I20260929 06:28:21.432991  1537 acceptor_pool.cc:254] collecting diagnostics on the listening RPC socket unix:/tmp/dist-test-taskZ5QskU/test-tmp/rpc-test-d3a62d1cc9994638a815f0e4464ce445.sock every 8 connection(s)
I20260929 06:28:21.433033  1538 acceptor_pool.cc:254] collecting diagnostics on the listening RPC socket unix:/tmp/dist-test-taskZ5QskU/test-tmp/rpc-test-d3a62d1cc9994638a815f0e4464ce445.sock every 8 connection(s)
W20260929 06:28:21.454396  1533 negotiation.cc:266] Injecting 500ms delay in negotiation
I20260929 06:28:21.504596  1245 rpc-test-base.h:595] status: Timed out: connection negotiation to unix:/tmp/dist-test-taskZ5QskU/test-tmp/rpc-test-d3a62d1cc9994638a815f0e4464ce445.sock for RPC Sleep timed out after 0.050s (ON_OUTBOUND_QUEUE), seconds elapsed: 0.0506082
W20260929 06:28:21.958284  1534 connection.cc:196] Error closing socket: Network error: TlsSocket::Close: Broken pipe
[       OK ] Parameters/TestRpc.TestCallTimeoutDoesntAffectNegotiation/SSL_UnixSocket (547 ms)
[ RUN      ] Parameters/TestRpc.TestRpcHandlerLatencyMetric/SSL_UnixSocket
I20260929 06:28:21.969973  1562 acceptor_pool.cc:254] collecting diagnostics on the listening RPC socket unix:/tmp/dist-test-taskZ5QskU/test-tmp/rpc-test-db566ee577c440a2b69bb27d06e2e08c.sock every 8 connection(s)
I20260929 06:28:21.970110  1563 acceptor_pool.cc:254] collecting diagnostics on the listening RPC socket unix:/tmp/dist-test-taskZ5QskU/test-tmp/rpc-test-db566ee577c440a2b69bb27d06e2e08c.sock every 8 connection(s)
I20260929 06:28:22.007810  1245 rpc-test.cc:1236] Sleep() min lat: 20345
I20260929 06:28:22.007876  1245 rpc-test.cc:1237] Sleep() mean lat: 20345
I20260929 06:28:22.007901  1245 rpc-test.cc:1238] Sleep() max lat: 20345
I20260929 06:28:22.007915  1245 rpc-test.cc:1239] Sleep() #calls: 1
[       OK ] Parameters/TestRpc.TestRpcHandlerLatencyMetric/SSL_UnixSocket (50 ms)
[ RUN      ] Parameters/TestRpc.TimedOutOnResponseMetricServiceQueue/SSL_UnixSocket
I20260929 06:28:22.019755  1588 acceptor_pool.cc:254] collecting diagnostics on the listening RPC socket unix:/tmp/dist-test-taskZ5QskU/test-tmp/rpc-test-e034e176b3e34608b2f037136f31a7ae.sock every 8 connection(s)
I20260929 06:28:22.019816  1589 acceptor_pool.cc:254] collecting diagnostics on the listening RPC socket unix:/tmp/dist-test-taskZ5QskU/test-tmp/rpc-test-e034e176b3e34608b2f037136f31a7ae.sock every 8 connection(s)
W20260929 06:28:22.070602  1590 rpcz_store.cc:267] Call kudu.rpc_test.CalculatorService.Sleep from unix:<unnamed> (request call id 2) took 20 ms (client timeout 20 ms). Trace:
W20260929 06:28:22.070708  1590 rpcz_store.cc:269] 0929 06:28:22.050326 (+     0us) service_pool.cc:170] Inserting onto call queue
0929 06:28:22.070582 (+ 20256us) service_pool.cc:214] Skipping call since client already timed out
0929 06:28:22.070591 (+     9us) inbound_call.cc:173] Queueing failure response
Metrics: {}
[       OK ] Parameters/TestRpc.TimedOutOnResponseMetricServiceQueue/SSL_UnixSocket (62 ms)
[ RUN      ] Parameters/TestRpc.RpcPendingConnectionsMetric/SSL_UnixSocket
I20260929 06:28:22.074035  1611 acceptor_pool.cc:254] collecting diagnostics on the listening RPC socket 0.0.0.0:46671 every 8 connection(s)
I20260929 06:28:22.074101  1612 acceptor_pool.cc:254] collecting diagnostics on the listening RPC socket 0.0.0.0:46671 every 8 connection(s)
W20260929 06:28:22.088002  1607 negotiation.cc:337] Failed RPC negotiation. Trace:
0929 06:28:22.086081 (+     0us) reactor.cc:625] Submitting negotiation task for server connection from 127.0.0.1:45744 (local address 127.0.0.1:46671)
0929 06:28:22.087828 (+  1747us) server_negotiation.cc:206] Beginning negotiation
0929 06:28:22.087830 (+     2us) server_negotiation.cc:399] Waiting for connection header
0929 06:28:22.087922 (+    92us) negotiation.cc:327] Negotiation complete: Network error: Server connection negotiation failed: server connection from 127.0.0.1:45744: BlockingRecv error: recv got EOF from 127.0.0.1:45744 (error 108)
Metrics: {"server-negotiator.queue_time_us":1708}
[       OK ] Parameters/TestRpc.RpcPendingConnectionsMetric/SSL_UnixSocket (22 ms)
[ RUN      ] Parameters/TestRpc.TestRpcContextClientDeadline/SSL_UnixSocket
I20260929 06:28:22.101050  1627 acceptor_pool.cc:254] collecting diagnostics on the listening RPC socket unix:/tmp/dist-test-taskZ5QskU/test-tmp/rpc-test-26ce7e78da6242b690ea6e56ef99a1d6.sock every 8 connection(s)
I20260929 06:28:22.101101  1628 acceptor_pool.cc:254] collecting diagnostics on the listening RPC socket unix:/tmp/dist-test-taskZ5QskU/test-tmp/rpc-test-26ce7e78da6242b690ea6e56ef99a1d6.sock every 8 connection(s)
W20260929 06:28:22.135170  1624 connection.cc:196] Error closing socket: Network error: TlsSocket::Close: Broken pipe
[       OK ] Parameters/TestRpc.TestRpcContextClientDeadline/SSL_UnixSocket (40 ms)
[ RUN      ] Parameters/TestRpc.TestApplicationFeatureFlagUnsupportedServer/SSL_UnixSocket
I20260929 06:28:22.152693  1652 acceptor_pool.cc:254] collecting diagnostics on the listening RPC socket unix:/tmp/dist-test-taskZ5QskU/test-tmp/rpc-test-ee1671221bf34a2c8c9d6a0f1d0db34b.sock every 8 connection(s)
I20260929 06:28:22.152750  1653 acceptor_pool.cc:254] collecting diagnostics on the listening RPC socket unix:/tmp/dist-test-taskZ5QskU/test-tmp/rpc-test-ee1671221bf34a2c8c9d6a0f1d0db34b.sock every 8 connection(s)
W20260929 06:28:22.178133  1649 connection.cc:196] Error closing socket: Network error: TlsSocket::Close: Broken pipe
[       OK ] Parameters/TestRpc.TestApplicationFeatureFlagUnsupportedServer/SSL_UnixSocket (43 ms)
[ RUN      ] Parameters/TestRpc.TestCancellationAsync/SSL_UnixSocket
I20260929 06:28:22.187911  1677 acceptor_pool.cc:254] collecting diagnostics on the listening RPC socket unix:/tmp/dist-test-taskZ5QskU/test-tmp/rpc-test-bf8d51fd4955450b9229aacd6c5ff6ee.sock every 8 connection(s)
I20260929 06:28:22.187961  1678 acceptor_pool.cc:254] collecting diagnostics on the listening RPC socket unix:/tmp/dist-test-taskZ5QskU/test-tmp/rpc-test-bf8d51fd4955450b9229aacd6c5ff6ee.sock every 8 connection(s)
I20260929 06:28:22.188156  1245 rpc-test.cc:1716] Connecting to unix:/tmp/dist-test-taskZ5QskU/test-tmp/rpc-test-bf8d51fd4955450b9229aacd6c5ff6ee.sock
I20260929 06:28:22.210347  1245 test_util.cc:268] Using random seed: 1242194730
I20260929 06:28:22.223989  1681 rpc-test-base.h:240] got call: sleep_micros: 500 pattern: 4294967295 num_repetitions: 2097152 sidecar_idx: 0
I20260929 06:28:22.234388  1681 rpc-test-base.h:240] got call: sleep_micros: 500 pattern: 4294967295 num_repetitions: 2097152 sidecar_idx: 0
I20260929 06:28:22.244725  1681 rpc-test-base.h:240] got call: sleep_micros: 500 pattern: 4294967295 num_repetitions: 2097152 sidecar_idx: 0
I20260929 06:28:22.254628  1681 rpc-test-base.h:240] got call: sleep_micros: 500 pattern: 4294967295 num_repetitions: 2097152 sidecar_idx: 0
I20260929 06:28:22.264534  1681 rpc-test-base.h:240] got call: sleep_micros: 500 pattern: 4294967295 num_repetitions: 2097152 sidecar_idx: 0
I20260929 06:28:22.274437  1681 rpc-test-base.h:240] got call: sleep_micros: 500 pattern: 4294967295 num_repetitions: 2097152 sidecar_idx: 0
I20260929 06:28:22.284477  1681 rpc-test-base.h:240] got call: sleep_micros: 500 pattern: 4294967295 num_repetitions: 2097152 sidecar_idx: 0
I20260929 06:28:22.294528  1681 rpc-test-base.h:240] got call: sleep_micros: 500 pattern: 4294967295 num_repetitions: 2097152 sidecar_idx: 0
W20260929 06:28:22.296057  1674 connection.cc:196] Error closing socket: Network error: TlsSocket::Close: Broken pipe
W20260929 06:28:22.297680  1674 connection.cc:441] server connection from unix:<unnamed> torn down before Call kudu.rpc.GenericCalculatorService.SleepWithSidecar from unix:<unnamed> (request call id 9) could send its response
[       OK ] Parameters/TestRpc.TestCancellationAsync/SSL_UnixSocket (119 ms)
[ RUN      ] Parameters/TestRpc.TestPerformanceBySocketType/SSL_UnixSocket
I20260929 06:28:22.309834  1702 acceptor_pool.cc:254] collecting diagnostics on the listening RPC socket unix:/tmp/dist-test-taskZ5QskU/test-tmp/rpc-test-c384c640396e485d852c47132c22f8fb.sock every 8 connection(s)
I20260929 06:28:22.309887  1703 acceptor_pool.cc:254] collecting diagnostics on the listening RPC socket unix:/tmp/dist-test-taskZ5QskU/test-tmp/rpc-test-c384c640396e485d852c47132c22f8fb.sock every 8 connection(s)
I20260929 06:28:22.310073  1245 rpc-test.cc:1846] Connecting to unix:/tmp/dist-test-taskZ5QskU/test-tmp/rpc-test-c384c640396e485d852c47132c22f8fb.sock
I20260929 06:28:23.489699  1245 rpc-test.cc:1859] Sending 1024MB via ssl-enabled unix socket: real 1.152s	user 1.257s	sys 0.834s
I20260929 06:28:24.628042  1245 rpc-test.cc:1859] Sending 1024MB via ssl-enabled unix socket: real 1.138s	user 1.380s	sys 0.689s
I20260929 06:28:25.783186  1245 rpc-test.cc:1859] Sending 1024MB via ssl-enabled unix socket: real 1.155s	user 1.279s	sys 0.822s
I20260929 06:28:26.996129  1245 rpc-test.cc:1859] Sending 1024MB via ssl-enabled unix socket: real 1.213s	user 1.321s	sys 0.890s
I20260929 06:28:28.136868  1245 rpc-test.cc:1859] Sending 1024MB via ssl-enabled unix socket: real 1.141s	user 1.272s	sys 0.807s
W20260929 06:28:28.137611  1699 connection.cc:196] Error closing socket: Network error: TlsSocket::Close: Broken pipe
[       OK ] Parameters/TestRpc.TestPerformanceBySocketType/SSL_UnixSocket (5839 ms)
[----------] 20 tests from Parameters/TestRpc (25407 ms total)

[----------] 1 test from Parameters/TestRpcSocketTxRxQueue
[ RUN      ] Parameters/TestRpcSocketTxRxQueue.AcceptorRxQueueSizeMetric/0
I20260929 06:28:28.145896  1727 acceptor_pool.cc:254] collecting diagnostics on the listening RPC socket 0.0.0.0:45033 every 1 connection(s)
I20260929 06:28:28.145987  1728 acceptor_pool.cc:254] collecting diagnostics on the listening RPC socket 0.0.0.0:45033 every 1 connection(s)
W20260929 06:28:28.146469  1723 negotiation.cc:337] Failed RPC negotiation. Trace:
0929 06:28:28.146339 (+     0us) reactor.cc:625] Submitting negotiation task for server connection from 127.0.0.1:42398 (local address 127.0.0.1:45033)
0929 06:28:28.146386 (+    47us) server_negotiation.cc:206] Beginning negotiation
0929 06:28:28.146388 (+     2us) server_negotiation.cc:399] Waiting for connection header
0929 06:28:28.146444 (+    56us) negotiation.cc:327] Negotiation complete: Network error: Server connection negotiation failed: server connection from 127.0.0.1:42398: BlockingRecv error: recv got EOF from 127.0.0.1:42398 (error 108)
Metrics: {"server-negotiator.queue_time_us":18}
[       OK ] Parameters/TestRpcSocketTxRxQueue.AcceptorRxQueueSizeMetric/0 (9 ms)
[----------] 1 test from Parameters/TestRpcSocketTxRxQueue (9 ms total)

[----------] Global test environment tear-down
[==========] 21 tests from 2 test suites ran. (25417 ms total)
[  PASSED  ] 20 tests.
[  FAILED  ] 1 test, listed below:
[  FAILED  ] Parameters/TestRpc.TestCallWithChainCertAndChainCA/SSL_UnixSocket, where GetParam() = (true, true)

 1 FAILED TEST