Diagnosed failure

Parameters/TestRpc.TestCallWithChainCertAndChainCA/SSL_TCP: /data0/somelongdirectorytoavoidrpathissues/src/kudu/src/kudu/rpc/rpc-test.cc:270: Failure
Failed
Bad status: Runtime error: could not verify certificate chain (error with cert: subject=CN = localhost, ST = sadfjas, C = AS, emailAddress = sdflkdsajf, O = lskdfjlsad, OU = sldfkja, issuer=C = AS, ST = ASDfkjdhf, L = lskdjf, O = saldfja, OU = skdjf, CN = localhost, emailAddress = sadjflkadsj): : certificate has expired
Google Test trace:
/data0/somelongdirectorytoavoidrpathissues/src/kudu/src/kudu/rpc/rpc-test.cc:267: Connecting to 0.0.0.0:41679
I20260929 02:45:49.151476   379 test_util.cc:175] -----------------------------------------------
I20260929 02:45:49.151556   379 test_util.cc:176] Had fatal failures, leaving test files at /tmp/dist-test-taskjd65vM/test-tmp/rpc-test.5.Parameters_TestRpc.TestCallWithChainCertAndChainCA_SSL_TCP.1790649949057030-379-0

Full log

Note: This is test shard 6 of 8.
[==========] Running 21 tests from 2 test suites.
[----------] Global test environment set-up.
[----------] 20 tests from Parameters/TestRpc
[ RUN      ] Parameters/TestRpc.TestMessengerCreateDestroy/SSL_TCP
WARNING: Logging before InitGoogleLogging() is written to STDERR
I20260929 02:45:49.093722   379 rpc-test.cc:169] started messenger TestCreateDestroy
[       OK ] Parameters/TestRpc.TestMessengerCreateDestroy/SSL_TCP (20 ms)
[ RUN      ] Parameters/TestRpc.TestNegotiationDeadlock/SSL_TCP
I20260929 02:45:49.112910   399 acceptor_pool.cc:254] collecting diagnostics on the listening RPC socket 0.0.0.0:35495 every 8 connection(s)
I20260929 02:45:49.113201   400 acceptor_pool.cc:254] collecting diagnostics on the listening RPC socket 0.0.0.0:35495 every 8 connection(s)
[       OK ] Parameters/TestRpc.TestNegotiationDeadlock/SSL_TCP (34 ms)
[ RUN      ] Parameters/TestRpc.TestCallWithChainCertAndChainCA/SSL_TCP
I20260929 02:45:49.141768   415 acceptor_pool.cc:254] collecting diagnostics on the listening RPC socket 0.0.0.0:41679 every 8 connection(s)
I20260929 02:45:49.142022   416 acceptor_pool.cc:254] collecting diagnostics on the listening RPC socket 0.0.0.0:41679 every 8 connection(s)
/data0/somelongdirectorytoavoidrpathissues/src/kudu/src/kudu/rpc/rpc-test.cc:270: Failure
Failed
Bad status: Runtime error: could not verify certificate chain (error with cert: subject=CN = localhost, ST = sadfjas, C = AS, emailAddress = sdflkdsajf, O = lskdfjlsad, OU = sldfkja, issuer=C = AS, ST = ASDfkjdhf, L = lskdjf, O = saldfja, OU = skdjf, CN = localhost, emailAddress = sadjflkadsj): : certificate has expired
Google Test trace:
/data0/somelongdirectorytoavoidrpathissues/src/kudu/src/kudu/rpc/rpc-test.cc:267: Connecting to 0.0.0.0:41679
I20260929 02:45:49.151476   379 test_util.cc:175] -----------------------------------------------
I20260929 02:45:49.151556   379 test_util.cc:176] Had fatal failures, leaving test files at /tmp/dist-test-taskjd65vM/test-tmp/rpc-test.5.Parameters_TestRpc.TestCallWithChainCertAndChainCA_SSL_TCP.1790649949057030-379-0
[  FAILED  ] Parameters/TestRpc.TestCallWithChainCertAndChainCA/SSL_TCP, where GetParam() = (true, false) (20 ms)
[ RUN      ] Parameters/TestRpc.TestCallWithPasswordProtectedKey/SSL_TCP
I20260929 02:45:49.161847   440 acceptor_pool.cc:254] collecting diagnostics on the listening RPC socket 0.0.0.0:46231 every 8 connection(s)
I20260929 02:45:49.162065   441 acceptor_pool.cc:254] collecting diagnostics on the listening RPC socket 0.0.0.0:46231 every 8 connection(s)
[       OK ] Parameters/TestRpc.TestCallWithPasswordProtectedKey/SSL_TCP (41 ms)
[ RUN      ] Parameters/TestRpc.TestCallToBadServer/SSL_TCP
I20260929 02:45:49.212208   379 rpc-test.cc:394] Status: Network error: Client connection negotiation failed: client connection to 0.0.0.0:0: connect: Connection refused (error 111)
I20260929 02:45:49.212778   379 rpc-test.cc:394] Status: Network error: Client connection negotiation failed: client connection to 0.0.0.0:0: connect: Connection refused (error 111)
I20260929 02:45:49.213294   379 rpc-test.cc:394] Status: Network error: Client connection negotiation failed: client connection to 0.0.0.0:0: connect: Connection refused (error 111)
I20260929 02:45:49.213810   379 rpc-test.cc:394] Status: Network error: Client connection negotiation failed: client connection to 0.0.0.0:0: connect: Connection refused (error 111)
I20260929 02:45:49.214294   379 rpc-test.cc:394] Status: Network error: Client connection negotiation failed: client connection to 0.0.0.0:0: connect: Connection refused (error 111)
[       OK ] Parameters/TestRpc.TestCallToBadServer/SSL_TCP (22 ms)
[ RUN      ] Parameters/TestRpc.TestWrongService/SSL_TCP
I20260929 02:45:49.247529   475 acceptor_pool.cc:254] collecting diagnostics on the listening RPC socket 0.0.0.0:35833 every 8 connection(s)
I20260929 02:45:49.247743   476 acceptor_pool.cc:254] collecting diagnostics on the listening RPC socket 0.0.0.0:35833 every 8 connection(s)
I20260929 02:45:49.276396   473 messenger.cc:345] service WrongServiceName not registered on TestServer
[       OK ] Parameters/TestRpc.TestWrongService/SSL_TCP (65 ms)
[ RUN      ] Parameters/TestRpc.TestConnectionKeepalive/SSL_TCP
I20260929 02:45:49.303570   498 acceptor_pool.cc:254] collecting diagnostics on the listening RPC socket 0.0.0.0:41747 every 8 connection(s)
I20260929 02:45:49.303803   499 acceptor_pool.cc:254] collecting diagnostics on the listening RPC socket 0.0.0.0:41747 every 8 connection(s)
I20260929 02:45:49.304596   379 rpc-test.cc:488] Connecting to 0.0.0.0:41747
[       OK ] Parameters/TestRpc.TestConnectionKeepalive/SSL_TCP (1050 ms)
[ RUN      ] Parameters/TestRpc.TestClientConnectionMetrics/SSL_TCP
I20260929 02:45:50.346237   523 acceptor_pool.cc:254] collecting diagnostics on the listening RPC socket 0.0.0.0:37157 every 8 connection(s)
I20260929 02:45:50.346451   524 acceptor_pool.cc:254] collecting diagnostics on the listening RPC socket 0.0.0.0:37157 every 8 connection(s)
I20260929 02:45:50.347250   379 rpc-test.cc:569] Connecting to 0.0.0.0:37157
[       OK ] Parameters/TestRpc.TestClientConnectionMetrics/SSL_TCP (17728 ms)
[ RUN      ] Parameters/TestRpc.TestCredentialsPolicy/SSL_TCP
I20260929 02:46:08.077126   546 acceptor_pool.cc:254] collecting diagnostics on the listening RPC socket 0.0.0.0:35913 every 8 connection(s)
I20260929 02:46:08.077332   547 acceptor_pool.cc:254] collecting diagnostics on the listening RPC socket 0.0.0.0:35913 every 8 connection(s)
I20260929 02:46:08.078213   379 rpc-test.cc:700] Connecting to 0.0.0.0:35913
[       OK ] Parameters/TestRpc.TestCredentialsPolicy/SSL_TCP (64 ms)
[ RUN      ] Parameters/TestRpc.TestCallLongerThanKeepalive/SSL_TCP
I20260929 02:46:08.139843   571 acceptor_pool.cc:254] collecting diagnostics on the listening RPC socket 0.0.0.0:41457 every 8 connection(s)
I20260929 02:46:08.140051   572 acceptor_pool.cc:254] collecting diagnostics on the listening RPC socket 0.0.0.0:41457 every 8 connection(s)
I20260929 02:46:08.158290   575 rpc-test-base.h:222] got call: sleep_micros: 3000000 deferred: true
I20260929 02:46:11.159946   575 rpcz_store.cc:275] Call kudu.rpc.GenericCalculatorService.Sleep from 127.0.0.1:55220 (request call id 0) took 3001 ms. Trace:
I20260929 02:46:11.160111   575 rpcz_store.cc:276] 0929 02:46:08.158183 (+     0us) service_pool.cc:170] Inserting onto call queue
0929 02:46:08.158245 (+    62us) service_pool.cc:227] Handling call
0929 02:46:11.159907 (+3001662us) inbound_call.cc:173] Queueing success response
Metrics: {}
[       OK ] Parameters/TestRpc.TestCallLongerThanKeepalive/SSL_TCP (3040 ms)
[ RUN      ] Parameters/TestRpc.TestRpcSidecar/SSL_TCP
I20260929 02:46:11.184569   596 acceptor_pool.cc:254] collecting diagnostics on the listening RPC socket 0.0.0.0:43815 every 8 connection(s)
I20260929 02:46:11.184747   597 acceptor_pool.cc:254] collecting diagnostics on the listening RPC socket 0.0.0.0:43815 every 8 connection(s)
[       OK ] Parameters/TestRpc.TestRpcSidecar/SSL_TCP (125 ms)
[ RUN      ] Parameters/TestRpc.TestRpcSidecarLimits/SSL_TCP
I20260929 02:46:13.284159   621 acceptor_pool.cc:254] collecting diagnostics on the listening RPC socket 0.0.0.0:33915 every 8 connection(s)
I20260929 02:46:13.284425   622 acceptor_pool.cc:254] collecting diagnostics on the listening RPC socket 0.0.0.0:33915 every 8 connection(s)
W20260929 02:46:13.312898   379 serialization.cc:72] Serialized kudu.rpc_test.PushStringsRequestPB (2147483654 bytes) is larger than the maximum configured RPC message size (52428800 bytes). Sending anyway, but peer may reject the data.
W20260929 02:46:13.318619   618 connection.cc:535] server connection from 127.0.0.1:41984 recv error: Network error: RPC frame had a length of 2147483714, but we only support messages up to 52428800 bytes long.
W20260929 02:46:13.318768   618 connection.cc:158] shutting down server connection from 127.0.0.1:41984 with pending inbound data: 4/2147483714 bytes received; last active 0 ns ago: status Network error: RPC frame had a length of 2147483714, but we only support messages up to 52428800 bytes long.
W20260929 02:46:13.319239   634 connection.cc:196] Error closing socket: Network error: TlsSocket::Close: Connection reset by peer
I20260929 02:46:13.330937   646 acceptor_pool.cc:254] collecting diagnostics on the listening RPC socket 0.0.0.0:40873 every 8 connection(s)
I20260929 02:46:13.331104   647 acceptor_pool.cc:254] collecting diagnostics on the listening RPC socket 0.0.0.0:40873 every 8 connection(s)
W20260929 02:46:18.230787   644 connection.cc:577] server connection from 127.0.0.1:34764: received bad data: 'Corruption: Invalid packet: message had a length of 2147483710, but we only support messages up to 2147483647 bytes
'
[       OK ] Parameters/TestRpc.TestRpcSidecarLimits/SSL_TCP (7350 ms)
[ RUN      ] Parameters/TestRpc.TestCallTimeoutDoesntAffectNegotiation/SSL_TCP
I20260929 02:46:18.666441   671 acceptor_pool.cc:254] collecting diagnostics on the listening RPC socket 0.0.0.0:40145 every 8 connection(s)
I20260929 02:46:18.666697   672 acceptor_pool.cc:254] collecting diagnostics on the listening RPC socket 0.0.0.0:40145 every 8 connection(s)
W20260929 02:46:18.687526   667 negotiation.cc:266] Injecting 500ms delay in negotiation
I20260929 02:46:18.737877   379 rpc-test-base.h:595] status: Timed out: connection negotiation to 0.0.0.0:40145 for RPC Sleep timed out after 0.050s (ON_OUTBOUND_QUEUE), seconds elapsed: 0.0508912
[       OK ] Parameters/TestRpc.TestCallTimeoutDoesntAffectNegotiation/SSL_TCP (555 ms)
[ RUN      ] Parameters/TestRpc.TestRpcHandlerLatencyMetric/SSL_TCP
I20260929 02:46:19.208137   696 acceptor_pool.cc:254] collecting diagnostics on the listening RPC socket 0.0.0.0:43879 every 8 connection(s)
I20260929 02:46:19.208340   697 acceptor_pool.cc:254] collecting diagnostics on the listening RPC socket 0.0.0.0:43879 every 8 connection(s)
I20260929 02:46:19.248665   379 rpc-test.cc:1236] Sleep() min lat: 20568
I20260929 02:46:19.248764   379 rpc-test.cc:1237] Sleep() mean lat: 20568
I20260929 02:46:19.248816   379 rpc-test.cc:1238] Sleep() max lat: 20568
I20260929 02:46:19.248852   379 rpc-test.cc:1239] Sleep() #calls: 1
[       OK ] Parameters/TestRpc.TestRpcHandlerLatencyMetric/SSL_TCP (56 ms)
[ RUN      ] Parameters/TestRpc.TimedOutOnResponseMetricServiceQueue/SSL_TCP
I20260929 02:46:19.267294   722 acceptor_pool.cc:254] collecting diagnostics on the listening RPC socket 0.0.0.0:43813 every 8 connection(s)
I20260929 02:46:19.267486   723 acceptor_pool.cc:254] collecting diagnostics on the listening RPC socket 0.0.0.0:43813 every 8 connection(s)
W20260929 02:46:19.325129   724 rpcz_store.cc:267] Call kudu.rpc_test.CalculatorService.Sleep from 127.0.0.1:44554 (request call id 2) took 20 ms (client timeout 20 ms). Trace:
W20260929 02:46:19.325294   724 rpcz_store.cc:269] 0929 02:46:19.304752 (+     0us) service_pool.cc:170] Inserting onto call queue
0929 02:46:19.325034 (+ 20282us) service_pool.cc:214] Skipping call since client already timed out
0929 02:46:19.325092 (+    58us) inbound_call.cc:173] Queueing failure response
Metrics: {}
[       OK ] Parameters/TestRpc.TimedOutOnResponseMetricServiceQueue/SSL_TCP (75 ms)
[ RUN      ] Parameters/TestRpc.RpcPendingConnectionsMetric/SSL_TCP
I20260929 02:46:19.333153   745 acceptor_pool.cc:254] collecting diagnostics on the listening RPC socket 0.0.0.0:46487 every 8 connection(s)
I20260929 02:46:19.333328   746 acceptor_pool.cc:254] collecting diagnostics on the listening RPC socket 0.0.0.0:46487 every 8 connection(s)
W20260929 02:46:19.342726   741 negotiation.cc:337] Failed RPC negotiation. Trace:
0929 02:46:19.342026 (+     0us) reactor.cc:625] Submitting negotiation task for server connection from 127.0.0.1:53570 (local address 127.0.0.1:46487)
0929 02:46:19.342190 (+   164us) server_negotiation.cc:206] Beginning negotiation
0929 02:46:19.342196 (+     6us) server_negotiation.cc:399] Waiting for connection header
0929 02:46:19.342355 (+   159us) negotiation.cc:327] Negotiation complete: Network error: Server connection negotiation failed: server connection from 127.0.0.1:53570: BlockingRecv error: recv got EOF from 127.0.0.1:53570 (error 108)
Metrics: {"server-negotiator.queue_time_us":31}
[       OK ] Parameters/TestRpc.RpcPendingConnectionsMetric/SSL_TCP (25 ms)
[ RUN      ] Parameters/TestRpc.TestRpcContextClientDeadline/SSL_TCP
I20260929 02:46:19.378680   761 acceptor_pool.cc:254] collecting diagnostics on the listening RPC socket 0.0.0.0:36977 every 8 connection(s)
I20260929 02:46:19.379033   762 acceptor_pool.cc:254] collecting diagnostics on the listening RPC socket 0.0.0.0:36977 every 8 connection(s)
[       OK ] Parameters/TestRpc.TestRpcContextClientDeadline/SSL_TCP (79 ms)
[ RUN      ] Parameters/TestRpc.TestApplicationFeatureFlagUnsupportedServer/SSL_TCP
I20260929 02:46:19.443670   786 acceptor_pool.cc:254] collecting diagnostics on the listening RPC socket 0.0.0.0:37841 every 8 connection(s)
I20260929 02:46:19.443881   787 acceptor_pool.cc:254] collecting diagnostics on the listening RPC socket 0.0.0.0:37841 every 8 connection(s)
[       OK ] Parameters/TestRpc.TestApplicationFeatureFlagUnsupportedServer/SSL_TCP (40 ms)
[ RUN      ] Parameters/TestRpc.TestCancellationAsync/SSL_TCP
I20260929 02:46:19.488306   811 acceptor_pool.cc:254] collecting diagnostics on the listening RPC socket 0.0.0.0:36545 every 8 connection(s)
I20260929 02:46:19.488509   812 acceptor_pool.cc:254] collecting diagnostics on the listening RPC socket 0.0.0.0:36545 every 8 connection(s)
I20260929 02:46:19.489229   379 rpc-test.cc:1716] Connecting to 0.0.0.0:36545
I20260929 02:46:19.510336   379 test_util.cc:268] Using random seed: 804396582
I20260929 02:46:19.541606   815 rpc-test-base.h:240] got call: sleep_micros: 500 pattern: 4294967295 num_repetitions: 2097152 sidecar_idx: 0
I20260929 02:46:19.559485   814 rpc-test-base.h:240] got call: sleep_micros: 500 pattern: 4294967295 num_repetitions: 2097152 sidecar_idx: 0
I20260929 02:46:19.583659   813 rpc-test-base.h:240] got call: sleep_micros: 500 pattern: 4294967295 num_repetitions: 2097152 sidecar_idx: 0
I20260929 02:46:19.609761   815 rpc-test-base.h:240] got call: sleep_micros: 500 pattern: 4294967295 num_repetitions: 2097152 sidecar_idx: 0
I20260929 02:46:19.635675   814 rpc-test-base.h:240] got call: sleep_micros: 500 pattern: 4294967295 num_repetitions: 2097152 sidecar_idx: 0
I20260929 02:46:19.664991   813 rpc-test-base.h:240] got call: sleep_micros: 500 pattern: 4294967295 num_repetitions: 2097152 sidecar_idx: 0
W20260929 02:46:19.692576   809 connection.cc:196] Error closing socket: Network error: TlsSocket::Close: Broken pipe
W20260929 02:46:19.694376   809 connection.cc:441] server connection from 127.0.0.1:38176 torn down before Call kudu.rpc.GenericCalculatorService.SleepWithSidecar from 127.0.0.1:38176 (request call id 7) could send its response
W20260929 02:46:19.703444   809 connection.cc:441] server connection from 127.0.0.1:38176 torn down before Call kudu.rpc.GenericCalculatorService.SleepWithSidecar from 127.0.0.1:38176 (request call id 8) could send its response
[       OK ] Parameters/TestRpc.TestCancellationAsync/SSL_TCP (231 ms)
[ RUN      ] Parameters/TestRpc.TestPerformanceBySocketType/SSL_TCP
I20260929 02:46:19.719636   836 acceptor_pool.cc:254] collecting diagnostics on the listening RPC socket 0.0.0.0:38163 every 8 connection(s)
I20260929 02:46:19.719864   837 acceptor_pool.cc:254] collecting diagnostics on the listening RPC socket 0.0.0.0:38163 every 8 connection(s)
I20260929 02:46:19.720614   379 rpc-test.cc:1846] Connecting to 0.0.0.0:38163
I20260929 02:46:22.381966   379 rpc-test.cc:1859] Sending 1024MB via ssl-enabled tcp socket: real 2.635s	user 2.483s	sys 1.886s
I20260929 02:46:24.942291   379 rpc-test.cc:1859] Sending 1024MB via ssl-enabled tcp socket: real 2.560s	user 2.487s	sys 1.761s
I20260929 02:46:27.590415   379 rpc-test.cc:1859] Sending 1024MB via ssl-enabled tcp socket: real 2.648s	user 2.436s	sys 1.984s
I20260929 02:46:30.125120   379 rpc-test.cc:1859] Sending 1024MB via ssl-enabled tcp socket: real 2.535s	user 2.457s	sys 1.748s
I20260929 02:46:32.723299   379 rpc-test.cc:1859] Sending 1024MB via ssl-enabled tcp socket: real 2.598s	user 2.491s	sys 1.832s
[       OK ] Parameters/TestRpc.TestPerformanceBySocketType/SSL_TCP (13022 ms)
[----------] 20 tests from Parameters/TestRpc (43653 ms total)

[----------] 1 test from Parameters/TestRpcSocketTxRxQueue
[ RUN      ] Parameters/TestRpcSocketTxRxQueue.OverCapacity/0
W20260929 02:46:33.024001   853 negotiation.cc:337] Failed RPC negotiation. Trace:
0929 02:46:32.736205 (+     0us) reactor.cc:625] Submitting negotiation task for client connection to 0.0.0.0:42701 (local address 127.0.0.1:53770)
0929 02:46:32.736400 (+   195us) negotiation.cc:107] Waiting for socket to connect
0929 02:46:32.736418 (+    18us) client_negotiation.cc:174] Beginning negotiation
0929 02:46:32.736540 (+   122us) client_negotiation.cc:252] Sending NEGOTIATE NegotiatePB request
0929 02:46:33.023637 (+287097us) negotiation.cc:327] Negotiation complete: Network error: Client connection negotiation failed: client connection to 0.0.0.0:42701: BlockingRecv error: recv error from unknown peer: Transport endpoint is not connected (error 107)
Metrics: {"client-negotiator.queue_time_us":54}
W20260929 02:46:33.024334   862 negotiation.cc:337] Failed RPC negotiation. Trace:
0929 02:46:32.738849 (+     0us) reactor.cc:625] Submitting negotiation task for client connection to 0.0.0.0:42701 (local address 127.0.0.1:53774)
0929 02:46:32.738990 (+   141us) negotiation.cc:107] Waiting for socket to connect
0929 02:46:32.739003 (+    13us) client_negotiation.cc:174] Beginning negotiation
0929 02:46:32.739329 (+   326us) client_negotiation.cc:252] Sending NEGOTIATE NegotiatePB request
0929 02:46:33.023633 (+284304us) negotiation.cc:327] Negotiation complete: Network error: Client connection negotiation failed: client connection to 0.0.0.0:42701: BlockingRecv error: recv error from unknown peer: Transport endpoint is not connected (error 107)
Metrics: {"client-negotiator.queue_time_us":44}
W20260929 02:46:33.024344   880 negotiation.cc:337] Failed RPC negotiation. Trace:
0929 02:46:32.744006 (+     0us) reactor.cc:625] Submitting negotiation task for client connection to 0.0.0.0:42701 (local address 127.0.0.1:53782)
0929 02:46:32.744158 (+   152us) negotiation.cc:107] Waiting for socket to connect
0929 02:46:32.744170 (+    12us) client_negotiation.cc:174] Beginning negotiation
0929 02:46:32.744244 (+    74us) client_negotiation.cc:252] Sending NEGOTIATE NegotiatePB request
0929 02:46:33.023664 (+279420us) negotiation.cc:327] Negotiation complete: Network error: Client connection negotiation failed: client connection to 0.0.0.0:42701: BlockingRecv error: recv error from unknown peer: Transport endpoint is not connected (error 107)
Metrics: {"client-negotiator.queue_time_us":43}
W20260929 02:46:33.025339   898 negotiation.cc:337] Failed RPC negotiation. Trace:
0929 02:46:32.748591 (+     0us) reactor.cc:625] Submitting negotiation task for client connection to 0.0.0.0:42701 (local address 127.0.0.1:53796)
0929 02:46:32.748747 (+   156us) negotiation.cc:107] Waiting for socket to connect
0929 02:46:32.748762 (+    15us) client_negotiation.cc:174] Beginning negotiation
0929 02:46:32.748843 (+    81us) client_negotiation.cc:252] Sending NEGOTIATE NegotiatePB request
0929 02:46:33.024108 (+275265us) negotiation.cc:327] Negotiation complete: Network error: Client connection negotiation failed: client connection to 0.0.0.0:42701: BlockingRecv error: recv error from unknown peer: Transport endpoint is not connected (error 107)
Metrics: {"client-negotiator.queue_time_us":43}
W20260929 02:46:33.026238   889 negotiation.cc:337] Failed RPC negotiation. Trace:
0929 02:46:32.746249 (+     0us) reactor.cc:625] Submitting negotiation task for client connection to 0.0.0.0:42701 (local address 127.0.0.1:53788)
0929 02:46:32.746393 (+   144us) negotiation.cc:107] Waiting for socket to connect
0929 02:46:32.746405 (+    12us) client_negotiation.cc:174] Beginning negotiation
0929 02:46:32.746476 (+    71us) client_negotiation.cc:252] Sending NEGOTIATE NegotiatePB request
0929 02:46:33.023957 (+277481us) negotiation.cc:327] Negotiation complete: Network error: Client connection negotiation failed: client connection to 0.0.0.0:42701: BlockingRecv error: recv error from unknown peer: Transport endpoint is not connected (error 107)
Metrics: {"client-negotiator.queue_time_us":43}
W20260929 02:46:33.026923   871 negotiation.cc:337] Failed RPC negotiation. Trace:
0929 02:46:32.741619 (+     0us) reactor.cc:625] Submitting negotiation task for client connection to 0.0.0.0:42701 (local address 127.0.0.1:53776)
0929 02:46:32.741748 (+   129us) negotiation.cc:107] Waiting for socket to connect
0929 02:46:32.741761 (+    13us) client_negotiation.cc:174] Beginning negotiation
0929 02:46:32.741871 (+   110us) client_negotiation.cc:252] Sending NEGOTIATE NegotiatePB request
0929 02:46:33.023692 (+281821us) negotiation.cc:327] Negotiation complete: Network error: Client connection negotiation failed: client connection to 0.0.0.0:42701: BlockingRecv error: recv error from unknown peer: Transport endpoint is not connected (error 107)
Metrics: {"client-negotiator.queue_time_us":28}
[       OK ] Parameters/TestRpcSocketTxRxQueue.OverCapacity/0 (1074 ms)
[----------] 1 test from Parameters/TestRpcSocketTxRxQueue (1074 ms total)

[----------] Global test environment tear-down
[==========] 21 tests from 2 test suites ran. (44728 ms total)
[  PASSED  ] 20 tests.
[  FAILED  ] 1 test, listed below:
[  FAILED  ] Parameters/TestRpc.TestCallWithChainCertAndChainCA/SSL_TCP, where GetParam() = (true, false)

 1 FAILED TEST