Diagnosed failure

Parameters/TestRpc.TestCallWithChainCertAndChainCA/SSL_UnixSocket: /data0/somelongdirectorytoavoidrpathissues/src/kudu/src/kudu/rpc/rpc-test.cc:270: Failure
Failed
Bad status: Runtime error: could not verify certificate chain (error with cert: subject=CN = localhost, ST = sadfjas, C = AS, emailAddress = sdflkdsajf, O = lskdfjlsad, OU = sldfkja, issuer=C = AS, ST = ASDfkjdhf, L = lskdjf, O = saldfja, OU = skdjf, CN = localhost, emailAddress = sadjflkadsj): : certificate has expired
Google Test trace:
/data0/somelongdirectorytoavoidrpathissues/src/kudu/src/kudu/rpc/rpc-test.cc:267: Connecting to unix:/tmp/dist-test-taski3Oeuh/test-tmp/rpc-test-0e6bcd148d034e5c9c4544e4609840d5.sock
I20260927 06:59:00.947082 10279 test_util.cc:175] -----------------------------------------------
I20260927 06:59:00.947139 10279 test_util.cc:176] Had fatal failures, leaving test files at /tmp/dist-test-taski3Oeuh/test-tmp/rpc-test.6.Parameters_TestRpc.TestCallWithChainCertAndChainCA_SSL_UnixSocket.1790492340878581-10279-0

Full log

Note: This is test shard 7 of 8.
[==========] Running 21 tests from 2 test suites.
[----------] Global test environment set-up.
[----------] 20 tests from Parameters/TestRpc
[ RUN      ] Parameters/TestRpc.TestMessengerCreateDestroy/SSL_UnixSocket
WARNING: Logging before InitGoogleLogging() is written to STDERR
I20260927 06:59:00.914232 10279 rpc-test.cc:169] started messenger TestCreateDestroy
[       OK ] Parameters/TestRpc.TestMessengerCreateDestroy/SSL_UnixSocket (33 ms)
[ RUN      ] Parameters/TestRpc.TestNegotiationDeadlock/SSL_UnixSocket
I20260927 06:59:00.921208 10299 acceptor_pool.cc:254] collecting diagnostics on the listening RPC socket unix:/tmp/dist-test-taski3Oeuh/test-tmp/rpc-test-e3a26f4d970f41779d63a10744ce3849.sock every 8 connection(s)
I20260927 06:59:00.921208 10300 acceptor_pool.cc:254] collecting diagnostics on the listening RPC socket unix:/tmp/dist-test-taski3Oeuh/test-tmp/rpc-test-e3a26f4d970f41779d63a10744ce3849.sock every 8 connection(s)
[       OK ] Parameters/TestRpc.TestNegotiationDeadlock/SSL_UnixSocket (12 ms)
[ RUN      ] Parameters/TestRpc.TestCallWithChainCertAndChainCA/SSL_UnixSocket
I20260927 06:59:00.943105 10315 acceptor_pool.cc:254] collecting diagnostics on the listening RPC socket unix:/tmp/dist-test-taski3Oeuh/test-tmp/rpc-test-0e6bcd148d034e5c9c4544e4609840d5.sock every 8 connection(s)
I20260927 06:59:00.943123 10316 acceptor_pool.cc:254] collecting diagnostics on the listening RPC socket unix:/tmp/dist-test-taski3Oeuh/test-tmp/rpc-test-0e6bcd148d034e5c9c4544e4609840d5.sock every 8 connection(s)
/data0/somelongdirectorytoavoidrpathissues/src/kudu/src/kudu/rpc/rpc-test.cc:270: Failure
Failed
Bad status: Runtime error: could not verify certificate chain (error with cert: subject=CN = localhost, ST = sadfjas, C = AS, emailAddress = sdflkdsajf, O = lskdfjlsad, OU = sldfkja, issuer=C = AS, ST = ASDfkjdhf, L = lskdjf, O = saldfja, OU = skdjf, CN = localhost, emailAddress = sadjflkadsj): : certificate has expired
Google Test trace:
/data0/somelongdirectorytoavoidrpathissues/src/kudu/src/kudu/rpc/rpc-test.cc:267: Connecting to unix:/tmp/dist-test-taski3Oeuh/test-tmp/rpc-test-0e6bcd148d034e5c9c4544e4609840d5.sock
I20260927 06:59:00.947082 10279 test_util.cc:175] -----------------------------------------------
I20260927 06:59:00.947139 10279 test_util.cc:176] Had fatal failures, leaving test files at /tmp/dist-test-taski3Oeuh/test-tmp/rpc-test.6.Parameters_TestRpc.TestCallWithChainCertAndChainCA_SSL_UnixSocket.1790492340878581-10279-0
[  FAILED  ] Parameters/TestRpc.TestCallWithChainCertAndChainCA/SSL_UnixSocket, where GetParam() = (true, true) (18 ms)
[ RUN      ] Parameters/TestRpc.TestCallWithPasswordProtectedKey/SSL_UnixSocket
I20260927 06:59:00.960700 10340 acceptor_pool.cc:254] collecting diagnostics on the listening RPC socket unix:/tmp/dist-test-taski3Oeuh/test-tmp/rpc-test-1e49515a77964847a60e42cec3e6d1b9.sock every 8 connection(s)
I20260927 06:59:00.960711 10341 acceptor_pool.cc:254] collecting diagnostics on the listening RPC socket unix:/tmp/dist-test-taski3Oeuh/test-tmp/rpc-test-1e49515a77964847a60e42cec3e6d1b9.sock every 8 connection(s)
W20260927 06:59:00.972460 10337 connection.cc:196] Error closing socket: Network error: TlsSocket::Close: Broken pipe
[       OK ] Parameters/TestRpc.TestCallWithPasswordProtectedKey/SSL_UnixSocket (26 ms)
[ RUN      ] Parameters/TestRpc.TestCallToBadServer/SSL_UnixSocket
I20260927 06:59:00.985496 10279 rpc-test.cc:394] Status: Network error: Client connection negotiation failed: client connection to 0.0.0.0:0: connect: Connection refused (error 111)
I20260927 06:59:00.985838 10279 rpc-test.cc:394] Status: Network error: Client connection negotiation failed: client connection to 0.0.0.0:0: connect: Connection refused (error 111)
I20260927 06:59:00.986207 10279 rpc-test.cc:394] Status: Network error: Client connection negotiation failed: client connection to 0.0.0.0:0: connect: Connection refused (error 111)
I20260927 06:59:00.986610 10279 rpc-test.cc:394] Status: Network error: Client connection negotiation failed: client connection to 0.0.0.0:0: connect: Connection refused (error 111)
I20260927 06:59:00.986902 10279 rpc-test.cc:394] Status: Network error: Client connection negotiation failed: client connection to 0.0.0.0:0: connect: Connection refused (error 111)
[       OK ] Parameters/TestRpc.TestCallToBadServer/SSL_UnixSocket (14 ms)
[ RUN      ] Parameters/TestRpc.TestWrongService/SSL_UnixSocket
I20260927 06:59:01.001184 10375 acceptor_pool.cc:254] collecting diagnostics on the listening RPC socket unix:/tmp/dist-test-taski3Oeuh/test-tmp/rpc-test-2fecc06041ce44cea5a49a4b12690f3f.sock every 8 connection(s)
I20260927 06:59:01.001226 10376 acceptor_pool.cc:254] collecting diagnostics on the listening RPC socket unix:/tmp/dist-test-taski3Oeuh/test-tmp/rpc-test-2fecc06041ce44cea5a49a4b12690f3f.sock every 8 connection(s)
I20260927 06:59:01.024008 10372 messenger.cc:345] service WrongServiceName not registered on TestServer
[       OK ] Parameters/TestRpc.TestWrongService/SSL_UnixSocket (38 ms)
[ RUN      ] Parameters/TestRpc.TestConnectionKeepalive/SSL_UnixSocket
I20260927 06:59:01.045972 10398 acceptor_pool.cc:254] collecting diagnostics on the listening RPC socket unix:/tmp/dist-test-taski3Oeuh/test-tmp/rpc-test-1241ee641e3246788b197d28c96ded8d.sock every 8 connection(s)
I20260927 06:59:01.046013 10399 acceptor_pool.cc:254] collecting diagnostics on the listening RPC socket unix:/tmp/dist-test-taski3Oeuh/test-tmp/rpc-test-1241ee641e3246788b197d28c96ded8d.sock every 8 connection(s)
I20260927 06:59:01.046177 10279 rpc-test.cc:488] Connecting to unix:/tmp/dist-test-taski3Oeuh/test-tmp/rpc-test-1241ee641e3246788b197d28c96ded8d.sock
W20260927 06:59:01.527829 10411 connection.cc:196] Error closing socket: Network error: TlsSocket::Close: Broken pipe
[       OK ] Parameters/TestRpc.TestConnectionKeepalive/SSL_UnixSocket (1048 ms)
[ RUN      ] Parameters/TestRpc.TestClientConnectionMetrics/SSL_UnixSocket
I20260927 06:59:02.098524 10423 acceptor_pool.cc:254] collecting diagnostics on the listening RPC socket unix:/tmp/dist-test-taski3Oeuh/test-tmp/rpc-test-4ce976f0b6504da387e67d132e8502f6.sock every 8 connection(s)
I20260927 06:59:02.098582 10424 acceptor_pool.cc:254] collecting diagnostics on the listening RPC socket unix:/tmp/dist-test-taski3Oeuh/test-tmp/rpc-test-4ce976f0b6504da387e67d132e8502f6.sock every 8 connection(s)
I20260927 06:59:02.098747 10279 rpc-test.cc:569] Connecting to unix:/tmp/dist-test-taski3Oeuh/test-tmp/rpc-test-4ce976f0b6504da387e67d132e8502f6.sock
W20260927 06:59:10.681777 10420 connection.cc:196] Error closing socket: Network error: TlsSocket::Close: Broken pipe
[       OK ] Parameters/TestRpc.TestClientConnectionMetrics/SSL_UnixSocket (8608 ms)
[ RUN      ] Parameters/TestRpc.TestCredentialsPolicy/SSL_UnixSocket
I20260927 06:59:10.692593 10446 acceptor_pool.cc:254] collecting diagnostics on the listening RPC socket unix:/tmp/dist-test-taski3Oeuh/test-tmp/rpc-test-f0140c95a5774fc38685adeb97938101.sock every 8 connection(s)
I20260927 06:59:10.692729 10447 acceptor_pool.cc:254] collecting diagnostics on the listening RPC socket unix:/tmp/dist-test-taski3Oeuh/test-tmp/rpc-test-f0140c95a5774fc38685adeb97938101.sock every 8 connection(s)
I20260927 06:59:10.692835 10279 rpc-test.cc:700] Connecting to unix:/tmp/dist-test-taski3Oeuh/test-tmp/rpc-test-f0140c95a5774fc38685adeb97938101.sock
W20260927 06:59:10.706162 10445 connection.cc:196] Error closing socket: Network error: TlsSocket::Close: Broken pipe
[       OK ] Parameters/TestRpc.TestCredentialsPolicy/SSL_UnixSocket (28 ms)
[ RUN      ] Parameters/TestRpc.TestCallLongerThanKeepalive/SSL_UnixSocket
I20260927 06:59:10.720249 10471 acceptor_pool.cc:254] collecting diagnostics on the listening RPC socket unix:/tmp/dist-test-taski3Oeuh/test-tmp/rpc-test-373c15545fb04884bcbada91674b5864.sock every 8 connection(s)
I20260927 06:59:10.720284 10472 acceptor_pool.cc:254] collecting diagnostics on the listening RPC socket unix:/tmp/dist-test-taski3Oeuh/test-tmp/rpc-test-373c15545fb04884bcbada91674b5864.sock every 8 connection(s)
I20260927 06:59:10.733704 10475 rpc-test-base.h:222] got call: sleep_micros: 3000000 deferred: true
I20260927 06:59:13.734452 10475 rpcz_store.cc:275] Call kudu.rpc.GenericCalculatorService.Sleep from unix:<unnamed> (request call id 0) took 3000 ms. Trace:
I20260927 06:59:13.734576 10475 rpcz_store.cc:276] 0927 06:59:10.733610 (+     0us) service_pool.cc:170] Inserting onto call queue
0927 06:59:10.733681 (+    71us) service_pool.cc:227] Handling call
0927 06:59:13.734427 (+3000746us) inbound_call.cc:173] Queueing success response
Metrics: {}
[       OK ] Parameters/TestRpc.TestCallLongerThanKeepalive/SSL_UnixSocket (3025 ms)
[ RUN      ] Parameters/TestRpc.TestRpcSidecar/SSL_UnixSocket
I20260927 06:59:13.779284 10496 acceptor_pool.cc:254] collecting diagnostics on the listening RPC socket unix:/tmp/dist-test-taski3Oeuh/test-tmp/rpc-test-ac7278570f4346b495979803d4af40cb.sock every 8 connection(s)
I20260927 06:59:13.779309 10497 acceptor_pool.cc:254] collecting diagnostics on the listening RPC socket unix:/tmp/dist-test-taski3Oeuh/test-tmp/rpc-test-ac7278570f4346b495979803d4af40cb.sock every 8 connection(s)
W20260927 06:59:13.812808 10493 connection.cc:196] Error closing socket: Network error: TlsSocket::Close: Broken pipe
[       OK ] Parameters/TestRpc.TestRpcSidecar/SSL_UnixSocket (77 ms)
[ RUN      ] Parameters/TestRpc.TestRpcSidecarLimits/SSL_UnixSocket
I20260927 06:59:15.558827 10521 acceptor_pool.cc:254] collecting diagnostics on the listening RPC socket unix:/tmp/dist-test-taski3Oeuh/test-tmp/rpc-test-e1658328dfed47409214044ac77511d1.sock every 8 connection(s)
I20260927 06:59:15.558848 10522 acceptor_pool.cc:254] collecting diagnostics on the listening RPC socket unix:/tmp/dist-test-taski3Oeuh/test-tmp/rpc-test-e1658328dfed47409214044ac77511d1.sock every 8 connection(s)
W20260927 06:59:15.566198 10279 serialization.cc:72] Serialized kudu.rpc_test.PushStringsRequestPB (2147483654 bytes) is larger than the maximum configured RPC message size (52428800 bytes). Sending anyway, but peer may reject the data.
W20260927 06:59:15.569146 10518 connection.cc:535] server connection from unix:<unnamed> recv error: Network error: RPC frame had a length of 2147483714, but we only support messages up to 52428800 bytes long.
W20260927 06:59:15.569207 10518 connection.cc:158] shutting down server connection from unix:<unnamed> with pending inbound data: 4/2147483714 bytes received; last active 0 ns ago: status Network error: RPC frame had a length of 2147483714, but we only support messages up to 52428800 bytes long.
W20260927 06:59:15.569396 10534 connection.cc:196] Error closing socket: Network error: TlsSocket::Close: Broken pipe
I20260927 06:59:15.593055 10546 acceptor_pool.cc:254] collecting diagnostics on the listening RPC socket unix:/tmp/dist-test-taski3Oeuh/test-tmp/rpc-test-e1658328dfed47409214044ac77511d1.sock every 8 connection(s)
I20260927 06:59:15.593091 10547 acceptor_pool.cc:254] collecting diagnostics on the listening RPC socket unix:/tmp/dist-test-taski3Oeuh/test-tmp/rpc-test-e1658328dfed47409214044ac77511d1.sock every 8 connection(s)
W20260927 06:59:20.211956 10543 connection.cc:577] server connection from unix:<unnamed>: received bad data: 'Corruption: Invalid packet: message had a length of 2147483710, but we only support messages up to 2147483647 bytes
'
W20260927 06:59:20.212232 10559 connection.cc:196] Error closing socket: Network error: TlsSocket::Close: Broken pipe
[       OK ] Parameters/TestRpc.TestRpcSidecarLimits/SSL_UnixSocket (6399 ms)
[ RUN      ] Parameters/TestRpc.TestCallTimeoutDoesntAffectNegotiation/SSL_UnixSocket
I20260927 06:59:20.239044 10571 acceptor_pool.cc:254] collecting diagnostics on the listening RPC socket unix:/tmp/dist-test-taski3Oeuh/test-tmp/rpc-test-2380f5aabbe74ebaa71de91fd4b966ca.sock every 8 connection(s)
I20260927 06:59:20.239059 10572 acceptor_pool.cc:254] collecting diagnostics on the listening RPC socket unix:/tmp/dist-test-taski3Oeuh/test-tmp/rpc-test-2380f5aabbe74ebaa71de91fd4b966ca.sock every 8 connection(s)
W20260927 06:59:20.307026 10567 negotiation.cc:266] Injecting 500ms delay in negotiation
I20260927 06:59:20.357641 10279 rpc-test-base.h:595] status: Timed out: connection negotiation to unix:/tmp/dist-test-taski3Oeuh/test-tmp/rpc-test-2380f5aabbe74ebaa71de91fd4b966ca.sock for RPC Sleep timed out after 0.050s (ON_OUTBOUND_QUEUE), seconds elapsed: 0.0510089
W20260927 06:59:20.811419 10568 connection.cc:196] Error closing socket: Network error: TlsSocket::Close: Broken pipe
[       OK ] Parameters/TestRpc.TestCallTimeoutDoesntAffectNegotiation/SSL_UnixSocket (598 ms)
[ RUN      ] Parameters/TestRpc.TestRpcHandlerLatencyMetric/SSL_UnixSocket
I20260927 06:59:20.830994 10596 acceptor_pool.cc:254] collecting diagnostics on the listening RPC socket unix:/tmp/dist-test-taski3Oeuh/test-tmp/rpc-test-955d7152df884875a47a122cf58c2523.sock every 8 connection(s)
I20260927 06:59:20.831030 10597 acceptor_pool.cc:254] collecting diagnostics on the listening RPC socket unix:/tmp/dist-test-taski3Oeuh/test-tmp/rpc-test-955d7152df884875a47a122cf58c2523.sock every 8 connection(s)
I20260927 06:59:20.862648 10279 rpc-test.cc:1236] Sleep() min lat: 20283
I20260927 06:59:20.862721 10279 rpc-test.cc:1237] Sleep() mean lat: 20283
I20260927 06:59:20.862748 10279 rpc-test.cc:1238] Sleep() max lat: 20283
I20260927 06:59:20.862762 10279 rpc-test.cc:1239] Sleep() #calls: 1
[       OK ] Parameters/TestRpc.TestRpcHandlerLatencyMetric/SSL_UnixSocket (52 ms)
[ RUN      ] Parameters/TestRpc.TimedOutOnResponseMetricServiceQueue/SSL_UnixSocket
I20260927 06:59:20.875996 10622 acceptor_pool.cc:254] collecting diagnostics on the listening RPC socket unix:/tmp/dist-test-taski3Oeuh/test-tmp/rpc-test-fb0056a12f584fcfa23adc03c78bc117.sock every 8 connection(s)
I20260927 06:59:20.876042 10623 acceptor_pool.cc:254] collecting diagnostics on the listening RPC socket unix:/tmp/dist-test-taski3Oeuh/test-tmp/rpc-test-fb0056a12f584fcfa23adc03c78bc117.sock every 8 connection(s)
W20260927 06:59:20.934196 10624 rpcz_store.cc:267] Call kudu.rpc_test.CalculatorService.Sleep from unix:<unnamed> (request call id 2) took 20 ms (client timeout 20 ms). Trace:
W20260927 06:59:20.934317 10624 rpcz_store.cc:269] 0927 06:59:20.913943 (+     0us) service_pool.cc:170] Inserting onto call queue
0927 06:59:20.934165 (+ 20222us) service_pool.cc:214] Skipping call since client already timed out
0927 06:59:20.934179 (+    14us) inbound_call.cc:173] Queueing failure response
Metrics: {}
W20260927 06:59:20.935022 10619 connection.cc:196] Error closing socket: Network error: TlsSocket::Close: Broken pipe
[       OK ] Parameters/TestRpc.TimedOutOnResponseMetricServiceQueue/SSL_UnixSocket (71 ms)
[ RUN      ] Parameters/TestRpc.RpcPendingConnectionsMetric/SSL_UnixSocket
I20260927 06:59:20.937549 10645 acceptor_pool.cc:254] collecting diagnostics on the listening RPC socket 0.0.0.0:36243 every 8 connection(s)
I20260927 06:59:20.937616 10646 acceptor_pool.cc:254] collecting diagnostics on the listening RPC socket 0.0.0.0:36243 every 8 connection(s)
W20260927 06:59:20.938261 10641 negotiation.cc:337] Failed RPC negotiation. Trace:
0927 06:59:20.938090 (+     0us) reactor.cc:625] Submitting negotiation task for server connection from 127.0.0.1:51536 (local address 127.0.0.1:36243)
0927 06:59:20.938132 (+    42us) server_negotiation.cc:206] Beginning negotiation
0927 06:59:20.938133 (+     1us) server_negotiation.cc:399] Waiting for connection header
0927 06:59:20.938207 (+    74us) negotiation.cc:327] Negotiation complete: Network error: Server connection negotiation failed: server connection from 127.0.0.1:51536: BlockingRecv error: recv got EOF from 127.0.0.1:51536 (error 108)
Metrics: {"server-negotiator.queue_time_us":15}
[       OK ] Parameters/TestRpc.RpcPendingConnectionsMetric/SSL_UnixSocket (13 ms)
[ RUN      ] Parameters/TestRpc.TestRpcContextClientDeadline/SSL_UnixSocket
I20260927 06:59:20.975637 10661 acceptor_pool.cc:254] collecting diagnostics on the listening RPC socket unix:/tmp/dist-test-taski3Oeuh/test-tmp/rpc-test-e30149cbecca4527955a637990eff962.sock every 8 connection(s)
I20260927 06:59:20.975653 10662 acceptor_pool.cc:254] collecting diagnostics on the listening RPC socket unix:/tmp/dist-test-taski3Oeuh/test-tmp/rpc-test-e30149cbecca4527955a637990eff962.sock every 8 connection(s)
[       OK ] Parameters/TestRpc.TestRpcContextClientDeadline/SSL_UnixSocket (59 ms)
[ RUN      ] Parameters/TestRpc.TestApplicationFeatureFlagUnsupportedServer/SSL_UnixSocket
I20260927 06:59:21.017831 10687 acceptor_pool.cc:254] collecting diagnostics on the listening RPC socket unix:/tmp/dist-test-taski3Oeuh/test-tmp/rpc-test-1e7a5d80c4924783ab47791e54f10b2e.sock every 8 connection(s)
I20260927 06:59:21.017804 10686 acceptor_pool.cc:254] collecting diagnostics on the listening RPC socket unix:/tmp/dist-test-taski3Oeuh/test-tmp/rpc-test-1e7a5d80c4924783ab47791e54f10b2e.sock every 8 connection(s)
[       OK ] Parameters/TestRpc.TestApplicationFeatureFlagUnsupportedServer/SSL_UnixSocket (33 ms)
[ RUN      ] Parameters/TestRpc.TestCancellationAsync/SSL_UnixSocket
I20260927 06:59:21.060261 10711 acceptor_pool.cc:254] collecting diagnostics on the listening RPC socket unix:/tmp/dist-test-taski3Oeuh/test-tmp/rpc-test-fabb4ff854c741eb9bf855cbcfdd3181.sock every 8 connection(s)
I20260927 06:59:21.060280 10712 acceptor_pool.cc:254] collecting diagnostics on the listening RPC socket unix:/tmp/dist-test-taski3Oeuh/test-tmp/rpc-test-fabb4ff854c741eb9bf855cbcfdd3181.sock every 8 connection(s)
I20260927 06:59:21.060475 10279 rpc-test.cc:1716] Connecting to unix:/tmp/dist-test-taski3Oeuh/test-tmp/rpc-test-fabb4ff854c741eb9bf855cbcfdd3181.sock
I20260927 06:59:21.070065 10279 test_util.cc:268] Using random seed: 2099746285
I20260927 06:59:21.086791 10715 rpc-test-base.h:240] got call: sleep_micros: 500 pattern: 4294967295 num_repetitions: 2097152 sidecar_idx: 0
I20260927 06:59:21.100492 10715 rpc-test-base.h:240] got call: sleep_micros: 500 pattern: 4294967295 num_repetitions: 2097152 sidecar_idx: 0
I20260927 06:59:21.112730 10715 rpc-test-base.h:240] got call: sleep_micros: 500 pattern: 4294967295 num_repetitions: 2097152 sidecar_idx: 0
I20260927 06:59:21.123492 10715 rpc-test-base.h:240] got call: sleep_micros: 500 pattern: 4294967295 num_repetitions: 2097152 sidecar_idx: 0
I20260927 06:59:21.135146 10715 rpc-test-base.h:240] got call: sleep_micros: 500 pattern: 4294967295 num_repetitions: 2097152 sidecar_idx: 0
I20260927 06:59:21.146119 10715 rpc-test-base.h:240] got call: sleep_micros: 500 pattern: 4294967295 num_repetitions: 2097152 sidecar_idx: 0
I20260927 06:59:21.157835 10715 rpc-test-base.h:240] got call: sleep_micros: 500 pattern: 4294967295 num_repetitions: 2097152 sidecar_idx: 0
I20260927 06:59:21.169685 10715 rpc-test-base.h:240] got call: sleep_micros: 500 pattern: 4294967295 num_repetitions: 2097152 sidecar_idx: 0
W20260927 06:59:21.171721 10708 connection.cc:196] Error closing socket: Network error: TlsSocket::Close: Broken pipe
W20260927 06:59:21.173362 10708 connection.cc:441] server connection from unix:<unnamed> torn down before Call kudu.rpc.GenericCalculatorService.SleepWithSidecar from unix:<unnamed> (request call id 9) could send its response
[       OK ] Parameters/TestRpc.TestCancellationAsync/SSL_UnixSocket (131 ms)
[ RUN      ] Parameters/TestRpc.TestPerformanceBySocketType/SSL_UnixSocket
I20260927 06:59:21.188208 10736 acceptor_pool.cc:254] collecting diagnostics on the listening RPC socket unix:/tmp/dist-test-taski3Oeuh/test-tmp/rpc-test-9c2239e9ac5c4019888542aca52ff698.sock every 8 connection(s)
I20260927 06:59:21.188251 10737 acceptor_pool.cc:254] collecting diagnostics on the listening RPC socket unix:/tmp/dist-test-taski3Oeuh/test-tmp/rpc-test-9c2239e9ac5c4019888542aca52ff698.sock every 8 connection(s)
I20260927 06:59:21.188432 10279 rpc-test.cc:1846] Connecting to unix:/tmp/dist-test-taski3Oeuh/test-tmp/rpc-test-9c2239e9ac5c4019888542aca52ff698.sock
I20260927 06:59:22.668742 10279 rpc-test.cc:1859] Sending 1024MB via ssl-enabled unix socket: real 1.476s	user 1.549s	sys 1.037s
I20260927 06:59:24.088997 10279 rpc-test.cc:1859] Sending 1024MB via ssl-enabled unix socket: real 1.420s	user 1.638s	sys 0.874s
I20260927 06:59:25.404274 10279 rpc-test.cc:1859] Sending 1024MB via ssl-enabled unix socket: real 1.315s	user 1.386s	sys 0.950s
I20260927 06:59:26.752106 10279 rpc-test.cc:1859] Sending 1024MB via ssl-enabled unix socket: real 1.348s	user 1.373s	sys 1.017s
I20260927 06:59:28.078725 10279 rpc-test.cc:1859] Sending 1024MB via ssl-enabled unix socket: real 1.327s	user 1.434s	sys 0.928s
W20260927 06:59:28.080228 10733 connection.cc:196] Error closing socket: Network error: TlsSocket::Close: Broken pipe
[       OK ] Parameters/TestRpc.TestPerformanceBySocketType/SSL_UnixSocket (6906 ms)
[----------] 20 tests from Parameters/TestRpc (27200 ms total)

[----------] 1 test from Parameters/TestRpcSocketTxRxQueue
[ RUN      ] Parameters/TestRpcSocketTxRxQueue.AcceptorRxQueueSizeMetric/0
I20260927 06:59:28.083282 10761 acceptor_pool.cc:254] collecting diagnostics on the listening RPC socket 0.0.0.0:39827 every 1 connection(s)
I20260927 06:59:28.083350 10762 acceptor_pool.cc:254] collecting diagnostics on the listening RPC socket 0.0.0.0:39827 every 1 connection(s)
W20260927 06:59:28.083930 10757 negotiation.cc:337] Failed RPC negotiation. Trace:
0927 06:59:28.083790 (+     0us) reactor.cc:625] Submitting negotiation task for server connection from 127.0.0.1:33984 (local address 127.0.0.1:39827)
0927 06:59:28.083844 (+    54us) server_negotiation.cc:206] Beginning negotiation
0927 06:59:28.083846 (+     2us) server_negotiation.cc:399] Waiting for connection header
0927 06:59:28.083904 (+    58us) negotiation.cc:327] Negotiation complete: Network error: Server connection negotiation failed: server connection from 127.0.0.1:33984: BlockingRecv error: recv got EOF from 127.0.0.1:33984 (error 108)
Metrics: {"server-negotiator.queue_time_us":18}
[       OK ] Parameters/TestRpcSocketTxRxQueue.AcceptorRxQueueSizeMetric/0 (4 ms)
[----------] 1 test from Parameters/TestRpcSocketTxRxQueue (4 ms total)

[----------] Global test environment tear-down
[==========] 21 tests from 2 test suites ran. (27204 ms total)
[  PASSED  ] 20 tests.
[  FAILED  ] 1 test, listed below:
[  FAILED  ] Parameters/TestRpc.TestCallWithChainCertAndChainCA/SSL_UnixSocket, where GetParam() = (true, true)

 1 FAILED TEST