Diagnosed failure

Parameters/TestRpc.TestCallWithChainCertAndChainCA/SSL_TCP: /data0/somelongdirectorytoavoidrpathissues/src/kudu/src/kudu/rpc/rpc-test.cc:270: Failure
Failed
Bad status: Runtime error: could not verify certificate chain (error with cert: subject=CN = localhost, ST = sadfjas, C = AS, emailAddress = sdflkdsajf, O = lskdfjlsad, OU = sldfkja, issuer=C = AS, ST = ASDfkjdhf, L = lskdjf, O = saldfja, OU = skdjf, CN = localhost, emailAddress = sadjflkadsj): : certificate has expired
Google Test trace:
/data0/somelongdirectorytoavoidrpathissues/src/kudu/src/kudu/rpc/rpc-test.cc:267: Connecting to 0.0.0.0:45907
I20260926 19:31:27.784389   379 test_util.cc:175] -----------------------------------------------
I20260926 19:31:27.784534   379 test_util.cc:176] Had fatal failures, leaving test files at /tmp/dist-test-taskCw0OOn/test-tmp/rpc-test.5.Parameters_TestRpc.TestCallWithChainCertAndChainCA_SSL_TCP.1790451087658918-379-0

Full log

Note: This is test shard 6 of 8.
[==========] Running 21 tests from 2 test suites.
[----------] Global test environment set-up.
[----------] 20 tests from Parameters/TestRpc
[ RUN      ] Parameters/TestRpc.TestMessengerCreateDestroy/SSL_TCP
WARNING: Logging before InitGoogleLogging() is written to STDERR
I20260926 19:31:27.711977   379 rpc-test.cc:169] started messenger TestCreateDestroy
[       OK ] Parameters/TestRpc.TestMessengerCreateDestroy/SSL_TCP (36 ms)
[ RUN      ] Parameters/TestRpc.TestNegotiationDeadlock/SSL_TCP
I20260926 19:31:27.737632   399 acceptor_pool.cc:254] collecting diagnostics on the listening RPC socket 0.0.0.0:45635 every 8 connection(s)
I20260926 19:31:27.737836   400 acceptor_pool.cc:254] collecting diagnostics on the listening RPC socket 0.0.0.0:45635 every 8 connection(s)
[       OK ] Parameters/TestRpc.TestNegotiationDeadlock/SSL_TCP (41 ms)
[ RUN      ] Parameters/TestRpc.TestCallWithChainCertAndChainCA/SSL_TCP
I20260926 19:31:27.773394   415 acceptor_pool.cc:254] collecting diagnostics on the listening RPC socket 0.0.0.0:45907 every 8 connection(s)
I20260926 19:31:27.773689   416 acceptor_pool.cc:254] collecting diagnostics on the listening RPC socket 0.0.0.0:45907 every 8 connection(s)
/data0/somelongdirectorytoavoidrpathissues/src/kudu/src/kudu/rpc/rpc-test.cc:270: Failure
Failed
Bad status: Runtime error: could not verify certificate chain (error with cert: subject=CN = localhost, ST = sadfjas, C = AS, emailAddress = sdflkdsajf, O = lskdfjlsad, OU = sldfkja, issuer=C = AS, ST = ASDfkjdhf, L = lskdjf, O = saldfja, OU = skdjf, CN = localhost, emailAddress = sadjflkadsj): : certificate has expired
Google Test trace:
/data0/somelongdirectorytoavoidrpathissues/src/kudu/src/kudu/rpc/rpc-test.cc:267: Connecting to 0.0.0.0:45907
I20260926 19:31:27.784389   379 test_util.cc:175] -----------------------------------------------
I20260926 19:31:27.784534   379 test_util.cc:176] Had fatal failures, leaving test files at /tmp/dist-test-taskCw0OOn/test-tmp/rpc-test.5.Parameters_TestRpc.TestCallWithChainCertAndChainCA_SSL_TCP.1790451087658918-379-0
[  FAILED  ] Parameters/TestRpc.TestCallWithChainCertAndChainCA/SSL_TCP, where GetParam() = (true, false) (27 ms)
[ RUN      ] Parameters/TestRpc.TestCallWithPasswordProtectedKey/SSL_TCP
I20260926 19:31:27.836027   440 acceptor_pool.cc:254] collecting diagnostics on the listening RPC socket 0.0.0.0:41067 every 8 connection(s)
I20260926 19:31:27.836239   441 acceptor_pool.cc:254] collecting diagnostics on the listening RPC socket 0.0.0.0:41067 every 8 connection(s)
[       OK ] Parameters/TestRpc.TestCallWithPasswordProtectedKey/SSL_TCP (86 ms)
[ RUN      ] Parameters/TestRpc.TestCallToBadServer/SSL_TCP
I20260926 19:31:27.883838   379 rpc-test.cc:394] Status: Network error: Client connection negotiation failed: client connection to 0.0.0.0:0: connect: Connection refused (error 111)
I20260926 19:31:27.884591   379 rpc-test.cc:394] Status: Network error: Client connection negotiation failed: client connection to 0.0.0.0:0: connect: Connection refused (error 111)
I20260926 19:31:27.885300   379 rpc-test.cc:394] Status: Network error: Client connection negotiation failed: client connection to 0.0.0.0:0: connect: Connection refused (error 111)
I20260926 19:31:27.885947   379 rpc-test.cc:394] Status: Network error: Client connection negotiation failed: client connection to 0.0.0.0:0: connect: Connection refused (error 111)
I20260926 19:31:27.886508   379 rpc-test.cc:394] Status: Network error: Client connection negotiation failed: client connection to 0.0.0.0:0: connect: Connection refused (error 111)
[       OK ] Parameters/TestRpc.TestCallToBadServer/SSL_TCP (17 ms)
[ RUN      ] Parameters/TestRpc.TestWrongService/SSL_TCP
I20260926 19:31:27.900693   475 acceptor_pool.cc:254] collecting diagnostics on the listening RPC socket 0.0.0.0:40967 every 8 connection(s)
I20260926 19:31:27.900898   476 acceptor_pool.cc:254] collecting diagnostics on the listening RPC socket 0.0.0.0:40967 every 8 connection(s)
I20260926 19:31:27.923029   474 messenger.cc:345] service WrongServiceName not registered on TestServer
[       OK ] Parameters/TestRpc.TestWrongService/SSL_TCP (39 ms)
[ RUN      ] Parameters/TestRpc.TestConnectionKeepalive/SSL_TCP
I20260926 19:31:27.950685   498 acceptor_pool.cc:254] collecting diagnostics on the listening RPC socket 0.0.0.0:39443 every 8 connection(s)
I20260926 19:31:27.950942   499 acceptor_pool.cc:254] collecting diagnostics on the listening RPC socket 0.0.0.0:39443 every 8 connection(s)
I20260926 19:31:27.951766   379 rpc-test.cc:488] Connecting to 0.0.0.0:39443
[       OK ] Parameters/TestRpc.TestConnectionKeepalive/SSL_TCP (1058 ms)
[ RUN      ] Parameters/TestRpc.TestClientConnectionMetrics/SSL_TCP
I20260926 19:31:29.004693   523 acceptor_pool.cc:254] collecting diagnostics on the listening RPC socket 0.0.0.0:39375 every 8 connection(s)
I20260926 19:31:29.004943   524 acceptor_pool.cc:254] collecting diagnostics on the listening RPC socket 0.0.0.0:39375 every 8 connection(s)
I20260926 19:31:29.005841   379 rpc-test.cc:569] Connecting to 0.0.0.0:39375
[       OK ] Parameters/TestRpc.TestClientConnectionMetrics/SSL_TCP (18765 ms)
[ RUN      ] Parameters/TestRpc.TestCredentialsPolicy/SSL_TCP
I20260926 19:31:47.786396   546 acceptor_pool.cc:254] collecting diagnostics on the listening RPC socket 0.0.0.0:44793 every 8 connection(s)
I20260926 19:31:47.786638   547 acceptor_pool.cc:254] collecting diagnostics on the listening RPC socket 0.0.0.0:44793 every 8 connection(s)
I20260926 19:31:47.787562   379 rpc-test.cc:700] Connecting to 0.0.0.0:44793
[       OK ] Parameters/TestRpc.TestCredentialsPolicy/SSL_TCP (82 ms)
[ RUN      ] Parameters/TestRpc.TestCallLongerThanKeepalive/SSL_TCP
I20260926 19:31:47.846547   571 acceptor_pool.cc:254] collecting diagnostics on the listening RPC socket 0.0.0.0:37805 every 8 connection(s)
I20260926 19:31:47.846767   572 acceptor_pool.cc:254] collecting diagnostics on the listening RPC socket 0.0.0.0:37805 every 8 connection(s)
I20260926 19:31:47.873571   575 rpc-test-base.h:222] got call: sleep_micros: 3000000 deferred: true
I20260926 19:31:50.875279   575 rpcz_store.cc:275] Call kudu.rpc.GenericCalculatorService.Sleep from 127.0.0.1:39200 (request call id 0) took 3001 ms. Trace:
I20260926 19:31:50.875478   575 rpcz_store.cc:276] 0926 19:31:47.873451 (+     0us) service_pool.cc:170] Inserting onto call queue
0926 19:31:47.873525 (+    74us) service_pool.cc:227] Handling call
0926 19:31:50.875231 (+3001706us) inbound_call.cc:173] Queueing success response
Metrics: {}
[       OK ] Parameters/TestRpc.TestCallLongerThanKeepalive/SSL_TCP (3046 ms)
[ RUN      ] Parameters/TestRpc.TestRpcSidecar/SSL_TCP
I20260926 19:31:50.892935   596 acceptor_pool.cc:254] collecting diagnostics on the listening RPC socket 0.0.0.0:33235 every 8 connection(s)
I20260926 19:31:50.893172   597 acceptor_pool.cc:254] collecting diagnostics on the listening RPC socket 0.0.0.0:33235 every 8 connection(s)
[       OK ] Parameters/TestRpc.TestRpcSidecar/SSL_TCP (106 ms)
[ RUN      ] Parameters/TestRpc.TestRpcSidecarLimits/SSL_TCP
I20260926 19:31:53.051508   621 acceptor_pool.cc:254] collecting diagnostics on the listening RPC socket 0.0.0.0:34795 every 8 connection(s)
I20260926 19:31:53.051738   622 acceptor_pool.cc:254] collecting diagnostics on the listening RPC socket 0.0.0.0:34795 every 8 connection(s)
W20260926 19:31:53.066426   379 serialization.cc:72] Serialized kudu.rpc_test.PushStringsRequestPB (2147483654 bytes) is larger than the maximum configured RPC message size (52428800 bytes). Sending anyway, but peer may reject the data.
W20260926 19:31:53.072798   619 connection.cc:535] server connection from 127.0.0.1:37176 recv error: Network error: RPC frame had a length of 2147483714, but we only support messages up to 52428800 bytes long.
W20260926 19:31:53.072964   619 connection.cc:158] shutting down server connection from 127.0.0.1:37176 with pending inbound data: 4/2147483714 bytes received; last active 0 ns ago: status Network error: RPC frame had a length of 2147483714, but we only support messages up to 52428800 bytes long.
W20260926 19:31:53.073563   634 connection.cc:196] Error closing socket: Network error: TlsSocket::Close: Connection reset by peer
I20260926 19:31:53.086539   646 acceptor_pool.cc:254] collecting diagnostics on the listening RPC socket 0.0.0.0:33695 every 8 connection(s)
I20260926 19:31:53.086663   647 acceptor_pool.cc:254] collecting diagnostics on the listening RPC socket 0.0.0.0:33695 every 8 connection(s)
W20260926 19:31:59.490522   643 connection.cc:577] server connection from 127.0.0.1:38330: received bad data: 'Corruption: Invalid packet: message had a length of 2147483710, but we only support messages up to 2147483647 bytes
'
[       OK ] Parameters/TestRpc.TestRpcSidecarLimits/SSL_TCP (8914 ms)
[ RUN      ] Parameters/TestRpc.TestCallTimeoutDoesntAffectNegotiation/SSL_TCP
I20260926 19:31:59.917837   671 acceptor_pool.cc:254] collecting diagnostics on the listening RPC socket 0.0.0.0:40735 every 8 connection(s)
I20260926 19:31:59.918077   672 acceptor_pool.cc:254] collecting diagnostics on the listening RPC socket 0.0.0.0:40735 every 8 connection(s)
W20260926 19:31:59.956252   667 negotiation.cc:266] Injecting 500ms delay in negotiation
I20260926 19:32:00.006717   379 rpc-test-base.h:595] status: Timed out: connection negotiation to 0.0.0.0:40735 for RPC Sleep timed out after 0.050s (ON_OUTBOUND_QUEUE), seconds elapsed: 0.0511164
[       OK ] Parameters/TestRpc.TestCallTimeoutDoesntAffectNegotiation/SSL_TCP (564 ms)
[ RUN      ] Parameters/TestRpc.TestRpcHandlerLatencyMetric/SSL_TCP
I20260926 19:32:00.488634   696 acceptor_pool.cc:254] collecting diagnostics on the listening RPC socket 0.0.0.0:38581 every 8 connection(s)
I20260926 19:32:00.488838   697 acceptor_pool.cc:254] collecting diagnostics on the listening RPC socket 0.0.0.0:38581 every 8 connection(s)
I20260926 19:32:00.534473   379 rpc-test.cc:1236] Sleep() min lat: 20612
I20260926 19:32:00.534588   379 rpc-test.cc:1237] Sleep() mean lat: 20612
I20260926 19:32:00.534647   379 rpc-test.cc:1238] Sleep() max lat: 20612
I20260926 19:32:00.534675   379 rpc-test.cc:1239] Sleep() #calls: 1
[       OK ] Parameters/TestRpc.TestRpcHandlerLatencyMetric/SSL_TCP (71 ms)
[ RUN      ] Parameters/TestRpc.TimedOutOnResponseMetricServiceQueue/SSL_TCP
I20260926 19:32:00.549377   722 acceptor_pool.cc:254] collecting diagnostics on the listening RPC socket 0.0.0.0:33515 every 8 connection(s)
I20260926 19:32:00.549557   723 acceptor_pool.cc:254] collecting diagnostics on the listening RPC socket 0.0.0.0:33515 every 8 connection(s)
W20260926 19:32:00.615433   724 rpcz_store.cc:267] Call kudu.rpc_test.CalculatorService.Sleep from 127.0.0.1:41486 (request call id 2) took 20 ms (client timeout 20 ms). Trace:
W20260926 19:32:00.615573   724 rpcz_store.cc:269] 0926 19:32:00.595045 (+     0us) service_pool.cc:170] Inserting onto call queue
0926 19:32:00.615366 (+ 20321us) service_pool.cc:214] Skipping call since client already timed out
0926 19:32:00.615405 (+    39us) inbound_call.cc:173] Queueing failure response
Metrics: {}
[       OK ] Parameters/TestRpc.TimedOutOnResponseMetricServiceQueue/SSL_TCP (80 ms)
[ RUN      ] Parameters/TestRpc.RpcPendingConnectionsMetric/SSL_TCP
I20260926 19:32:00.624132   745 acceptor_pool.cc:254] collecting diagnostics on the listening RPC socket 0.0.0.0:36631 every 8 connection(s)
I20260926 19:32:00.624322   746 acceptor_pool.cc:254] collecting diagnostics on the listening RPC socket 0.0.0.0:36631 every 8 connection(s)
W20260926 19:32:00.635205   741 negotiation.cc:337] Failed RPC negotiation. Trace:
0926 19:32:00.634479 (+     0us) reactor.cc:625] Submitting negotiation task for server connection from 127.0.0.1:56638 (local address 127.0.0.1:36631)
0926 19:32:00.634653 (+   174us) server_negotiation.cc:206] Beginning negotiation
0926 19:32:00.634657 (+     4us) server_negotiation.cc:399] Waiting for connection header
0926 19:32:00.634802 (+   145us) negotiation.cc:327] Negotiation complete: Network error: Server connection negotiation failed: server connection from 127.0.0.1:56638: BlockingRecv error: recv got EOF from 127.0.0.1:56638 (error 108)
Metrics: {"server-negotiator.queue_time_us":61}
[       OK ] Parameters/TestRpc.RpcPendingConnectionsMetric/SSL_TCP (27 ms)
[ RUN      ] Parameters/TestRpc.TestRpcContextClientDeadline/SSL_TCP
I20260926 19:32:00.669934   761 acceptor_pool.cc:254] collecting diagnostics on the listening RPC socket 0.0.0.0:46167 every 8 connection(s)
I20260926 19:32:00.670127   762 acceptor_pool.cc:254] collecting diagnostics on the listening RPC socket 0.0.0.0:46167 every 8 connection(s)
[       OK ] Parameters/TestRpc.TestRpcContextClientDeadline/SSL_TCP (73 ms)
[ RUN      ] Parameters/TestRpc.TestApplicationFeatureFlagUnsupportedServer/SSL_TCP
I20260926 19:32:00.771142   786 acceptor_pool.cc:254] collecting diagnostics on the listening RPC socket 0.0.0.0:35593 every 8 connection(s)
I20260926 19:32:00.771292   787 acceptor_pool.cc:254] collecting diagnostics on the listening RPC socket 0.0.0.0:35593 every 8 connection(s)
[       OK ] Parameters/TestRpc.TestApplicationFeatureFlagUnsupportedServer/SSL_TCP (90 ms)
[ RUN      ] Parameters/TestRpc.TestCancellationAsync/SSL_TCP
I20260926 19:32:00.823050   811 acceptor_pool.cc:254] collecting diagnostics on the listening RPC socket 0.0.0.0:41491 every 8 connection(s)
I20260926 19:32:00.823271   812 acceptor_pool.cc:254] collecting diagnostics on the listening RPC socket 0.0.0.0:41491 every 8 connection(s)
I20260926 19:32:00.824021   379 rpc-test.cc:1716] Connecting to 0.0.0.0:41491
I20260926 19:32:00.836143   379 test_util.cc:268] Using random seed: -485781998
I20260926 19:32:00.870708   815 rpc-test-base.h:240] got call: sleep_micros: 500 pattern: 4294967295 num_repetitions: 2097152 sidecar_idx: 0
I20260926 19:32:00.889256   814 rpc-test-base.h:240] got call: sleep_micros: 500 pattern: 4294967295 num_repetitions: 2097152 sidecar_idx: 0
I20260926 19:32:00.914413   813 rpc-test-base.h:240] got call: sleep_micros: 500 pattern: 4294967295 num_repetitions: 2097152 sidecar_idx: 0
I20260926 19:32:00.942289   815 rpc-test-base.h:240] got call: sleep_micros: 500 pattern: 4294967295 num_repetitions: 2097152 sidecar_idx: 0
I20260926 19:32:00.964771   814 rpc-test-base.h:240] got call: sleep_micros: 500 pattern: 4294967295 num_repetitions: 2097152 sidecar_idx: 0
W20260926 19:32:00.990041   810 connection.cc:196] Error closing socket: Network error: TlsSocket::Close: Broken pipe
W20260926 19:32:00.990187   810 connection.cc:441] server connection from 127.0.0.1:52344 torn down before Call kudu.rpc.GenericCalculatorService.SleepWithSidecar from 127.0.0.1:52344 (request call id 7) could send its response
W20260926 19:32:00.991302   810 connection.cc:441] server connection from 127.0.0.1:52344 torn down before Call kudu.rpc.GenericCalculatorService.SleepWithSidecar from 127.0.0.1:52344 (request call id 6) could send its response
W20260926 19:32:01.013531   810 connection.cc:441] server connection from 127.0.0.1:52344 torn down before Call kudu.rpc.GenericCalculatorService.SleepWithSidecar from 127.0.0.1:52344 (request call id 8) could send its response
[       OK ] Parameters/TestRpc.TestCancellationAsync/SSL_TCP (204 ms)
[ RUN      ] Parameters/TestRpc.TestPerformanceBySocketType/SSL_TCP
I20260926 19:32:01.041604   836 acceptor_pool.cc:254] collecting diagnostics on the listening RPC socket 0.0.0.0:40843 every 8 connection(s)
I20260926 19:32:01.041811   837 acceptor_pool.cc:254] collecting diagnostics on the listening RPC socket 0.0.0.0:40843 every 8 connection(s)
I20260926 19:32:01.042596   379 rpc-test.cc:1846] Connecting to 0.0.0.0:40843
I20260926 19:32:03.836293   379 rpc-test.cc:1859] Sending 1024MB via ssl-enabled tcp socket: real 2.779s	user 2.701s	sys 1.898s
I20260926 19:32:06.671528   379 rpc-test.cc:1859] Sending 1024MB via ssl-enabled tcp socket: real 2.835s	user 2.675s	sys 2.014s
I20260926 19:32:09.460919   379 rpc-test.cc:1859] Sending 1024MB via ssl-enabled tcp socket: real 2.789s	user 2.671s	sys 1.943s
I20260926 19:32:12.310570   379 rpc-test.cc:1859] Sending 1024MB via ssl-enabled tcp socket: real 2.850s	user 2.520s	sys 2.191s
I20260926 19:32:15.172969   379 rpc-test.cc:1859] Sending 1024MB via ssl-enabled tcp socket: real 2.862s	user 2.719s	sys 2.013s
[       OK ] Parameters/TestRpc.TestPerformanceBySocketType/SSL_TCP (14165 ms)
[----------] 20 tests from Parameters/TestRpc (47503 ms total)

[----------] 1 test from Parameters/TestRpcSocketTxRxQueue
[ RUN      ] Parameters/TestRpcSocketTxRxQueue.OverCapacity/0
W20260926 19:32:15.474262   871 negotiation.cc:337] Failed RPC negotiation. Trace:
0926 19:32:15.190986 (+     0us) reactor.cc:625] Submitting negotiation task for client connection to 0.0.0.0:43319 (local address 127.0.0.1:57202)
0926 19:32:15.191144 (+   158us) negotiation.cc:107] Waiting for socket to connect
0926 19:32:15.191163 (+    19us) client_negotiation.cc:174] Beginning negotiation
0926 19:32:15.191273 (+   110us) client_negotiation.cc:252] Sending NEGOTIATE NegotiatePB request
0926 19:32:15.473873 (+282600us) negotiation.cc:327] Negotiation complete: Network error: Client connection negotiation failed: client connection to 0.0.0.0:43319: BlockingRecv error: recv error from unknown peer: Transport endpoint is not connected (error 107)
Metrics: {"client-negotiator.queue_time_us":40}
W20260926 19:32:15.474419   898 negotiation.cc:337] Failed RPC negotiation. Trace:
0926 19:32:15.199197 (+     0us) reactor.cc:625] Submitting negotiation task for client connection to 0.0.0.0:43319 (local address 127.0.0.1:57238)
0926 19:32:15.199364 (+   167us) negotiation.cc:107] Waiting for socket to connect
0926 19:32:15.199380 (+    16us) client_negotiation.cc:174] Beginning negotiation
0926 19:32:15.199461 (+    81us) client_negotiation.cc:252] Sending NEGOTIATE NegotiatePB request
0926 19:32:15.473845 (+274384us) negotiation.cc:327] Negotiation complete: Network error: Client connection negotiation failed: client connection to 0.0.0.0:43319: BlockingRecv error: recv error from unknown peer: Transport endpoint is not connected (error 107)
Metrics: {"client-negotiator.queue_time_us":42}
W20260926 19:32:15.474634   853 negotiation.cc:337] Failed RPC negotiation. Trace:
0926 19:32:15.186035 (+     0us) reactor.cc:625] Submitting negotiation task for client connection to 0.0.0.0:43319 (local address 127.0.0.1:57182)
0926 19:32:15.186247 (+   212us) negotiation.cc:107] Waiting for socket to connect
0926 19:32:15.186266 (+    19us) client_negotiation.cc:174] Beginning negotiation
0926 19:32:15.186399 (+   133us) client_negotiation.cc:252] Sending NEGOTIATE NegotiatePB request
0926 19:32:15.473797 (+287398us) negotiation.cc:327] Negotiation complete: Network error: Client connection negotiation failed: client connection to 0.0.0.0:43319: BlockingRecv error: recv error from unknown peer: Transport endpoint is not connected (error 107)
Metrics: {"client-negotiator.queue_time_us":77}
W20260926 19:32:15.475173   880 negotiation.cc:337] Failed RPC negotiation. Trace:
0926 19:32:15.193718 (+     0us) reactor.cc:625] Submitting negotiation task for client connection to 0.0.0.0:43319 (local address 127.0.0.1:57216)
0926 19:32:15.193915 (+   197us) negotiation.cc:107] Waiting for socket to connect
0926 19:32:15.193936 (+    21us) client_negotiation.cc:174] Beginning negotiation
0926 19:32:15.194039 (+   103us) client_negotiation.cc:252] Sending NEGOTIATE NegotiatePB request
0926 19:32:15.474239 (+280200us) negotiation.cc:327] Negotiation complete: Network error: Client connection negotiation failed: client connection to 0.0.0.0:43319: BlockingRecv error: recv error from unknown peer: Transport endpoint is not connected (error 107)
Metrics: {"client-negotiator.queue_time_us":77}
W20260926 19:32:15.475288   862 negotiation.cc:337] Failed RPC negotiation. Trace:
0926 19:32:15.188765 (+     0us) reactor.cc:625] Submitting negotiation task for client connection to 0.0.0.0:43319 (local address 127.0.0.1:57194)
0926 19:32:15.188929 (+   164us) negotiation.cc:107] Waiting for socket to connect
0926 19:32:15.188945 (+    16us) client_negotiation.cc:174] Beginning negotiation
0926 19:32:15.189040 (+    95us) client_negotiation.cc:252] Sending NEGOTIATE NegotiatePB request
0926 19:32:15.473797 (+284757us) negotiation.cc:327] Negotiation complete: Network error: Client connection negotiation failed: client connection to 0.0.0.0:43319: BlockingRecv error: recv error from unknown peer: Transport endpoint is not connected (error 107)
Metrics: {"client-negotiator.queue_time_us":48}
W20260926 19:32:15.475343   889 negotiation.cc:337] Failed RPC negotiation. Trace:
0926 19:32:15.196370 (+     0us) reactor.cc:625] Submitting negotiation task for client connection to 0.0.0.0:43319 (local address 127.0.0.1:57228)
0926 19:32:15.196539 (+   169us) negotiation.cc:107] Waiting for socket to connect
0926 19:32:15.196554 (+    15us) client_negotiation.cc:174] Beginning negotiation
0926 19:32:15.196654 (+   100us) client_negotiation.cc:252] Sending NEGOTIATE NegotiatePB request
0926 19:32:15.474364 (+277710us) negotiation.cc:327] Negotiation complete: Network error: Client connection negotiation failed: client connection to 0.0.0.0:43319: BlockingRecv error: recv error from unknown peer: Transport endpoint is not connected (error 107)
Metrics: {"client-negotiator.queue_time_us":52}
[       OK ] Parameters/TestRpcSocketTxRxQueue.OverCapacity/0 (1059 ms)
[----------] 1 test from Parameters/TestRpcSocketTxRxQueue (1059 ms total)

[----------] Global test environment tear-down
[==========] 21 tests from 2 test suites ran. (48563 ms total)
[  PASSED  ] 20 tests.
[  FAILED  ] 1 test, listed below:
[  FAILED  ] Parameters/TestRpc.TestCallWithChainCertAndChainCA/SSL_TCP, where GetParam() = (true, false)

 1 FAILED TEST