Diagnosed failure

Parameters/TestRpc.TestCallWithChainCertAndRootCA/SSL_TCP: /data0/somelongdirectorytoavoidrpathissues/src/kudu/src/kudu/rpc/rpc-test.cc:303: Failure
Failed
Bad status: Runtime error: could not verify certificate chain (error with cert: subject=CN = localhost, ST = sadfjas, C = AS, emailAddress = sdflkdsajf, O = lskdfjlsad, OU = sldfkja, issuer=C = AS, ST = ASDfkjdhf, L = lskdjf, O = saldfja, OU = skdjf, CN = localhost, emailAddress = sadjflkadsj): : certificate has expired
Google Test trace:
/data0/somelongdirectorytoavoidrpathissues/src/kudu/src/kudu/rpc/rpc-test.cc:300: Connecting to 0.0.0.0:38847
I20260924 00:21:32.129782 26851 test_util.cc:175] -----------------------------------------------
I20260924 00:21:32.129963 26851 test_util.cc:176] Had fatal failures, leaving test files at /tmp/dist-test-taskekPU5w/test-tmp/rpc-test.1.Parameters_TestRpc.TestCallWithChainCertAndRootCA_SSL_TCP.1790209290533866-26851-0

Full log

Note: This is test shard 2 of 8.
[==========] Running 21 tests from 2 test suites.
[----------] Global test environment set-up.
[----------] 1 test from TestRpc
[ RUN      ] TestRpc.TestMethodsByName
[       OK ] TestRpc.TestMethodsByName (7 ms)
[----------] 1 test from TestRpc (7 ms total)

[----------] 20 tests from Parameters/TestRpc
[ RUN      ] Parameters/TestRpc.TestAcceptorPoolStartStop/SSL_TCP
WARNING: Logging before InitGoogleLogging() is written to STDERR
I20260924 00:21:30.676017 26866 acceptor_pool.cc:254] collecting diagnostics on the listening RPC socket 0.0.0.0:40799 every 8 connection(s)
I20260924 00:21:30.677647 26867 acceptor_pool.cc:254] collecting diagnostics on the listening RPC socket 0.0.0.0:40799 every 8 connection(s)
W20260924 00:21:31.678313 26851 thread.cc:536] Waited for 1000ms trying to join with acceptor (tid 26867)
I20260924 00:21:31.845386 26878 acceptor_pool.cc:254] collecting diagnostics on the listening RPC socket 0.0.0.0:35455 every 8 connection(s)
I20260924 00:21:31.846963 26879 acceptor_pool.cc:254] collecting diagnostics on the listening RPC socket 0.0.0.0:35455 every 8 connection(s)
I20260924 00:21:31.875567 26889 acceptor_pool.cc:254] collecting diagnostics on the listening RPC socket 0.0.0.0:34213 every 8 connection(s)
I20260924 00:21:31.877130 26890 acceptor_pool.cc:254] collecting diagnostics on the listening RPC socket 0.0.0.0:34213 every 8 connection(s)
I20260924 00:21:31.908047 26900 acceptor_pool.cc:254] collecting diagnostics on the listening RPC socket 0.0.0.0:41463 every 8 connection(s)
I20260924 00:21:31.908797 26901 acceptor_pool.cc:254] collecting diagnostics on the listening RPC socket 0.0.0.0:41463 every 8 connection(s)
I20260924 00:21:31.927418 26911 acceptor_pool.cc:254] collecting diagnostics on the listening RPC socket 0.0.0.0:35627 every 8 connection(s)
I20260924 00:21:31.928099 26912 acceptor_pool.cc:254] collecting diagnostics on the listening RPC socket 0.0.0.0:35627 every 8 connection(s)
[       OK ] Parameters/TestRpc.TestAcceptorPoolStartStop/SSL_TCP (1337 ms)
[ RUN      ] Parameters/TestRpc.TestCall/SSL_TCP
I20260924 00:21:31.947774 26924 acceptor_pool.cc:254] collecting diagnostics on the listening RPC socket 0.0.0.0:41851 every 8 connection(s)
I20260924 00:21:31.949976 26925 acceptor_pool.cc:254] collecting diagnostics on the listening RPC socket 0.0.0.0:41851 every 8 connection(s)
I20260924 00:21:31.954859 26851 rpc-test.cc:234] Connecting to 0.0.0.0:41851
[       OK ] Parameters/TestRpc.TestCall/SSL_TCP (151 ms)
[ RUN      ] Parameters/TestRpc.TestCallWithChainCertAndRootCA/SSL_TCP
I20260924 00:21:32.107898 26949 acceptor_pool.cc:254] collecting diagnostics on the listening RPC socket 0.0.0.0:38847 every 8 connection(s)
I20260924 00:21:32.108650 26950 acceptor_pool.cc:254] collecting diagnostics on the listening RPC socket 0.0.0.0:38847 every 8 connection(s)
/data0/somelongdirectorytoavoidrpathissues/src/kudu/src/kudu/rpc/rpc-test.cc:303: Failure
Failed
Bad status: Runtime error: could not verify certificate chain (error with cert: subject=CN = localhost, ST = sadfjas, C = AS, emailAddress = sdflkdsajf, O = lskdfjlsad, OU = sldfkja, issuer=C = AS, ST = ASDfkjdhf, L = lskdjf, O = saldfja, OU = skdjf, CN = localhost, emailAddress = sadjflkadsj): : certificate has expired
Google Test trace:
/data0/somelongdirectorytoavoidrpathissues/src/kudu/src/kudu/rpc/rpc-test.cc:300: Connecting to 0.0.0.0:38847
I20260924 00:21:32.129782 26851 test_util.cc:175] -----------------------------------------------
I20260924 00:21:32.129963 26851 test_util.cc:176] Had fatal failures, leaving test files at /tmp/dist-test-taskekPU5w/test-tmp/rpc-test.1.Parameters_TestRpc.TestCallWithChainCertAndRootCA_SSL_TCP.1790209290533866-26851-0
[  FAILED  ] Parameters/TestRpc.TestCallWithChainCertAndRootCA/SSL_TCP, where GetParam() = (true, false) (46 ms)
[ RUN      ] Parameters/TestRpc.TestCallWithBadPasswordProtectedKey/SSL_TCP
[       OK ] Parameters/TestRpc.TestCallWithBadPasswordProtectedKey/SSL_TCP (33 ms)
[ RUN      ] Parameters/TestRpc.TestInvalidMethodCall/SSL_TCP
I20260924 00:21:32.182363 26986 acceptor_pool.cc:254] collecting diagnostics on the listening RPC socket 0.0.0.0:42081 every 8 connection(s)
I20260924 00:21:32.183254 26987 acceptor_pool.cc:254] collecting diagnostics on the listening RPC socket 0.0.0.0:42081 every 8 connection(s)
I20260924 00:21:32.186786 26851 rpc-test.cc:406] Connecting to 0.0.0.0:42081
[       OK ] Parameters/TestRpc.TestInvalidMethodCall/SSL_TCP (68 ms)
[ RUN      ] Parameters/TestRpc.TestHighFDs/SSL_TCP
I20260924 00:21:32.435963 27011 acceptor_pool.cc:254] collecting diagnostics on the listening RPC socket 0.0.0.0:37475 every 8 connection(s)
I20260924 00:21:32.436708 27012 acceptor_pool.cc:254] collecting diagnostics on the listening RPC socket 0.0.0.0:37475 every 8 connection(s)
[       OK ] Parameters/TestRpc.TestHighFDs/SSL_TCP (254 ms)
[ RUN      ] Parameters/TestRpc.TestConnectionAlwaysKeepalive/SSL_TCP
I20260924 00:21:32.507861 27034 acceptor_pool.cc:254] collecting diagnostics on the listening RPC socket 0.0.0.0:40545 every 8 connection(s)
I20260924 00:21:32.508595 27035 acceptor_pool.cc:254] collecting diagnostics on the listening RPC socket 0.0.0.0:40545 every 8 connection(s)
I20260924 00:21:32.511981 26851 rpc-test.cc:532] Connecting to 0.0.0.0:40545
[       OK ] Parameters/TestRpc.TestConnectionAlwaysKeepalive/SSL_TCP (3078 ms)
[ RUN      ] Parameters/TestRpc.TestReopenOutboundConnections/SSL_TCP
I20260924 00:21:35.587642 27057 acceptor_pool.cc:254] collecting diagnostics on the listening RPC socket 0.0.0.0:36159 every 8 connection(s)
I20260924 00:21:35.588371 27058 acceptor_pool.cc:254] collecting diagnostics on the listening RPC socket 0.0.0.0:36159 every 8 connection(s)
I20260924 00:21:35.591751 26851 rpc-test.cc:658] Connecting to 0.0.0.0:36159
[       OK ] Parameters/TestRpc.TestReopenOutboundConnections/SSL_TCP (409 ms)
[ RUN      ] Parameters/TestRpc.TestConnectionNetworkPlane/SSL_TCP
I20260924 00:21:36.009539 27080 acceptor_pool.cc:254] collecting diagnostics on the listening RPC socket 0.0.0.0:39681 every 8 connection(s)
I20260924 00:21:36.010227 27081 acceptor_pool.cc:254] collecting diagnostics on the listening RPC socket 0.0.0.0:39681 every 8 connection(s)
I20260924 00:21:36.013477 26851 rpc-test.cc:772] Connecting to 0.0.0.0:39681
[       OK ] Parameters/TestRpc.TestConnectionNetworkPlane/SSL_TCP (86 ms)
[ RUN      ] Parameters/TestRpc.TestTCPKeepalive/SSL_TCP
I20260924 00:21:36.080796 27105 acceptor_pool.cc:254] collecting diagnostics on the listening RPC socket 0.0.0.0:41645 every 8 connection(s)
I20260924 00:21:36.081542 27106 acceptor_pool.cc:254] collecting diagnostics on the listening RPC socket 0.0.0.0:41645 every 8 connection(s)
I20260924 00:21:36.126324 27109 rpc-test-base.h:222] got call: sleep_micros: 8000000 deferred: true
I20260924 00:21:44.130641 27109 rpcz_store.cc:275] Call kudu.rpc.GenericCalculatorService.Sleep from 127.0.0.1:43936 (request call id 0) took 8004 ms. Trace:
I20260924 00:21:44.131538 27109 rpcz_store.cc:276] 0924 00:21:36.126066 (+     0us) service_pool.cc:170] Inserting onto call queue
0924 00:21:36.126171 (+   105us) service_pool.cc:227] Handling call
0924 00:21:44.130406 (+8004235us) inbound_call.cc:173] Queueing success response
Metrics: {}
[       OK ] Parameters/TestRpc.TestTCPKeepalive/SSL_TCP (8085 ms)
[ RUN      ] Parameters/TestRpc.TestMaxSmallSidecars/SSL_TCP
I20260924 00:21:44.185631 27131 acceptor_pool.cc:254] collecting diagnostics on the listening RPC socket 0.0.0.0:43571 every 8 connection(s)
I20260924 00:21:44.186424 27132 acceptor_pool.cc:254] collecting diagnostics on the listening RPC socket 0.0.0.0:43571 every 8 connection(s)
[       OK ] Parameters/TestRpc.TestMaxSmallSidecars/SSL_TCP (214 ms)
[ RUN      ] Parameters/TestRpc.TestCallTimeout/SSL_TCP
I20260924 00:21:44.397957 27156 acceptor_pool.cc:254] collecting diagnostics on the listening RPC socket 0.0.0.0:46377 every 8 connection(s)
I20260924 00:21:44.398685 27157 acceptor_pool.cc:254] collecting diagnostics on the listening RPC socket 0.0.0.0:46377 every 8 connection(s)
I20260924 00:21:44.436079 26851 rpc-test-base.h:595] status: Timed out: connection negotiation to 0.0.0.0:46377 for RPC Sleep timed out after 0.000s (ON_OUTBOUND_QUEUE), seconds elapsed: 0.00313511
I20260924 00:21:44.443681 27160 rpc-test-base.h:222] got call: sleep_micros: 700000
I20260924 00:21:44.637501 26851 rpc-test-base.h:595] status: Timed out: Sleep RPC to 0.0.0.0:46377 timed out after 0.200s (SENT), seconds elapsed: 0.200893
I20260924 00:21:44.639065 27159 rpc-test-base.h:222] got call: sleep_micros: 2000000
W20260924 00:21:45.144302 27160 rpcz_store.cc:267] Call kudu.rpc.GenericCalculatorService.Sleep from 127.0.0.1:48220 (request call id 1) took 700 ms (client timeout 200 ms). Trace:
W20260924 00:21:45.144661 27160 rpcz_store.cc:269] 0924 00:21:44.443522 (+     0us) service_pool.cc:170] Inserting onto call queue
0924 00:21:44.443622 (+   100us) service_pool.cc:227] Handling call
0924 00:21:45.144234 (+700612us) inbound_call.cc:173] Queueing success response
Metrics: {}
I20260924 00:21:46.140267 26851 rpc-test-base.h:595] status: Timed out: Sleep RPC to 0.0.0.0:46377 timed out after 1.500s (SENT), seconds elapsed: 1.50242
W20260924 00:21:46.639664 27159 rpcz_store.cc:267] Call kudu.rpc.GenericCalculatorService.Sleep from 127.0.0.1:48220 (request call id 2) took 2000 ms (client timeout 1500 ms). Trace:
W20260924 00:21:46.640044 27159 rpcz_store.cc:269] 0924 00:21:44.638800 (+     0us) service_pool.cc:170] Inserting onto call queue
0924 00:21:44.638913 (+   113us) service_pool.cc:227] Handling call
0924 00:21:46.639605 (+2000692us) inbound_call.cc:173] Queueing success response
Metrics: {}
W20260924 00:21:46.640776 27155 connection.cc:441] server connection from 127.0.0.1:48220 torn down before Call kudu.rpc.GenericCalculatorService.Sleep from 127.0.0.1:48220 (request call id 2) could send its response
[       OK ] Parameters/TestRpc.TestCallTimeout/SSL_TCP (2282 ms)
[ RUN      ] Parameters/TestRpc.TestServerShutsDown/SSL_TCP
I20260924 00:21:46.648675 26851 rpc-test.cc:1125] Connecting to 0.0.0.0:39173
W20260924 00:21:46.659142 27173 negotiation.cc:337] Failed RPC negotiation. Trace:
0924 00:21:46.657559 (+     0us) reactor.cc:625] Submitting negotiation task for client connection to 0.0.0.0:39173 (local address 127.0.0.1:41152)
0924 00:21:46.658043 (+   484us) negotiation.cc:107] Waiting for socket to connect
0924 00:21:46.658075 (+    32us) client_negotiation.cc:174] Beginning negotiation
0924 00:21:46.658309 (+   234us) client_negotiation.cc:252] Sending NEGOTIATE NegotiatePB request
0924 00:21:46.658557 (+   248us) negotiation.cc:327] Negotiation complete: Network error: Client connection negotiation failed: client connection to 0.0.0.0:39173: BlockingWrite error: write error: Broken pipe (error 32)
Metrics: {"client-negotiator.queue_time_us":135}
[       OK ] Parameters/TestRpc.TestServerShutsDown/SSL_TCP (15 ms)
[ RUN      ] Parameters/TestRpc.TimedOutOnResponseMetric/SSL_TCP
I20260924 00:21:46.694681 27190 acceptor_pool.cc:254] collecting diagnostics on the listening RPC socket 0.0.0.0:36075 every 8 connection(s)
I20260924 00:21:46.695384 27191 acceptor_pool.cc:254] collecting diagnostics on the listening RPC socket 0.0.0.0:36075 every 8 connection(s)
W20260924 00:21:46.933677 27194 rpcz_store.cc:267] Call kudu.rpc_test.CalculatorService.Sleep from 127.0.0.1:55824 (request call id 3) took 50 ms (client timeout 25 ms). Trace:
W20260924 00:21:46.934038 27194 rpcz_store.cc:269] 0924 00:21:46.882898 (+     0us) service_pool.cc:170] Inserting onto call queue
0924 00:21:46.883038 (+   140us) service_pool.cc:227] Handling call
0924 00:21:46.933599 (+ 50561us) inbound_call.cc:173] Queueing success response
Related trace 'test_child':
Metrics: {"test_sleep_us":50000,"child_traces":[["test_child",{"related_trace_metric":1}]]}
W20260924 00:21:46.992961 27194 rpcz_store.cc:267] Call kudu.rpc_test.CalculatorService.Sleep from 127.0.0.1:55824 (request call id 4) took 50 ms (client timeout 50 ms). Trace:
W20260924 00:21:46.993275 27194 rpcz_store.cc:269] 0924 00:21:46.942345 (+     0us) service_pool.cc:170] Inserting onto call queue
0924 00:21:46.942507 (+   162us) service_pool.cc:227] Handling call
0924 00:21:46.992895 (+ 50388us) inbound_call.cc:173] Queueing success response
Related trace 'test_child':
Metrics: {"test_sleep_us":50000,"child_traces":[["test_child",{"related_trace_metric":1}]]}
[       OK ] Parameters/TestRpc.TimedOutOnResponseMetric/SSL_TCP (340 ms)
[ RUN      ] Parameters/TestRpc.AcceptorDispatchingTimesMetric/SSL_TCP
I20260924 00:21:47.015372 27215 acceptor_pool.cc:254] collecting diagnostics on the listening RPC socket 0.0.0.0:32821 every 8 connection(s)
I20260924 00:21:47.016089 27216 acceptor_pool.cc:254] collecting diagnostics on the listening RPC socket 0.0.0.0:32821 every 8 connection(s)
W20260924 00:21:47.022572 27211 negotiation.cc:337] Failed RPC negotiation. Trace:
0924 00:21:47.020062 (+     0us) reactor.cc:625] Submitting negotiation task for server connection from 127.0.0.1:47940 (local address 127.0.0.1:32821)
0924 00:21:47.020671 (+   609us) server_negotiation.cc:206] Beginning negotiation
0924 00:21:47.020701 (+    30us) server_negotiation.cc:399] Waiting for connection header
0924 00:21:47.021220 (+   519us) negotiation.cc:327] Negotiation complete: Network error: Server connection negotiation failed: server connection from 127.0.0.1:47940: BlockingRecv error: recv got EOF from 127.0.0.1:47940 (error 108)
Metrics: {"server-negotiator.queue_time_us":145}
[       OK ] Parameters/TestRpc.AcceptorDispatchingTimesMetric/SSL_TCP (23 ms)
[ RUN      ] Parameters/TestRpc.TestRpcCallbackDestroysMessenger/SSL_TCP
[       OK ] Parameters/TestRpc.TestRpcCallbackDestroysMessenger/SSL_TCP (23 ms)
[ RUN      ] Parameters/TestRpc.TestApplicationFeatureFlag/SSL_TCP
I20260924 00:21:47.067554 27240 acceptor_pool.cc:254] collecting diagnostics on the listening RPC socket 0.0.0.0:35989 every 8 connection(s)
I20260924 00:21:47.068339 27241 acceptor_pool.cc:254] collecting diagnostics on the listening RPC socket 0.0.0.0:35989 every 8 connection(s)
W20260924 00:21:47.132853 27238 messenger.cc:357] Unable to handle RPC call: Not implemented: call requires unsupported application feature flags: 99
[       OK ] Parameters/TestRpc.TestApplicationFeatureFlag/SSL_TCP (91 ms)
[ RUN      ] Parameters/TestRpc.TestCancellation/SSL_TCP
I20260924 00:21:47.163076 27265 acceptor_pool.cc:254] collecting diagnostics on the listening RPC socket 0.0.0.0:38033 every 8 connection(s)
I20260924 00:21:47.163834 27266 acceptor_pool.cc:254] collecting diagnostics on the listening RPC socket 0.0.0.0:38033 every 8 connection(s)
I20260924 00:21:47.167439 26851 rpc-test.cc:1648] Connecting to 0.0.0.0:38033
I20260924 00:21:47.269909 26851 rpc-test-base.h:595] status: Aborted: Sleep RPC to 0.0.0.0:38033 is cancelled in state READY, seconds elapsed: 0.000348161
I20260924 00:21:47.414147 26851 rpc-test-base.h:595] status: Aborted: Sleep RPC to 0.0.0.0:38033 is cancelled in state SENT, seconds elapsed: 0.000819323
I20260924 00:21:47.454435 27268 rpc-test-base.h:222] got call: sleep_micros: 510000
I20260924 00:21:47.575258 26851 rpc-test-base.h:595] status: Aborted: Sleep RPC to 0.0.0.0:38033 is cancelled in state SENT, seconds elapsed: 0.000906293
I20260924 00:21:47.615131 27267 rpc-test-base.h:222] got call: sleep_micros: 510000
I20260924 00:21:47.745522 26851 rpc-test-base.h:595] status: Aborted: Sleep RPC to 0.0.0.0:38033 is cancelled in state SENT, seconds elapsed: 0.000985783
W20260924 00:21:47.783062 27269 rpcz_store.cc:267] Call kudu.rpc.GenericCalculatorService.Sleep from 127.0.0.1:43484 (request call id 11) took 15 ms (client timeout 10 ms). Trace:
W20260924 00:21:47.783428 27269 rpcz_store.cc:269] 0924 00:21:47.767617 (+     0us) service_pool.cc:170] Inserting onto call queue
0924 00:21:47.782759 (+ 15142us) service_pool.cc:214] Skipping call since client already timed out
0924 00:21:47.782874 (+   115us) inbound_call.cc:173] Queueing failure response
Metrics: {}
I20260924 00:21:47.783931 27269 rpc-test-base.h:222] got call: sleep_micros: 1500000
W20260924 00:21:47.965086 27268 rpcz_store.cc:267] Call kudu.rpc.GenericCalculatorService.Sleep from 127.0.0.1:43484 (request call id 3) took 510 ms (client timeout 10 ms). Trace:
W20260924 00:21:47.965411 27268 rpcz_store.cc:269] 0924 00:21:47.454278 (+     0us) service_pool.cc:170] Inserting onto call queue
0924 00:21:47.454380 (+   102us) service_pool.cc:227] Handling call
0924 00:21:47.965031 (+510651us) inbound_call.cc:173] Queueing success response
Metrics: {}
W20260924 00:21:48.125984 27267 rpcz_store.cc:267] Call kudu.rpc.GenericCalculatorService.Sleep from 127.0.0.1:43484 (request call id 7) took 511 ms (client timeout 10 ms). Trace:
W20260924 00:21:48.126300 27267 rpcz_store.cc:269] 0924 00:21:47.614845 (+     0us) service_pool.cc:170] Inserting onto call queue
0924 00:21:47.615050 (+   205us) service_pool.cc:227] Handling call
0924 00:21:48.125907 (+510857us) inbound_call.cc:173] Queueing success response
Metrics: {}
I20260924 00:21:48.747123 26851 rpc-test-base.h:595] status: Timed out: Sleep RPC to 0.0.0.0:38033 timed out after 1.000s (SENT), seconds elapsed: 1.00112
I20260924 00:21:48.748713 27267 rpc-test-base.h:222] got call: sleep_micros: 1500000
W20260924 00:21:49.284514 27269 rpcz_store.cc:267] Call kudu.rpc.GenericCalculatorService.Sleep from 127.0.0.1:43484 (request call id 12) took 1516 ms (client timeout 1000 ms). Trace:
W20260924 00:21:49.284909 27269 rpcz_store.cc:269] 0924 00:21:47.767974 (+     0us) service_pool.cc:170] Inserting onto call queue
0924 00:21:47.783893 (+ 15919us) service_pool.cc:227] Handling call
0924 00:21:49.284461 (+1500568us) inbound_call.cc:173] Queueing success response
Metrics: {}
I20260924 00:21:49.749517 26851 rpc-test-base.h:595] status: Timed out: Sleep RPC to 0.0.0.0:38033 timed out after 1.000s (SENT), seconds elapsed: 1.00194
W20260924 00:21:49.751128 27263 messenger.cc:357] Unable to handle RPC call: Not implemented: call requires unsupported application feature flags: 99, 1
W20260924 00:21:49.752914 27263 messenger.cc:357] Unable to handle RPC call: Not implemented: call requires unsupported application feature flags: 99, 1
W20260924 00:21:50.249258 27267 rpcz_store.cc:267] Call kudu.rpc.GenericCalculatorService.Sleep from 127.0.0.1:43484 (request call id 13) took 1500 ms (client timeout 1000 ms). Trace:
W20260924 00:21:50.249583 27267 rpcz_store.cc:269] 0924 00:21:48.748503 (+     0us) service_pool.cc:170] Inserting onto call queue
0924 00:21:48.748662 (+   159us) service_pool.cc:227] Handling call
0924 00:21:50.249181 (+1500519us) inbound_call.cc:173] Queueing success response
Metrics: {}
W20260924 00:21:50.250283 27263 connection.cc:441] server connection from 127.0.0.1:43484 torn down before Call kudu.rpc.GenericCalculatorService.Sleep from 127.0.0.1:43484 (request call id 13) could send its response
[       OK ] Parameters/TestRpc.TestCancellation/SSL_TCP (3115 ms)
[ RUN      ] Parameters/TestRpc.TestCancellationMultiThreads/SSL_TCP
I20260924 00:21:50.306021 27290 acceptor_pool.cc:254] collecting diagnostics on the listening RPC socket 0.0.0.0:34909 every 8 connection(s)
I20260924 00:21:50.306800 27291 acceptor_pool.cc:254] collecting diagnostics on the listening RPC socket 0.0.0.0:34909 every 8 connection(s)
I20260924 00:21:50.310178 26851 rpc-test.cc:1808] Connecting to 0.0.0.0:34909
I20260924 00:21:50.462136 27304 test_util.cc:268] Using random seed: -1777987430
I20260924 00:21:50.463464 27305 test_util.cc:268] Using random seed: -1777986238
I20260924 00:21:50.465243 27306 test_util.cc:268] Using random seed: -1777984321
I20260924 00:21:50.466684 27307 test_util.cc:268] Using random seed: -1777982900
I20260924 00:21:50.468474 27308 test_util.cc:268] Using random seed: -1777981236
I20260924 00:21:50.470001 27309 test_util.cc:268] Using random seed: -1777979703
I20260924 00:21:50.471804 27310 test_util.cc:268] Using random seed: -1777977915
I20260924 00:21:50.473279 27311 test_util.cc:268] Using random seed: -1777976418
I20260924 00:21:50.474989 27312 test_util.cc:268] Using random seed: -1777974737
I20260924 00:21:50.476455 27313 test_util.cc:268] Using random seed: -1777973237
I20260924 00:21:50.477895 27314 test_util.cc:268] Using random seed: -1777971812
I20260924 00:21:50.479658 27315 test_util.cc:268] Using random seed: -1777970075
I20260924 00:21:50.481343 27316 test_util.cc:268] Using random seed: -1777968354
I20260924 00:21:50.483167 27317 test_util.cc:268] Using random seed: -1777966575
I20260924 00:21:50.484850 27318 test_util.cc:268] Using random seed: -1777964873
I20260924 00:21:50.486776 27319 test_util.cc:268] Using random seed: -1777962943
I20260924 00:21:50.488513 27320 test_util.cc:268] Using random seed: -1777961198
I20260924 00:21:50.490451 27321 test_util.cc:268] Using random seed: -1777959266
I20260924 00:21:50.492717 27322 test_util.cc:268] Using random seed: -1777957057
I20260924 00:21:50.495522 27323 test_util.cc:268] Using random seed: -1777954242
I20260924 00:21:50.497483 27324 test_util.cc:268] Using random seed: -1777952291
I20260924 00:21:50.499394 27325 test_util.cc:268] Using random seed: -1777950381
I20260924 00:21:50.501772 27326 test_util.cc:268] Using random seed: -1777947966
I20260924 00:21:50.504441 27327 test_util.cc:268] Using random seed: -1777945307
I20260924 00:21:50.506695 27328 test_util.cc:268] Using random seed: -1777943052
I20260924 00:21:50.508888 27329 test_util.cc:268] Using random seed: -1777940893
I20260924 00:21:50.512655 27330 test_util.cc:268] Using random seed: -1777937095
I20260924 00:21:50.514643 27331 test_util.cc:268] Using random seed: -1777935094
I20260924 00:21:50.516688 27332 test_util.cc:268] Using random seed: -1777933074
I20260924 00:21:50.518548 27333 test_util.cc:268] Using random seed: -1777931155
[       OK ] Parameters/TestRpc.TestCancellationMultiThreads/SSL_TCP (18113 ms)
[ RUN      ] Parameters/TestRpc.TestCallId/SSL_TCP
I20260924 00:22:08.397708 27347 acceptor_pool.cc:254] collecting diagnostics on the listening RPC socket 0.0.0.0:42837 every 8 connection(s)
I20260924 00:22:08.398516 27348 acceptor_pool.cc:254] collecting diagnostics on the listening RPC socket 0.0.0.0:42837 every 8 connection(s)
[       OK ] Parameters/TestRpc.TestCallId/SSL_TCP (84 ms)
[----------] 20 tests from Parameters/TestRpc (37860 ms total)

[----------] Global test environment tear-down
[==========] 21 tests from 2 test suites ran. (37868 ms total)
[  PASSED  ] 20 tests.
[  FAILED  ] 1 test, listed below:
[  FAILED  ] Parameters/TestRpc.TestCallWithChainCertAndRootCA/SSL_TCP, where GetParam() = (true, false)

 1 FAILED TEST