Diagnosed failure

Parameters/TestRpc.TestCallWithChainCertAndChainCA/SSL_TCP: /data0/somelongdirectorytoavoidrpathissues/src/kudu/src/kudu/rpc/rpc-test.cc:270: Failure
Failed
Bad status: Runtime error: could not verify certificate chain (error with cert: subject=CN = localhost, ST = sadfjas, C = AS, emailAddress = sdflkdsajf, O = lskdfjlsad, OU = sldfkja, issuer=C = AS, ST = ASDfkjdhf, L = lskdjf, O = saldfja, OU = skdjf, CN = localhost, emailAddress = sadjflkadsj): : certificate has expired
Google Test trace:
/data0/somelongdirectorytoavoidrpathissues/src/kudu/src/kudu/rpc/rpc-test.cc:267: Connecting to 0.0.0.0:42279
I20260928 10:03:34.751791  1818 test_util.cc:175] -----------------------------------------------
I20260928 10:03:34.751892  1818 test_util.cc:176] Had fatal failures, leaving test files at /tmp/dist-test-taskoZ7l9T/test-tmp/rpc-test.5.Parameters_TestRpc.TestCallWithChainCertAndChainCA_SSL_TCP.1790589814621219-1818-0

Full log

Note: This is test shard 6 of 8.
[==========] Running 21 tests from 2 test suites.
[----------] Global test environment set-up.
[----------] 20 tests from Parameters/TestRpc
[ RUN      ] Parameters/TestRpc.TestMessengerCreateDestroy/SSL_TCP
WARNING: Logging before InitGoogleLogging() is written to STDERR
I20260928 10:03:34.678249  1818 rpc-test.cc:169] started messenger TestCreateDestroy
[       OK ] Parameters/TestRpc.TestMessengerCreateDestroy/SSL_TCP (41 ms)
[ RUN      ] Parameters/TestRpc.TestNegotiationDeadlock/SSL_TCP
I20260928 10:03:34.704059  1838 acceptor_pool.cc:254] collecting diagnostics on the listening RPC socket 0.0.0.0:45297 every 8 connection(s)
I20260928 10:03:34.704293  1839 acceptor_pool.cc:254] collecting diagnostics on the listening RPC socket 0.0.0.0:45297 every 8 connection(s)
[       OK ] Parameters/TestRpc.TestNegotiationDeadlock/SSL_TCP (42 ms)
[ RUN      ] Parameters/TestRpc.TestCallWithChainCertAndChainCA/SSL_TCP
I20260928 10:03:34.739382  1854 acceptor_pool.cc:254] collecting diagnostics on the listening RPC socket 0.0.0.0:42279 every 8 connection(s)
I20260928 10:03:34.739723  1855 acceptor_pool.cc:254] collecting diagnostics on the listening RPC socket 0.0.0.0:42279 every 8 connection(s)
/data0/somelongdirectorytoavoidrpathissues/src/kudu/src/kudu/rpc/rpc-test.cc:270: Failure
Failed
Bad status: Runtime error: could not verify certificate chain (error with cert: subject=CN = localhost, ST = sadfjas, C = AS, emailAddress = sdflkdsajf, O = lskdfjlsad, OU = sldfkja, issuer=C = AS, ST = ASDfkjdhf, L = lskdjf, O = saldfja, OU = skdjf, CN = localhost, emailAddress = sadjflkadsj): : certificate has expired
Google Test trace:
/data0/somelongdirectorytoavoidrpathissues/src/kudu/src/kudu/rpc/rpc-test.cc:267: Connecting to 0.0.0.0:42279
I20260928 10:03:34.751791  1818 test_util.cc:175] -----------------------------------------------
I20260928 10:03:34.751892  1818 test_util.cc:176] Had fatal failures, leaving test files at /tmp/dist-test-taskoZ7l9T/test-tmp/rpc-test.5.Parameters_TestRpc.TestCallWithChainCertAndChainCA_SSL_TCP.1790589814621219-1818-0
[  FAILED  ] Parameters/TestRpc.TestCallWithChainCertAndChainCA/SSL_TCP, where GetParam() = (true, false) (27 ms)
[ RUN      ] Parameters/TestRpc.TestCallWithPasswordProtectedKey/SSL_TCP
I20260928 10:03:34.764930  1879 acceptor_pool.cc:254] collecting diagnostics on the listening RPC socket 0.0.0.0:40739 every 8 connection(s)
I20260928 10:03:34.765259  1880 acceptor_pool.cc:254] collecting diagnostics on the listening RPC socket 0.0.0.0:40739 every 8 connection(s)
[       OK ] Parameters/TestRpc.TestCallWithPasswordProtectedKey/SSL_TCP (53 ms)
[ RUN      ] Parameters/TestRpc.TestCallToBadServer/SSL_TCP
I20260928 10:03:34.828934  1818 rpc-test.cc:394] Status: Network error: Client connection negotiation failed: client connection to 0.0.0.0:0: connect: Connection refused (error 111)
I20260928 10:03:34.829625  1818 rpc-test.cc:394] Status: Network error: Client connection negotiation failed: client connection to 0.0.0.0:0: connect: Connection refused (error 111)
I20260928 10:03:34.830273  1818 rpc-test.cc:394] Status: Network error: Client connection negotiation failed: client connection to 0.0.0.0:0: connect: Connection refused (error 111)
I20260928 10:03:34.830907  1818 rpc-test.cc:394] Status: Network error: Client connection negotiation failed: client connection to 0.0.0.0:0: connect: Connection refused (error 111)
I20260928 10:03:34.831502  1818 rpc-test.cc:394] Status: Network error: Client connection negotiation failed: client connection to 0.0.0.0:0: connect: Connection refused (error 111)
[       OK ] Parameters/TestRpc.TestCallToBadServer/SSL_TCP (27 ms)
[ RUN      ] Parameters/TestRpc.TestWrongService/SSL_TCP
I20260928 10:03:34.848433  1914 acceptor_pool.cc:254] collecting diagnostics on the listening RPC socket 0.0.0.0:46697 every 8 connection(s)
I20260928 10:03:34.848685  1915 acceptor_pool.cc:254] collecting diagnostics on the listening RPC socket 0.0.0.0:46697 every 8 connection(s)
I20260928 10:03:34.899967  1912 messenger.cc:345] service WrongServiceName not registered on TestServer
[       OK ] Parameters/TestRpc.TestWrongService/SSL_TCP (72 ms)
[ RUN      ] Parameters/TestRpc.TestConnectionKeepalive/SSL_TCP
I20260928 10:03:34.920387  1937 acceptor_pool.cc:254] collecting diagnostics on the listening RPC socket 0.0.0.0:46449 every 8 connection(s)
I20260928 10:03:34.920665  1938 acceptor_pool.cc:254] collecting diagnostics on the listening RPC socket 0.0.0.0:46449 every 8 connection(s)
I20260928 10:03:34.921552  1818 rpc-test.cc:488] Connecting to 0.0.0.0:46449
[       OK ] Parameters/TestRpc.TestConnectionKeepalive/SSL_TCP (1084 ms)
[ RUN      ] Parameters/TestRpc.TestClientConnectionMetrics/SSL_TCP
I20260928 10:03:36.010970  1962 acceptor_pool.cc:254] collecting diagnostics on the listening RPC socket 0.0.0.0:37677 every 8 connection(s)
I20260928 10:03:36.011229  1963 acceptor_pool.cc:254] collecting diagnostics on the listening RPC socket 0.0.0.0:37677 every 8 connection(s)
I20260928 10:03:36.012151  1818 rpc-test.cc:569] Connecting to 0.0.0.0:37677
[       OK ] Parameters/TestRpc.TestClientConnectionMetrics/SSL_TCP (19707 ms)
[ RUN      ] Parameters/TestRpc.TestCredentialsPolicy/SSL_TCP
I20260928 10:03:55.742022  1985 acceptor_pool.cc:254] collecting diagnostics on the listening RPC socket 0.0.0.0:44343 every 8 connection(s)
I20260928 10:03:55.742301  1986 acceptor_pool.cc:254] collecting diagnostics on the listening RPC socket 0.0.0.0:44343 every 8 connection(s)
I20260928 10:03:55.743386  1818 rpc-test.cc:700] Connecting to 0.0.0.0:44343
[       OK ] Parameters/TestRpc.TestCredentialsPolicy/SSL_TCP (84 ms)
[ RUN      ] Parameters/TestRpc.TestCallLongerThanKeepalive/SSL_TCP
I20260928 10:03:55.807516  2010 acceptor_pool.cc:254] collecting diagnostics on the listening RPC socket 0.0.0.0:45533 every 8 connection(s)
I20260928 10:03:55.807792  2011 acceptor_pool.cc:254] collecting diagnostics on the listening RPC socket 0.0.0.0:45533 every 8 connection(s)
I20260928 10:03:55.835564  2014 rpc-test-base.h:222] got call: sleep_micros: 3000000 deferred: true
I20260928 10:03:58.837281  2014 rpcz_store.cc:275] Call kudu.rpc.GenericCalculatorService.Sleep from 127.0.0.1:53554 (request call id 0) took 3001 ms. Trace:
I20260928 10:03:58.837442  2014 rpcz_store.cc:276] 0928 10:03:55.835450 (+     0us) service_pool.cc:170] Inserting onto call queue
0928 10:03:55.835517 (+    67us) service_pool.cc:227] Handling call
0928 10:03:58.837233 (+3001716us) inbound_call.cc:173] Queueing success response
Metrics: {}
[       OK ] Parameters/TestRpc.TestCallLongerThanKeepalive/SSL_TCP (3059 ms)
[ RUN      ] Parameters/TestRpc.TestRpcSidecar/SSL_TCP
I20260928 10:03:58.857661  2035 acceptor_pool.cc:254] collecting diagnostics on the listening RPC socket 0.0.0.0:42579 every 8 connection(s)
I20260928 10:03:58.857882  2036 acceptor_pool.cc:254] collecting diagnostics on the listening RPC socket 0.0.0.0:42579 every 8 connection(s)
[       OK ] Parameters/TestRpc.TestRpcSidecar/SSL_TCP (110 ms)
[ RUN      ] Parameters/TestRpc.TestRpcSidecarLimits/SSL_TCP
I20260928 10:04:01.120764  2060 acceptor_pool.cc:254] collecting diagnostics on the listening RPC socket 0.0.0.0:43869 every 8 connection(s)
I20260928 10:04:01.121042  2061 acceptor_pool.cc:254] collecting diagnostics on the listening RPC socket 0.0.0.0:43869 every 8 connection(s)
W20260928 10:04:01.132602  1818 serialization.cc:72] Serialized kudu.rpc_test.PushStringsRequestPB (2147483654 bytes) is larger than the maximum configured RPC message size (52428800 bytes). Sending anyway, but peer may reject the data.
W20260928 10:04:01.138950  2057 connection.cc:535] server connection from 127.0.0.1:42900 recv error: Network error: RPC frame had a length of 2147483714, but we only support messages up to 52428800 bytes long.
W20260928 10:04:01.139101  2057 connection.cc:158] shutting down server connection from 127.0.0.1:42900 with pending inbound data: 4/2147483714 bytes received; last active 0 ns ago: status Network error: RPC frame had a length of 2147483714, but we only support messages up to 52428800 bytes long.
W20260928 10:04:01.139619  2073 connection.cc:196] Error closing socket: Network error: TlsSocket::Close: Connection reset by peer
I20260928 10:04:01.153436  2085 acceptor_pool.cc:254] collecting diagnostics on the listening RPC socket 0.0.0.0:39145 every 8 connection(s)
I20260928 10:04:01.154119  2086 acceptor_pool.cc:254] collecting diagnostics on the listening RPC socket 0.0.0.0:39145 every 8 connection(s)
W20260928 10:04:06.377501  2084 connection.cc:577] server connection from 127.0.0.1:33454: received bad data: 'Corruption: Invalid packet: message had a length of 2147483710, but we only support messages up to 2147483647 bytes
'
[       OK ] Parameters/TestRpc.TestRpcSidecarLimits/SSL_TCP (7900 ms)
[ RUN      ] Parameters/TestRpc.TestCallTimeoutDoesntAffectNegotiation/SSL_TCP
I20260928 10:04:06.872334  2110 acceptor_pool.cc:254] collecting diagnostics on the listening RPC socket 0.0.0.0:45055 every 8 connection(s)
I20260928 10:04:06.872632  2111 acceptor_pool.cc:254] collecting diagnostics on the listening RPC socket 0.0.0.0:45055 every 8 connection(s)
W20260928 10:04:06.890452  2106 negotiation.cc:266] Injecting 500ms delay in negotiation
I20260928 10:04:06.940883  1818 rpc-test-base.h:595] status: Timed out: connection negotiation to 0.0.0.0:45055 for RPC Sleep timed out after 0.050s (ON_OUTBOUND_QUEUE), seconds elapsed: 0.0510346
[       OK ] Parameters/TestRpc.TestCallTimeoutDoesntAffectNegotiation/SSL_TCP (545 ms)
[ RUN      ] Parameters/TestRpc.TestRpcHandlerLatencyMetric/SSL_TCP
I20260928 10:04:07.414060  2135 acceptor_pool.cc:254] collecting diagnostics on the listening RPC socket 0.0.0.0:41861 every 8 connection(s)
I20260928 10:04:07.414278  2136 acceptor_pool.cc:254] collecting diagnostics on the listening RPC socket 0.0.0.0:41861 every 8 connection(s)
I20260928 10:04:07.460419  1818 rpc-test.cc:1236] Sleep() min lat: 20578
I20260928 10:04:07.460534  1818 rpc-test.cc:1237] Sleep() mean lat: 20578
I20260928 10:04:07.460608  1818 rpc-test.cc:1238] Sleep() max lat: 20578
I20260928 10:04:07.460654  1818 rpc-test.cc:1239] Sleep() #calls: 1
[       OK ] Parameters/TestRpc.TestRpcHandlerLatencyMetric/SSL_TCP (65 ms)
[ RUN      ] Parameters/TestRpc.TimedOutOnResponseMetricServiceQueue/SSL_TCP
I20260928 10:04:07.482582  2161 acceptor_pool.cc:254] collecting diagnostics on the listening RPC socket 0.0.0.0:44731 every 8 connection(s)
I20260928 10:04:07.482856  2162 acceptor_pool.cc:254] collecting diagnostics on the listening RPC socket 0.0.0.0:44731 every 8 connection(s)
W20260928 10:04:07.544169  2163 rpcz_store.cc:267] Call kudu.rpc_test.CalculatorService.Sleep from 127.0.0.1:60796 (request call id 2) took 20 ms (client timeout 20 ms). Trace:
W20260928 10:04:07.544354  2163 rpcz_store.cc:269] 0928 10:04:07.523817 (+     0us) service_pool.cc:170] Inserting onto call queue
0928 10:04:07.544118 (+ 20301us) service_pool.cc:214] Skipping call since client already timed out
0928 10:04:07.544153 (+    35us) inbound_call.cc:173] Queueing failure response
Metrics: {}
[       OK ] Parameters/TestRpc.TimedOutOnResponseMetricServiceQueue/SSL_TCP (82 ms)
[ RUN      ] Parameters/TestRpc.RpcPendingConnectionsMetric/SSL_TCP
I20260928 10:04:07.553602  2184 acceptor_pool.cc:254] collecting diagnostics on the listening RPC socket 0.0.0.0:34175 every 8 connection(s)
I20260928 10:04:07.553833  2185 acceptor_pool.cc:254] collecting diagnostics on the listening RPC socket 0.0.0.0:34175 every 8 connection(s)
W20260928 10:04:07.564634  2180 negotiation.cc:337] Failed RPC negotiation. Trace:
0928 10:04:07.563667 (+     0us) reactor.cc:625] Submitting negotiation task for server connection from 127.0.0.1:42840 (local address 127.0.0.1:34175)
0928 10:04:07.563895 (+   228us) server_negotiation.cc:206] Beginning negotiation
0928 10:04:07.563903 (+     8us) server_negotiation.cc:399] Waiting for connection header
0928 10:04:07.564126 (+   223us) negotiation.cc:327] Negotiation complete: Network error: Server connection negotiation failed: server connection from 127.0.0.1:42840: BlockingRecv error: recv got EOF from 127.0.0.1:42840 (error 108)
Metrics: {"server-negotiator.queue_time_us":63}
[       OK ] Parameters/TestRpc.RpcPendingConnectionsMetric/SSL_TCP (27 ms)
[ RUN      ] Parameters/TestRpc.TestRpcContextClientDeadline/SSL_TCP
I20260928 10:04:07.599807  2200 acceptor_pool.cc:254] collecting diagnostics on the listening RPC socket 0.0.0.0:38859 every 8 connection(s)
I20260928 10:04:07.600040  2201 acceptor_pool.cc:254] collecting diagnostics on the listening RPC socket 0.0.0.0:38859 every 8 connection(s)
[       OK ] Parameters/TestRpc.TestRpcContextClientDeadline/SSL_TCP (67 ms)
[ RUN      ] Parameters/TestRpc.TestApplicationFeatureFlagUnsupportedServer/SSL_TCP
I20260928 10:04:07.673622  2225 acceptor_pool.cc:254] collecting diagnostics on the listening RPC socket 0.0.0.0:43255 every 8 connection(s)
I20260928 10:04:07.673902  2226 acceptor_pool.cc:254] collecting diagnostics on the listening RPC socket 0.0.0.0:43255 every 8 connection(s)
[       OK ] Parameters/TestRpc.TestApplicationFeatureFlagUnsupportedServer/SSL_TCP (62 ms)
[ RUN      ] Parameters/TestRpc.TestCancellationAsync/SSL_TCP
I20260928 10:04:07.719290  2250 acceptor_pool.cc:254] collecting diagnostics on the listening RPC socket 0.0.0.0:43219 every 8 connection(s)
I20260928 10:04:07.719530  2251 acceptor_pool.cc:254] collecting diagnostics on the listening RPC socket 0.0.0.0:43219 every 8 connection(s)
I20260928 10:04:07.720338  1818 rpc-test.cc:1716] Connecting to 0.0.0.0:43219
I20260928 10:04:07.731577  1818 test_util.cc:268] Using random seed: 802159965
I20260928 10:04:07.776362  2254 rpc-test-base.h:240] got call: sleep_micros: 500 pattern: 4294967295 num_repetitions: 2097152 sidecar_idx: 0
I20260928 10:04:07.806808  2253 rpc-test-base.h:240] got call: sleep_micros: 500 pattern: 4294967295 num_repetitions: 2097152 sidecar_idx: 0
I20260928 10:04:07.837667  2254 rpc-test-base.h:240] got call: sleep_micros: 500 pattern: 4294967295 num_repetitions: 2097152 sidecar_idx: 0
I20260928 10:04:07.868773  2253 rpc-test-base.h:240] got call: sleep_micros: 500 pattern: 4294967295 num_repetitions: 2097152 sidecar_idx: 0
I20260928 10:04:07.900585  2253 rpc-test-base.h:240] got call: sleep_micros: 500 pattern: 4294967295 num_repetitions: 2097152 sidecar_idx: 0
I20260928 10:04:07.931885  2254 rpc-test-base.h:240] got call: sleep_micros: 500 pattern: 4294967295 num_repetitions: 2097152 sidecar_idx: 0
I20260928 10:04:07.966336  2254 rpc-test-base.h:240] got call: sleep_micros: 500 pattern: 4294967295 num_repetitions: 2097152 sidecar_idx: 0
W20260928 10:04:07.966583  2248 connection.cc:196] Error closing socket: Network error: TlsSocket::Close: Broken pipe
W20260928 10:04:07.998875  2248 connection.cc:441] server connection from 127.0.0.1:33016 torn down before Call kudu.rpc.GenericCalculatorService.SleepWithSidecar from 127.0.0.1:33016 (request call id 9) could send its response
[       OK ] Parameters/TestRpc.TestCancellationAsync/SSL_TCP (295 ms)
[ RUN      ] Parameters/TestRpc.TestPerformanceBySocketType/SSL_TCP
I20260928 10:04:08.029493  2275 acceptor_pool.cc:254] collecting diagnostics on the listening RPC socket 0.0.0.0:41939 every 8 connection(s)
I20260928 10:04:08.029736  2276 acceptor_pool.cc:254] collecting diagnostics on the listening RPC socket 0.0.0.0:41939 every 8 connection(s)
I20260928 10:04:08.030620  1818 rpc-test.cc:1846] Connecting to 0.0.0.0:41939
I20260928 10:04:10.861750  1818 rpc-test.cc:1859] Sending 1024MB via ssl-enabled tcp socket: real 2.820s	user 2.550s	sys 2.105s
I20260928 10:04:13.759761  1818 rpc-test.cc:1859] Sending 1024MB via ssl-enabled tcp socket: real 2.898s	user 2.717s	sys 2.107s
I20260928 10:04:16.581164  1818 rpc-test.cc:1859] Sending 1024MB via ssl-enabled tcp socket: real 2.821s	user 2.546s	sys 2.124s
I20260928 10:04:19.403460  1818 rpc-test.cc:1859] Sending 1024MB via ssl-enabled tcp socket: real 2.822s	user 2.565s	sys 2.105s
I20260928 10:04:22.223572  1818 rpc-test.cc:1859] Sending 1024MB via ssl-enabled tcp socket: real 2.820s	user 2.537s	sys 2.123s
[       OK ] Parameters/TestRpc.TestPerformanceBySocketType/SSL_TCP (14228 ms)
[----------] 20 tests from Parameters/TestRpc (47591 ms total)

[----------] 1 test from Parameters/TestRpcSocketTxRxQueue
[ RUN      ] Parameters/TestRpcSocketTxRxQueue.OverCapacity/0
W20260928 10:04:22.524443  2310 negotiation.cc:337] Failed RPC negotiation. Trace:
0928 10:04:22.240303 (+     0us) reactor.cc:625] Submitting negotiation task for client connection to 0.0.0.0:38783 (local address 127.0.0.1:44146)
0928 10:04:22.240478 (+   175us) negotiation.cc:107] Waiting for socket to connect
0928 10:04:22.240497 (+    19us) client_negotiation.cc:174] Beginning negotiation
0928 10:04:22.240604 (+   107us) client_negotiation.cc:252] Sending NEGOTIATE NegotiatePB request
0928 10:04:22.524045 (+283441us) negotiation.cc:327] Negotiation complete: Network error: Client connection negotiation failed: client connection to 0.0.0.0:38783: BlockingRecv error: recv error from unknown peer: Transport endpoint is not connected (error 107)
Metrics: {"client-negotiator.queue_time_us":39}
W20260928 10:04:22.524530  2319 negotiation.cc:337] Failed RPC negotiation. Trace:
0928 10:04:22.242988 (+     0us) reactor.cc:625] Submitting negotiation task for client connection to 0.0.0.0:38783 (local address 127.0.0.1:44162)
0928 10:04:22.243164 (+   176us) negotiation.cc:107] Waiting for socket to connect
0928 10:04:22.243184 (+    20us) client_negotiation.cc:174] Beginning negotiation
0928 10:04:22.243290 (+   106us) client_negotiation.cc:252] Sending NEGOTIATE NegotiatePB request
0928 10:04:22.524300 (+281010us) negotiation.cc:327] Negotiation complete: Network error: Client connection negotiation failed: client connection to 0.0.0.0:38783: BlockingRecv error: recv error from unknown peer: Transport endpoint is not connected (error 107)
Metrics: {"client-negotiator.queue_time_us":47}
W20260928 10:04:22.524443  2301 negotiation.cc:337] Failed RPC negotiation. Trace:
0928 10:04:22.238040 (+     0us) reactor.cc:625] Submitting negotiation task for client connection to 0.0.0.0:38783 (local address 127.0.0.1:44138)
0928 10:04:22.238191 (+   151us) negotiation.cc:107] Waiting for socket to connect
0928 10:04:22.238206 (+    15us) client_negotiation.cc:174] Beginning negotiation
0928 10:04:22.238298 (+    92us) client_negotiation.cc:252] Sending NEGOTIATE NegotiatePB request
0928 10:04:22.524045 (+285747us) negotiation.cc:327] Negotiation complete: Network error: Client connection negotiation failed: client connection to 0.0.0.0:38783: BlockingRecv error: recv error from unknown peer: Transport endpoint is not connected (error 107)
Metrics: {"client-negotiator.queue_time_us":45}
W20260928 10:04:22.525477  2328 negotiation.cc:337] Failed RPC negotiation. Trace:
0928 10:04:22.245451 (+     0us) reactor.cc:625] Submitting negotiation task for client connection to 0.0.0.0:38783 (local address 127.0.0.1:44166)
0928 10:04:22.245648 (+   197us) negotiation.cc:107] Waiting for socket to connect
0928 10:04:22.245666 (+    18us) client_negotiation.cc:174] Beginning negotiation
0928 10:04:22.245764 (+    98us) client_negotiation.cc:252] Sending NEGOTIATE NegotiatePB request
0928 10:04:22.524045 (+278281us) negotiation.cc:327] Negotiation complete: Network error: Client connection negotiation failed: client connection to 0.0.0.0:38783: BlockingRecv error: recv error from unknown peer: Transport endpoint is not connected (error 107)
Metrics: {"client-negotiator.queue_time_us":50}
W20260928 10:04:22.525628  2337 negotiation.cc:337] Failed RPC negotiation. Trace:
0928 10:04:22.248044 (+     0us) reactor.cc:625] Submitting negotiation task for client connection to 0.0.0.0:38783 (local address 127.0.0.1:44180)
0928 10:04:22.248240 (+   196us) negotiation.cc:107] Waiting for socket to connect
0928 10:04:22.248255 (+    15us) client_negotiation.cc:174] Beginning negotiation
0928 10:04:22.248347 (+    92us) client_negotiation.cc:252] Sending NEGOTIATE NegotiatePB request
0928 10:04:22.524687 (+276340us) negotiation.cc:327] Negotiation complete: Network error: Client connection negotiation failed: client connection to 0.0.0.0:38783: BlockingRecv error: recv error from unknown peer: Transport endpoint is not connected (error 107)
Metrics: {"client-negotiator.queue_time_us":54}
W20260928 10:04:22.525656  2292 negotiation.cc:337] Failed RPC negotiation. Trace:
0928 10:04:22.235138 (+     0us) reactor.cc:625] Submitting negotiation task for client connection to 0.0.0.0:38783 (local address 127.0.0.1:44126)
0928 10:04:22.235351 (+   213us) negotiation.cc:107] Waiting for socket to connect
0928 10:04:22.235370 (+    19us) client_negotiation.cc:174] Beginning negotiation
0928 10:04:22.235501 (+   131us) client_negotiation.cc:252] Sending NEGOTIATE NegotiatePB request
0928 10:04:22.524087 (+288586us) negotiation.cc:327] Negotiation complete: Network error: Client connection negotiation failed: client connection to 0.0.0.0:38783: BlockingRecv error: recv error from unknown peer: Transport endpoint is not connected (error 107)
Metrics: {"client-negotiator.queue_time_us":67}
[       OK ] Parameters/TestRpcSocketTxRxQueue.OverCapacity/0 (1067 ms)
[----------] 1 test from Parameters/TestRpcSocketTxRxQueue (1067 ms total)

[----------] Global test environment tear-down
[==========] 21 tests from 2 test suites ran. (48659 ms total)
[  PASSED  ] 20 tests.
[  FAILED  ] 1 test, listed below:
[  FAILED  ] Parameters/TestRpc.TestCallWithChainCertAndChainCA/SSL_TCP, where GetParam() = (true, false)

 1 FAILED TEST