Diagnosed failure
Parameters/TestRpc.TestCallWithChainCertAndChainCA/SSL_UnixSocket: /data0/somelongdirectorytoavoidrpathissues/src/kudu/src/kudu/rpc/rpc-test.cc:270: Failure
Failed
Bad status: Runtime error: could not verify certificate chain (error with cert: subject=CN = localhost, ST = sadfjas, C = AS, emailAddress = sdflkdsajf, O = lskdfjlsad, OU = sldfkja, issuer=C = AS, ST = ASDfkjdhf, L = lskdjf, O = saldfja, OU = skdjf, CN = localhost, emailAddress = sadjflkadsj): : certificate has expired
Google Test trace:
/data0/somelongdirectorytoavoidrpathissues/src/kudu/src/kudu/rpc/rpc-test.cc:267: Connecting to unix:/tmp/dist-test-taskhsQtuR/test-tmp/rpc-test-1654f255e01843c6ac9ac16f0279e19a.sock
I20260925 15:07:43.519541 4750 test_util.cc:175] -----------------------------------------------
I20260925 15:07:43.519642 4750 test_util.cc:176] Had fatal failures, leaving test files at /tmp/dist-test-taskhsQtuR/test-tmp/rpc-test.6.Parameters_TestRpc.TestCallWithChainCertAndChainCA_SSL_UnixSocket.1790348863402828-4750-0
Full log
Note: This is test shard 7 of 8.
[==========] Running 21 tests from 2 test suites.
[----------] Global test environment set-up.
[----------] 20 tests from Parameters/TestRpc
[ RUN ] Parameters/TestRpc.TestMessengerCreateDestroy/SSL_UnixSocket
WARNING: Logging before InitGoogleLogging() is written to STDERR
I20260925 15:07:43.453658 4750 rpc-test.cc:169] started messenger TestCreateDestroy
[ OK ] Parameters/TestRpc.TestMessengerCreateDestroy/SSL_UnixSocket (35 ms)
[ RUN ] Parameters/TestRpc.TestNegotiationDeadlock/SSL_UnixSocket
I20260925 15:07:43.472682 4770 acceptor_pool.cc:254] collecting diagnostics on the listening RPC socket unix:/tmp/dist-test-taskhsQtuR/test-tmp/rpc-test-92c52b3a5ca94b46ab38bac9469772f7.sock every 8 connection(s)
I20260925 15:07:43.472999 4771 acceptor_pool.cc:254] collecting diagnostics on the listening RPC socket unix:/tmp/dist-test-taskhsQtuR/test-tmp/rpc-test-92c52b3a5ca94b46ab38bac9469772f7.sock every 8 connection(s)
[ OK ] Parameters/TestRpc.TestNegotiationDeadlock/SSL_UnixSocket (34 ms)
[ RUN ] Parameters/TestRpc.TestCallWithChainCertAndChainCA/SSL_UnixSocket
I20260925 15:07:43.507754 4786 acceptor_pool.cc:254] collecting diagnostics on the listening RPC socket unix:/tmp/dist-test-taskhsQtuR/test-tmp/rpc-test-1654f255e01843c6ac9ac16f0279e19a.sock every 8 connection(s)
I20260925 15:07:43.508095 4787 acceptor_pool.cc:254] collecting diagnostics on the listening RPC socket unix:/tmp/dist-test-taskhsQtuR/test-tmp/rpc-test-1654f255e01843c6ac9ac16f0279e19a.sock every 8 connection(s)
/data0/somelongdirectorytoavoidrpathissues/src/kudu/src/kudu/rpc/rpc-test.cc:270: Failure
Failed
Bad status: Runtime error: could not verify certificate chain (error with cert: subject=CN = localhost, ST = sadfjas, C = AS, emailAddress = sdflkdsajf, O = lskdfjlsad, OU = sldfkja, issuer=C = AS, ST = ASDfkjdhf, L = lskdjf, O = saldfja, OU = skdjf, CN = localhost, emailAddress = sadjflkadsj): : certificate has expired
Google Test trace:
/data0/somelongdirectorytoavoidrpathissues/src/kudu/src/kudu/rpc/rpc-test.cc:267: Connecting to unix:/tmp/dist-test-taskhsQtuR/test-tmp/rpc-test-1654f255e01843c6ac9ac16f0279e19a.sock
I20260925 15:07:43.519541 4750 test_util.cc:175] -----------------------------------------------
I20260925 15:07:43.519642 4750 test_util.cc:176] Had fatal failures, leaving test files at /tmp/dist-test-taskhsQtuR/test-tmp/rpc-test.6.Parameters_TestRpc.TestCallWithChainCertAndChainCA_SSL_UnixSocket.1790348863402828-4750-0
[ FAILED ] Parameters/TestRpc.TestCallWithChainCertAndChainCA/SSL_UnixSocket, where GetParam() = (true, true) (27 ms)
[ RUN ] Parameters/TestRpc.TestCallWithPasswordProtectedKey/SSL_UnixSocket
I20260925 15:07:43.575397 4811 acceptor_pool.cc:254] collecting diagnostics on the listening RPC socket unix:/tmp/dist-test-taskhsQtuR/test-tmp/rpc-test-5f48ccceaf294472b25db9d5f3b68bbd.sock every 8 connection(s)
I20260925 15:07:43.575702 4812 acceptor_pool.cc:254] collecting diagnostics on the listening RPC socket unix:/tmp/dist-test-taskhsQtuR/test-tmp/rpc-test-5f48ccceaf294472b25db9d5f3b68bbd.sock every 8 connection(s)
W20260925 15:07:43.605378 4808 connection.cc:196] Error closing socket: Network error: TlsSocket::Close: Broken pipe
[ OK ] Parameters/TestRpc.TestCallWithPasswordProtectedKey/SSL_UnixSocket (89 ms)
[ RUN ] Parameters/TestRpc.TestCallToBadServer/SSL_UnixSocket
I20260925 15:07:43.634568 4750 rpc-test.cc:394] Status: Network error: Client connection negotiation failed: client connection to 0.0.0.0:0: connect: Connection refused (error 111)
I20260925 15:07:43.635212 4750 rpc-test.cc:394] Status: Network error: Client connection negotiation failed: client connection to 0.0.0.0:0: connect: Connection refused (error 111)
I20260925 15:07:43.635812 4750 rpc-test.cc:394] Status: Network error: Client connection negotiation failed: client connection to 0.0.0.0:0: connect: Connection refused (error 111)
I20260925 15:07:43.636297 4750 rpc-test.cc:394] Status: Network error: Client connection negotiation failed: client connection to 0.0.0.0:0: connect: Connection refused (error 111)
I20260925 15:07:43.636884 4750 rpc-test.cc:394] Status: Network error: Client connection negotiation failed: client connection to 0.0.0.0:0: connect: Connection refused (error 111)
[ OK ] Parameters/TestRpc.TestCallToBadServer/SSL_UnixSocket (29 ms)
[ RUN ] Parameters/TestRpc.TestWrongService/SSL_UnixSocket
I20260925 15:07:43.670367 4846 acceptor_pool.cc:254] collecting diagnostics on the listening RPC socket unix:/tmp/dist-test-taskhsQtuR/test-tmp/rpc-test-7f926803700c4592b3db9c1ee72e12c0.sock every 8 connection(s)
I20260925 15:07:43.670606 4847 acceptor_pool.cc:254] collecting diagnostics on the listening RPC socket unix:/tmp/dist-test-taskhsQtuR/test-tmp/rpc-test-7f926803700c4592b3db9c1ee72e12c0.sock every 8 connection(s)
I20260925 15:07:43.699718 4843 messenger.cc:345] service WrongServiceName not registered on TestServer
[ OK ] Parameters/TestRpc.TestWrongService/SSL_UnixSocket (65 ms)
[ RUN ] Parameters/TestRpc.TestConnectionKeepalive/SSL_UnixSocket
I20260925 15:07:43.714376 4869 acceptor_pool.cc:254] collecting diagnostics on the listening RPC socket unix:/tmp/dist-test-taskhsQtuR/test-tmp/rpc-test-2dcd5af95fea42a289d32ff92a6ecd91.sock every 8 connection(s)
I20260925 15:07:43.714637 4870 acceptor_pool.cc:254] collecting diagnostics on the listening RPC socket unix:/tmp/dist-test-taskhsQtuR/test-tmp/rpc-test-2dcd5af95fea42a289d32ff92a6ecd91.sock every 8 connection(s)
I20260925 15:07:43.715502 4750 rpc-test.cc:488] Connecting to unix:/tmp/dist-test-taskhsQtuR/test-tmp/rpc-test-2dcd5af95fea42a289d32ff92a6ecd91.sock
W20260925 15:07:44.207145 4882 connection.cc:196] Error closing socket: Network error: TlsSocket::Close: Broken pipe
[ OK ] Parameters/TestRpc.TestConnectionKeepalive/SSL_UnixSocket (1043 ms)
[ RUN ] Parameters/TestRpc.TestClientConnectionMetrics/SSL_UnixSocket
I20260925 15:07:44.761583 4894 acceptor_pool.cc:254] collecting diagnostics on the listening RPC socket unix:/tmp/dist-test-taskhsQtuR/test-tmp/rpc-test-2eb50ea030b14f4c8b7909dec88692d0.sock every 8 connection(s)
I20260925 15:07:44.761879 4895 acceptor_pool.cc:254] collecting diagnostics on the listening RPC socket unix:/tmp/dist-test-taskhsQtuR/test-tmp/rpc-test-2eb50ea030b14f4c8b7909dec88692d0.sock every 8 connection(s)
I20260925 15:07:44.762814 4750 rpc-test.cc:569] Connecting to unix:/tmp/dist-test-taskhsQtuR/test-tmp/rpc-test-2eb50ea030b14f4c8b7909dec88692d0.sock
W20260925 15:08:06.002022 4891 connection.cc:196] Error closing socket: Network error: TlsSocket::Close: Broken pipe
[ OK ] Parameters/TestRpc.TestClientConnectionMetrics/SSL_UnixSocket (21260 ms)
[ RUN ] Parameters/TestRpc.TestCredentialsPolicy/SSL_UnixSocket
I20260925 15:08:06.022460 4917 acceptor_pool.cc:254] collecting diagnostics on the listening RPC socket unix:/tmp/dist-test-taskhsQtuR/test-tmp/rpc-test-ddcb96d75c64430bb34949c9450b64ef.sock every 8 connection(s)
I20260925 15:08:06.022765 4918 acceptor_pool.cc:254] collecting diagnostics on the listening RPC socket unix:/tmp/dist-test-taskhsQtuR/test-tmp/rpc-test-ddcb96d75c64430bb34949c9450b64ef.sock every 8 connection(s)
I20260925 15:08:06.023687 4750 rpc-test.cc:700] Connecting to unix:/tmp/dist-test-taskhsQtuR/test-tmp/rpc-test-ddcb96d75c64430bb34949c9450b64ef.sock
W20260925 15:08:06.043121 4916 connection.cc:196] Error closing socket: Network error: TlsSocket::Close: Broken pipe
W20260925 15:08:06.050616 4916 connection.cc:196] Error closing socket: Network error: TlsSocket::Close: Broken pipe
[ OK ] Parameters/TestRpc.TestCredentialsPolicy/SSL_UnixSocket (44 ms)
[ RUN ] Parameters/TestRpc.TestCallLongerThanKeepalive/SSL_UnixSocket
I20260925 15:08:06.068363 4942 acceptor_pool.cc:254] collecting diagnostics on the listening RPC socket unix:/tmp/dist-test-taskhsQtuR/test-tmp/rpc-test-9ad9c73dc0f04074a3b6b665d0d58ea8.sock every 8 connection(s)
I20260925 15:08:06.068571 4943 acceptor_pool.cc:254] collecting diagnostics on the listening RPC socket unix:/tmp/dist-test-taskhsQtuR/test-tmp/rpc-test-9ad9c73dc0f04074a3b6b665d0d58ea8.sock every 8 connection(s)
I20260925 15:08:06.101011 4946 rpc-test-base.h:222] got call: sleep_micros: 3000000 deferred: true
I20260925 15:08:09.102684 4946 rpcz_store.cc:275] Call kudu.rpc.GenericCalculatorService.Sleep from unix:<unnamed> (request call id 0) took 3001 ms. Trace:
I20260925 15:08:09.102867 4946 rpcz_store.cc:276] 0925 15:08:06.100910 (+ 0us) service_pool.cc:170] Inserting onto call queue
0925 15:08:06.100966 (+ 56us) service_pool.cc:227] Handling call
0925 15:08:09.102644 (+3001678us) inbound_call.cc:173] Queueing success response
Metrics: {}
[ OK ] Parameters/TestRpc.TestCallLongerThanKeepalive/SSL_UnixSocket (3055 ms)
[ RUN ] Parameters/TestRpc.TestRpcSidecar/SSL_UnixSocket
I20260925 15:08:09.120786 4967 acceptor_pool.cc:254] collecting diagnostics on the listening RPC socket unix:/tmp/dist-test-taskhsQtuR/test-tmp/rpc-test-dbf6f610463b46489427bd6d37fa6fe7.sock every 8 connection(s)
I20260925 15:08:09.121105 4968 acceptor_pool.cc:254] collecting diagnostics on the listening RPC socket unix:/tmp/dist-test-taskhsQtuR/test-tmp/rpc-test-dbf6f610463b46489427bd6d37fa6fe7.sock every 8 connection(s)
W20260925 15:08:09.222518 4964 connection.cc:196] Error closing socket: Network error: TlsSocket::Close: Broken pipe
[ OK ] Parameters/TestRpc.TestRpcSidecar/SSL_UnixSocket (117 ms)
[ RUN ] Parameters/TestRpc.TestRpcSidecarLimits/SSL_UnixSocket
I20260925 15:08:11.284212 4992 acceptor_pool.cc:254] collecting diagnostics on the listening RPC socket unix:/tmp/dist-test-taskhsQtuR/test-tmp/rpc-test-7351a132268845f1813a579afec1d4af.sock every 8 connection(s)
I20260925 15:08:11.284531 4993 acceptor_pool.cc:254] collecting diagnostics on the listening RPC socket unix:/tmp/dist-test-taskhsQtuR/test-tmp/rpc-test-7351a132268845f1813a579afec1d4af.sock every 8 connection(s)
W20260925 15:08:11.293883 4750 serialization.cc:72] Serialized kudu.rpc_test.PushStringsRequestPB (2147483654 bytes) is larger than the maximum configured RPC message size (52428800 bytes). Sending anyway, but peer may reject the data.
W20260925 15:08:11.299677 4989 connection.cc:535] server connection from unix:<unnamed> recv error: Network error: RPC frame had a length of 2147483714, but we only support messages up to 52428800 bytes long.
W20260925 15:08:11.299794 4989 connection.cc:158] shutting down server connection from unix:<unnamed> with pending inbound data: 4/2147483714 bytes received; last active 0 ns ago: status Network error: RPC frame had a length of 2147483714, but we only support messages up to 52428800 bytes long.
W20260925 15:08:11.300343 5005 connection.cc:196] Error closing socket: Network error: TlsSocket::Close: Broken pipe
I20260925 15:08:11.321053 5017 acceptor_pool.cc:254] collecting diagnostics on the listening RPC socket unix:/tmp/dist-test-taskhsQtuR/test-tmp/rpc-test-7351a132268845f1813a579afec1d4af.sock every 8 connection(s)
I20260925 15:08:11.321182 5018 acceptor_pool.cc:254] collecting diagnostics on the listening RPC socket unix:/tmp/dist-test-taskhsQtuR/test-tmp/rpc-test-7351a132268845f1813a579afec1d4af.sock every 8 connection(s)
W20260925 15:08:17.236974 5014 connection.cc:577] server connection from unix:<unnamed>: received bad data: 'Corruption: Invalid packet: message had a length of 2147483710, but we only support messages up to 2147483647 bytes
'
W20260925 15:08:17.237562 5030 connection.cc:196] Error closing socket: Network error: TlsSocket::Close: Broken pipe
[ OK ] Parameters/TestRpc.TestRpcSidecarLimits/SSL_UnixSocket (8480 ms)
[ RUN ] Parameters/TestRpc.TestCallTimeoutDoesntAffectNegotiation/SSL_UnixSocket
I20260925 15:08:17.735088 5042 acceptor_pool.cc:254] collecting diagnostics on the listening RPC socket unix:/tmp/dist-test-taskhsQtuR/test-tmp/rpc-test-af3011c8ca6048f28abb86773bb039a0.sock every 8 connection(s)
I20260925 15:08:17.735441 5043 acceptor_pool.cc:254] collecting diagnostics on the listening RPC socket unix:/tmp/dist-test-taskhsQtuR/test-tmp/rpc-test-af3011c8ca6048f28abb86773bb039a0.sock every 8 connection(s)
W20260925 15:08:17.783283 5038 negotiation.cc:266] Injecting 500ms delay in negotiation
I20260925 15:08:17.833660 4750 rpc-test-base.h:595] status: Timed out: connection negotiation to unix:/tmp/dist-test-taskhsQtuR/test-tmp/rpc-test-af3011c8ca6048f28abb86773bb039a0.sock for RPC Sleep timed out after 0.050s (ON_OUTBOUND_QUEUE), seconds elapsed: 0.0510131
[ OK ] Parameters/TestRpc.TestCallTimeoutDoesntAffectNegotiation/SSL_UnixSocket (586 ms)
[ RUN ] Parameters/TestRpc.TestRpcHandlerLatencyMetric/SSL_UnixSocket
I20260925 15:08:18.306303 5067 acceptor_pool.cc:254] collecting diagnostics on the listening RPC socket unix:/tmp/dist-test-taskhsQtuR/test-tmp/rpc-test-a1cc70cab123497b9a98965b040790c0.sock every 8 connection(s)
I20260925 15:08:18.306595 5068 acceptor_pool.cc:254] collecting diagnostics on the listening RPC socket unix:/tmp/dist-test-taskhsQtuR/test-tmp/rpc-test-a1cc70cab123497b9a98965b040790c0.sock every 8 connection(s)
I20260925 15:08:18.354751 4750 rpc-test.cc:1236] Sleep() min lat: 20661
I20260925 15:08:18.354873 4750 rpc-test.cc:1237] Sleep() mean lat: 20661
I20260925 15:08:18.354957 4750 rpc-test.cc:1238] Sleep() max lat: 20661
I20260925 15:08:18.355002 4750 rpc-test.cc:1239] Sleep() #calls: 1
[ OK ] Parameters/TestRpc.TestRpcHandlerLatencyMetric/SSL_UnixSocket (66 ms)
[ RUN ] Parameters/TestRpc.TimedOutOnResponseMetricServiceQueue/SSL_UnixSocket
I20260925 15:08:18.368999 5093 acceptor_pool.cc:254] collecting diagnostics on the listening RPC socket unix:/tmp/dist-test-taskhsQtuR/test-tmp/rpc-test-408f4656ebcb4f18bf39e1b81438cf1c.sock every 8 connection(s)
I20260925 15:08:18.369212 5094 acceptor_pool.cc:254] collecting diagnostics on the listening RPC socket unix:/tmp/dist-test-taskhsQtuR/test-tmp/rpc-test-408f4656ebcb4f18bf39e1b81438cf1c.sock every 8 connection(s)
W20260925 15:08:18.435111 5095 rpcz_store.cc:267] Call kudu.rpc_test.CalculatorService.Sleep from unix:<unnamed> (request call id 2) took 20 ms (client timeout 20 ms). Trace:
W20260925 15:08:18.435328 5095 rpcz_store.cc:269] 0925 15:08:18.414523 (+ 0us) service_pool.cc:170] Inserting onto call queue
0925 15:08:18.434979 (+ 20456us) service_pool.cc:214] Skipping call since client already timed out
0925 15:08:18.435085 (+ 106us) inbound_call.cc:173] Queueing failure response
Metrics: {}
[ OK ] Parameters/TestRpc.TimedOutOnResponseMetricServiceQueue/SSL_UnixSocket (80 ms)
[ RUN ] Parameters/TestRpc.RpcPendingConnectionsMetric/SSL_UnixSocket
I20260925 15:08:18.445271 5116 acceptor_pool.cc:254] collecting diagnostics on the listening RPC socket 0.0.0.0:34979 every 8 connection(s)
I20260925 15:08:18.445501 5117 acceptor_pool.cc:254] collecting diagnostics on the listening RPC socket 0.0.0.0:34979 every 8 connection(s)
W20260925 15:08:18.447553 5112 negotiation.cc:337] Failed RPC negotiation. Trace:
0925 15:08:18.446896 (+ 0us) reactor.cc:625] Submitting negotiation task for server connection from 127.0.0.1:34186 (local address 127.0.0.1:34979)
0925 15:08:18.447037 (+ 141us) server_negotiation.cc:206] Beginning negotiation
0925 15:08:18.447042 (+ 5us) server_negotiation.cc:399] Waiting for connection header
0925 15:08:18.447173 (+ 131us) negotiation.cc:327] Negotiation complete: Network error: Server connection negotiation failed: server connection from 127.0.0.1:34186: BlockingRecv error: recv got EOF from 127.0.0.1:34186 (error 108)
Metrics: {"server-negotiator.queue_time_us":46}
[ OK ] Parameters/TestRpc.RpcPendingConnectionsMetric/SSL_UnixSocket (20 ms)
[ RUN ] Parameters/TestRpc.TestRpcContextClientDeadline/SSL_UnixSocket
I20260925 15:08:18.472347 5132 acceptor_pool.cc:254] collecting diagnostics on the listening RPC socket unix:/tmp/dist-test-taskhsQtuR/test-tmp/rpc-test-924b00a9197441feabc758056ae7adb6.sock every 8 connection(s)
I20260925 15:08:18.472595 5133 acceptor_pool.cc:254] collecting diagnostics on the listening RPC socket unix:/tmp/dist-test-taskhsQtuR/test-tmp/rpc-test-924b00a9197441feabc758056ae7adb6.sock every 8 connection(s)
W20260925 15:08:18.514736 5129 connection.cc:196] Error closing socket: Network error: TlsSocket::Close: Broken pipe
[ OK ] Parameters/TestRpc.TestRpcContextClientDeadline/SSL_UnixSocket (57 ms)
[ RUN ] Parameters/TestRpc.TestApplicationFeatureFlagUnsupportedServer/SSL_UnixSocket
I20260925 15:08:18.537747 5157 acceptor_pool.cc:254] collecting diagnostics on the listening RPC socket unix:/tmp/dist-test-taskhsQtuR/test-tmp/rpc-test-0f104d9e617d492b8e15409d1684d0da.sock every 8 connection(s)
I20260925 15:08:18.537963 5158 acceptor_pool.cc:254] collecting diagnostics on the listening RPC socket unix:/tmp/dist-test-taskhsQtuR/test-tmp/rpc-test-0f104d9e617d492b8e15409d1684d0da.sock every 8 connection(s)
W20260925 15:08:18.564203 5154 connection.cc:196] Error closing socket: Network error: TlsSocket::Close: Broken pipe
[ OK ] Parameters/TestRpc.TestApplicationFeatureFlagUnsupportedServer/SSL_UnixSocket (49 ms)
[ RUN ] Parameters/TestRpc.TestCancellationAsync/SSL_UnixSocket
I20260925 15:08:18.600836 5182 acceptor_pool.cc:254] collecting diagnostics on the listening RPC socket unix:/tmp/dist-test-taskhsQtuR/test-tmp/rpc-test-a7abde5af1aa497488bd608fa6a54529.sock every 8 connection(s)
I20260925 15:08:18.601071 5183 acceptor_pool.cc:254] collecting diagnostics on the listening RPC socket unix:/tmp/dist-test-taskhsQtuR/test-tmp/rpc-test-a7abde5af1aa497488bd608fa6a54529.sock every 8 connection(s)
I20260925 15:08:18.601931 4750 rpc-test.cc:1716] Connecting to unix:/tmp/dist-test-taskhsQtuR/test-tmp/rpc-test-a7abde5af1aa497488bd608fa6a54529.sock
I20260925 15:08:18.629833 4750 test_util.cc:268] Using random seed: 371226806
I20260925 15:08:18.676623 5186 rpc-test-base.h:240] got call: sleep_micros: 500 pattern: 4294967295 num_repetitions: 2097152 sidecar_idx: 0
I20260925 15:08:18.712534 5186 rpc-test-base.h:240] got call: sleep_micros: 500 pattern: 4294967295 num_repetitions: 2097152 sidecar_idx: 0
I20260925 15:08:18.748621 5186 rpc-test-base.h:240] got call: sleep_micros: 500 pattern: 4294967295 num_repetitions: 2097152 sidecar_idx: 0
I20260925 15:08:18.784902 5186 rpc-test-base.h:240] got call: sleep_micros: 500 pattern: 4294967295 num_repetitions: 2097152 sidecar_idx: 0
I20260925 15:08:18.811954 5185 rpc-test-base.h:240] got call: sleep_micros: 500 pattern: 4294967295 num_repetitions: 2097152 sidecar_idx: 0
I20260925 15:08:18.843276 5184 rpc-test-base.h:240] got call: sleep_micros: 500 pattern: 4294967295 num_repetitions: 2097152 sidecar_idx: 0
W20260925 15:08:18.846077 5179 connection.cc:196] Error closing socket: Network error: TlsSocket::Close: Broken pipe
W20260925 15:08:18.847380 5179 connection.cc:441] server connection from unix:<unnamed> torn down before Call kudu.rpc.GenericCalculatorService.SleepWithSidecar from unix:<unnamed> (request call id 7) could send its response
W20260925 15:08:18.862136 5179 connection.cc:441] server connection from unix:<unnamed> torn down before Call kudu.rpc.GenericCalculatorService.SleepWithSidecar from unix:<unnamed> (request call id 8) could send its response
W20260925 15:08:18.877851 5179 connection.cc:441] server connection from unix:<unnamed> torn down before Call kudu.rpc.GenericCalculatorService.SleepWithSidecar from unix:<unnamed> (request call id 9) could send its response
[ OK ] Parameters/TestRpc.TestCancellationAsync/SSL_UnixSocket (313 ms)
[ RUN ] Parameters/TestRpc.TestPerformanceBySocketType/SSL_UnixSocket
I20260925 15:08:18.911266 5207 acceptor_pool.cc:254] collecting diagnostics on the listening RPC socket unix:/tmp/dist-test-taskhsQtuR/test-tmp/rpc-test-d38f2777751f4a279e969e7a791edf27.sock every 8 connection(s)
I20260925 15:08:18.911489 5208 acceptor_pool.cc:254] collecting diagnostics on the listening RPC socket unix:/tmp/dist-test-taskhsQtuR/test-tmp/rpc-test-d38f2777751f4a279e969e7a791edf27.sock every 8 connection(s)
I20260925 15:08:18.912380 4750 rpc-test.cc:1846] Connecting to unix:/tmp/dist-test-taskhsQtuR/test-tmp/rpc-test-d38f2777751f4a279e969e7a791edf27.sock
I20260925 15:08:21.954002 4750 rpc-test.cc:1859] Sending 1024MB via ssl-enabled unix socket: real 3.019s user 2.943s sys 2.189s
I20260925 15:08:25.077939 4750 rpc-test.cc:1859] Sending 1024MB via ssl-enabled unix socket: real 3.124s user 3.039s sys 2.243s
I20260925 15:08:28.202831 4750 rpc-test.cc:1859] Sending 1024MB via ssl-enabled unix socket: real 3.125s user 3.167s sys 2.136s
I20260925 15:08:31.228289 4750 rpc-test.cc:1859] Sending 1024MB via ssl-enabled unix socket: real 3.025s user 2.997s sys 2.136s
I20260925 15:08:34.456022 4750 rpc-test.cc:1859] Sending 1024MB via ssl-enabled unix socket: real 3.228s user 3.217s sys 2.263s
W20260925 15:08:34.456982 5204 connection.cc:196] Error closing socket: Network error: TlsSocket::Close: Broken pipe
[ OK ] Parameters/TestRpc.TestPerformanceBySocketType/SSL_UnixSocket (15583 ms)
[----------] 20 tests from Parameters/TestRpc (51042 ms total)
[----------] 1 test from Parameters/TestRpcSocketTxRxQueue
[ RUN ] Parameters/TestRpcSocketTxRxQueue.AcceptorRxQueueSizeMetric/0
I20260925 15:08:34.469323 5232 acceptor_pool.cc:254] collecting diagnostics on the listening RPC socket 0.0.0.0:43299 every 1 connection(s)
I20260925 15:08:34.469550 5233 acceptor_pool.cc:254] collecting diagnostics on the listening RPC socket 0.0.0.0:43299 every 1 connection(s)
W20260925 15:08:34.471201 5228 negotiation.cc:337] Failed RPC negotiation. Trace:
0925 15:08:34.470837 (+ 0us) reactor.cc:625] Submitting negotiation task for server connection from 127.0.0.1:33728 (local address 127.0.0.1:43299)
0925 15:08:34.470967 (+ 130us) server_negotiation.cc:206] Beginning negotiation
0925 15:08:34.470971 (+ 4us) server_negotiation.cc:399] Waiting for connection header
0925 15:08:34.471089 (+ 118us) negotiation.cc:327] Negotiation complete: Network error: Server connection negotiation failed: server connection from 127.0.0.1:33728: BlockingRecv error: recv got EOF from 127.0.0.1:33728 (error 108)
Metrics: {"server-negotiator.queue_time_us":38}
[ OK ] Parameters/TestRpcSocketTxRxQueue.AcceptorRxQueueSizeMetric/0 (10 ms)
[----------] 1 test from Parameters/TestRpcSocketTxRxQueue (10 ms total)
[----------] Global test environment tear-down
[==========] 21 tests from 2 test suites ran. (51053 ms total)
[ PASSED ] 20 tests.
[ FAILED ] 1 test, listed below:
[ FAILED ] Parameters/TestRpc.TestCallWithChainCertAndChainCA/SSL_UnixSocket, where GetParam() = (true, true)
1 FAILED TEST