Diagnosed failure
Parameters/TestRpc.TestCallWithChainCertAndChainCA/SSL_UnixSocket: /data0/somelongdirectorytoavoidrpathissues/src/kudu/src/kudu/rpc/rpc-test.cc:270: Failure
Failed
Bad status: Runtime error: could not verify certificate chain (error with cert: subject=CN = localhost, ST = sadfjas, C = AS, emailAddress = sdflkdsajf, O = lskdfjlsad, OU = sldfkja, issuer=C = AS, ST = ASDfkjdhf, L = lskdjf, O = saldfja, OU = skdjf, CN = localhost, emailAddress = sadjflkadsj): : certificate has expired
Google Test trace:
/data0/somelongdirectorytoavoidrpathissues/src/kudu/src/kudu/rpc/rpc-test.cc:267: Connecting to unix:/tmp/dist-test-taskVfEZK4/test-tmp/rpc-test-6e6ffc3d39aa4a439adc30cbdef901cd.sock
I20260927 18:32:59.085183 3485 test_util.cc:175] -----------------------------------------------
I20260927 18:32:59.085254 3485 test_util.cc:176] Had fatal failures, leaving test files at /tmp/dist-test-taskVfEZK4/test-tmp/rpc-test.6.Parameters_TestRpc.TestCallWithChainCertAndChainCA_SSL_UnixSocket.1790533978967711-3485-0
Full log
Note: This is test shard 7 of 8.
[==========] Running 21 tests from 2 test suites.
[----------] Global test environment set-up.
[----------] 20 tests from Parameters/TestRpc
[ RUN ] Parameters/TestRpc.TestMessengerCreateDestroy/SSL_UnixSocket
WARNING: Logging before InitGoogleLogging() is written to STDERR
I20260927 18:32:59.013564 3485 rpc-test.cc:169] started messenger TestCreateDestroy
[ OK ] Parameters/TestRpc.TestMessengerCreateDestroy/SSL_UnixSocket (30 ms)
[ RUN ] Parameters/TestRpc.TestNegotiationDeadlock/SSL_UnixSocket
I20260927 18:32:59.029261 3505 acceptor_pool.cc:254] collecting diagnostics on the listening RPC socket unix:/tmp/dist-test-taskVfEZK4/test-tmp/rpc-test-fc26ca5e583948499183aea54fd8292c.sock every 8 connection(s)
I20260927 18:32:59.029505 3506 acceptor_pool.cc:254] collecting diagnostics on the listening RPC socket unix:/tmp/dist-test-taskVfEZK4/test-tmp/rpc-test-fc26ca5e583948499183aea54fd8292c.sock every 8 connection(s)
[ OK ] Parameters/TestRpc.TestNegotiationDeadlock/SSL_UnixSocket (29 ms)
[ RUN ] Parameters/TestRpc.TestCallWithChainCertAndChainCA/SSL_UnixSocket
I20260927 18:32:59.074558 3521 acceptor_pool.cc:254] collecting diagnostics on the listening RPC socket unix:/tmp/dist-test-taskVfEZK4/test-tmp/rpc-test-6e6ffc3d39aa4a439adc30cbdef901cd.sock every 8 connection(s)
I20260927 18:32:59.074867 3522 acceptor_pool.cc:254] collecting diagnostics on the listening RPC socket unix:/tmp/dist-test-taskVfEZK4/test-tmp/rpc-test-6e6ffc3d39aa4a439adc30cbdef901cd.sock every 8 connection(s)
/data0/somelongdirectorytoavoidrpathissues/src/kudu/src/kudu/rpc/rpc-test.cc:270: Failure
Failed
Bad status: Runtime error: could not verify certificate chain (error with cert: subject=CN = localhost, ST = sadfjas, C = AS, emailAddress = sdflkdsajf, O = lskdfjlsad, OU = sldfkja, issuer=C = AS, ST = ASDfkjdhf, L = lskdjf, O = saldfja, OU = skdjf, CN = localhost, emailAddress = sadjflkadsj): : certificate has expired
Google Test trace:
/data0/somelongdirectorytoavoidrpathissues/src/kudu/src/kudu/rpc/rpc-test.cc:267: Connecting to unix:/tmp/dist-test-taskVfEZK4/test-tmp/rpc-test-6e6ffc3d39aa4a439adc30cbdef901cd.sock
I20260927 18:32:59.085183 3485 test_util.cc:175] -----------------------------------------------
I20260927 18:32:59.085254 3485 test_util.cc:176] Had fatal failures, leaving test files at /tmp/dist-test-taskVfEZK4/test-tmp/rpc-test.6.Parameters_TestRpc.TestCallWithChainCertAndChainCA_SSL_UnixSocket.1790533978967711-3485-0
[ FAILED ] Parameters/TestRpc.TestCallWithChainCertAndChainCA/SSL_UnixSocket, where GetParam() = (true, true) (39 ms)
[ RUN ] Parameters/TestRpc.TestCallWithPasswordProtectedKey/SSL_UnixSocket
I20260927 18:32:59.105786 3546 acceptor_pool.cc:254] collecting diagnostics on the listening RPC socket unix:/tmp/dist-test-taskVfEZK4/test-tmp/rpc-test-3e8269321fa641bf9ab01f7278bc7cfe.sock every 8 connection(s)
I20260927 18:32:59.106037 3547 acceptor_pool.cc:254] collecting diagnostics on the listening RPC socket unix:/tmp/dist-test-taskVfEZK4/test-tmp/rpc-test-3e8269321fa641bf9ab01f7278bc7cfe.sock every 8 connection(s)
W20260927 18:32:59.133447 3543 connection.cc:196] Error closing socket: Network error: TlsSocket::Close: Broken pipe
[ OK ] Parameters/TestRpc.TestCallWithPasswordProtectedKey/SSL_UnixSocket (52 ms)
[ RUN ] Parameters/TestRpc.TestCallToBadServer/SSL_UnixSocket
I20260927 18:32:59.152437 3485 rpc-test.cc:394] Status: Network error: Client connection negotiation failed: client connection to 0.0.0.0:0: connect: Connection refused (error 111)
I20260927 18:32:59.152982 3485 rpc-test.cc:394] Status: Network error: Client connection negotiation failed: client connection to 0.0.0.0:0: connect: Connection refused (error 111)
I20260927 18:32:59.153496 3485 rpc-test.cc:394] Status: Network error: Client connection negotiation failed: client connection to 0.0.0.0:0: connect: Connection refused (error 111)
I20260927 18:32:59.154031 3485 rpc-test.cc:394] Status: Network error: Client connection negotiation failed: client connection to 0.0.0.0:0: connect: Connection refused (error 111)
I20260927 18:32:59.154510 3485 rpc-test.cc:394] Status: Network error: Client connection negotiation failed: client connection to 0.0.0.0:0: connect: Connection refused (error 111)
[ OK ] Parameters/TestRpc.TestCallToBadServer/SSL_UnixSocket (18 ms)
[ RUN ] Parameters/TestRpc.TestWrongService/SSL_UnixSocket
I20260927 18:32:59.170521 3581 acceptor_pool.cc:254] collecting diagnostics on the listening RPC socket unix:/tmp/dist-test-taskVfEZK4/test-tmp/rpc-test-742776b56b2c416e8d8dc19d915990d9.sock every 8 connection(s)
I20260927 18:32:59.170748 3582 acceptor_pool.cc:254] collecting diagnostics on the listening RPC socket unix:/tmp/dist-test-taskVfEZK4/test-tmp/rpc-test-742776b56b2c416e8d8dc19d915990d9.sock every 8 connection(s)
I20260927 18:32:59.185484 3578 messenger.cc:345] service WrongServiceName not registered on TestServer
W20260927 18:32:59.187028 3578 connection.cc:196] Error closing socket: Network error: TlsSocket::Close: Broken pipe
[ OK ] Parameters/TestRpc.TestWrongService/SSL_UnixSocket (33 ms)
[ RUN ] Parameters/TestRpc.TestConnectionKeepalive/SSL_UnixSocket
I20260927 18:32:59.201380 3604 acceptor_pool.cc:254] collecting diagnostics on the listening RPC socket unix:/tmp/dist-test-taskVfEZK4/test-tmp/rpc-test-9b6407c9605a493ab5eea5c252217da6.sock every 8 connection(s)
I20260927 18:32:59.201617 3605 acceptor_pool.cc:254] collecting diagnostics on the listening RPC socket unix:/tmp/dist-test-taskVfEZK4/test-tmp/rpc-test-9b6407c9605a493ab5eea5c252217da6.sock every 8 connection(s)
I20260927 18:32:59.202451 3485 rpc-test.cc:488] Connecting to unix:/tmp/dist-test-taskVfEZK4/test-tmp/rpc-test-9b6407c9605a493ab5eea5c252217da6.sock
W20260927 18:32:59.692126 3617 connection.cc:196] Error closing socket: Network error: TlsSocket::Close: Broken pipe
[ OK ] Parameters/TestRpc.TestConnectionKeepalive/SSL_UnixSocket (1036 ms)
[ RUN ] Parameters/TestRpc.TestClientConnectionMetrics/SSL_UnixSocket
I20260927 18:33:00.239454 3629 acceptor_pool.cc:254] collecting diagnostics on the listening RPC socket unix:/tmp/dist-test-taskVfEZK4/test-tmp/rpc-test-efd49c211163408184940b704f525408.sock every 8 connection(s)
I20260927 18:33:00.239681 3630 acceptor_pool.cc:254] collecting diagnostics on the listening RPC socket unix:/tmp/dist-test-taskVfEZK4/test-tmp/rpc-test-efd49c211163408184940b704f525408.sock every 8 connection(s)
I20260927 18:33:00.240609 3485 rpc-test.cc:569] Connecting to unix:/tmp/dist-test-taskVfEZK4/test-tmp/rpc-test-efd49c211163408184940b704f525408.sock
W20260927 18:33:20.204967 3626 connection.cc:196] Error closing socket: Network error: TlsSocket::Close: Broken pipe
[ OK ] Parameters/TestRpc.TestClientConnectionMetrics/SSL_UnixSocket (19985 ms)
[ RUN ] Parameters/TestRpc.TestCredentialsPolicy/SSL_UnixSocket
I20260927 18:33:20.227767 3652 acceptor_pool.cc:254] collecting diagnostics on the listening RPC socket unix:/tmp/dist-test-taskVfEZK4/test-tmp/rpc-test-daec5c146d05497cb43ac71dad0e65a5.sock every 8 connection(s)
I20260927 18:33:20.227990 3653 acceptor_pool.cc:254] collecting diagnostics on the listening RPC socket unix:/tmp/dist-test-taskVfEZK4/test-tmp/rpc-test-daec5c146d05497cb43ac71dad0e65a5.sock every 8 connection(s)
I20260927 18:33:20.228845 3485 rpc-test.cc:700] Connecting to unix:/tmp/dist-test-taskVfEZK4/test-tmp/rpc-test-daec5c146d05497cb43ac71dad0e65a5.sock
W20260927 18:33:20.255131 3651 connection.cc:196] Error closing socket: Network error: TlsSocket::Close: Broken pipe
[ OK ] Parameters/TestRpc.TestCredentialsPolicy/SSL_UnixSocket (53 ms)
[ RUN ] Parameters/TestRpc.TestCallLongerThanKeepalive/SSL_UnixSocket
I20260927 18:33:20.272375 3677 acceptor_pool.cc:254] collecting diagnostics on the listening RPC socket unix:/tmp/dist-test-taskVfEZK4/test-tmp/rpc-test-b9f25bdda4b04d0dbb85b1ccc06d98cf.sock every 8 connection(s)
I20260927 18:33:20.272544 3678 acceptor_pool.cc:254] collecting diagnostics on the listening RPC socket unix:/tmp/dist-test-taskVfEZK4/test-tmp/rpc-test-b9f25bdda4b04d0dbb85b1ccc06d98cf.sock every 8 connection(s)
I20260927 18:33:20.294011 3681 rpc-test-base.h:222] got call: sleep_micros: 3000000 deferred: true
I20260927 18:33:23.295619 3681 rpcz_store.cc:275] Call kudu.rpc.GenericCalculatorService.Sleep from unix:<unnamed> (request call id 0) took 3001 ms. Trace:
I20260927 18:33:23.295778 3681 rpcz_store.cc:276] 0927 18:33:20.293917 (+ 0us) service_pool.cc:170] Inserting onto call queue
0927 18:33:20.293972 (+ 55us) service_pool.cc:227] Handling call
0927 18:33:23.295559 (+3001587us) inbound_call.cc:173] Queueing success response
Metrics: {}
W20260927 18:33:23.298569 3674 connection.cc:196] Error closing socket: Network error: TlsSocket::Close: Broken pipe
[ OK ] Parameters/TestRpc.TestCallLongerThanKeepalive/SSL_UnixSocket (3036 ms)
[ RUN ] Parameters/TestRpc.TestRpcSidecar/SSL_UnixSocket
I20260927 18:33:23.326848 3702 acceptor_pool.cc:254] collecting diagnostics on the listening RPC socket unix:/tmp/dist-test-taskVfEZK4/test-tmp/rpc-test-597ae6910c5f407abb93a5fb03e1be40.sock every 8 connection(s)
I20260927 18:33:23.327045 3703 acceptor_pool.cc:254] collecting diagnostics on the listening RPC socket unix:/tmp/dist-test-taskVfEZK4/test-tmp/rpc-test-597ae6910c5f407abb93a5fb03e1be40.sock every 8 connection(s)
[ OK ] Parameters/TestRpc.TestRpcSidecar/SSL_UnixSocket (108 ms)
[ RUN ] Parameters/TestRpc.TestRpcSidecarLimits/SSL_UnixSocket
I20260927 18:33:25.384479 3727 acceptor_pool.cc:254] collecting diagnostics on the listening RPC socket unix:/tmp/dist-test-taskVfEZK4/test-tmp/rpc-test-2e03a8ed85ca4fbf89847afaac7c18bf.sock every 8 connection(s)
I20260927 18:33:25.384742 3728 acceptor_pool.cc:254] collecting diagnostics on the listening RPC socket unix:/tmp/dist-test-taskVfEZK4/test-tmp/rpc-test-2e03a8ed85ca4fbf89847afaac7c18bf.sock every 8 connection(s)
W20260927 18:33:25.401053 3485 serialization.cc:72] Serialized kudu.rpc_test.PushStringsRequestPB (2147483654 bytes) is larger than the maximum configured RPC message size (52428800 bytes). Sending anyway, but peer may reject the data.
W20260927 18:33:25.406637 3724 connection.cc:535] server connection from unix:<unnamed> recv error: Network error: RPC frame had a length of 2147483714, but we only support messages up to 52428800 bytes long.
W20260927 18:33:25.406764 3724 connection.cc:158] shutting down server connection from unix:<unnamed> with pending inbound data: 4/2147483714 bytes received; last active 0 ns ago: status Network error: RPC frame had a length of 2147483714, but we only support messages up to 52428800 bytes long.
W20260927 18:33:25.407276 3740 connection.cc:196] Error closing socket: Network error: TlsSocket::Close: Broken pipe
I20260927 18:33:25.420207 3752 acceptor_pool.cc:254] collecting diagnostics on the listening RPC socket unix:/tmp/dist-test-taskVfEZK4/test-tmp/rpc-test-2e03a8ed85ca4fbf89847afaac7c18bf.sock every 8 connection(s)
I20260927 18:33:25.420408 3753 acceptor_pool.cc:254] collecting diagnostics on the listening RPC socket unix:/tmp/dist-test-taskVfEZK4/test-tmp/rpc-test-2e03a8ed85ca4fbf89847afaac7c18bf.sock every 8 connection(s)
W20260927 18:33:30.837141 3749 connection.cc:577] server connection from unix:<unnamed>: received bad data: 'Corruption: Invalid packet: message had a length of 2147483710, but we only support messages up to 2147483647 bytes
'
W20260927 18:33:30.837795 3765 connection.cc:196] Error closing socket: Network error: TlsSocket::Close: Broken pipe
[ OK ] Parameters/TestRpc.TestRpcSidecarLimits/SSL_UnixSocket (7882 ms)
[ RUN ] Parameters/TestRpc.TestCallTimeoutDoesntAffectNegotiation/SSL_UnixSocket
I20260927 18:33:31.307518 3777 acceptor_pool.cc:254] collecting diagnostics on the listening RPC socket unix:/tmp/dist-test-taskVfEZK4/test-tmp/rpc-test-23f27083d9ad4e82905464a51d996cd0.sock every 8 connection(s)
I20260927 18:33:31.307782 3778 acceptor_pool.cc:254] collecting diagnostics on the listening RPC socket unix:/tmp/dist-test-taskVfEZK4/test-tmp/rpc-test-23f27083d9ad4e82905464a51d996cd0.sock every 8 connection(s)
W20260927 18:33:31.318569 3773 negotiation.cc:266] Injecting 500ms delay in negotiation
I20260927 18:33:31.368955 3485 rpc-test-base.h:595] status: Timed out: connection negotiation to unix:/tmp/dist-test-taskVfEZK4/test-tmp/rpc-test-23f27083d9ad4e82905464a51d996cd0.sock for RPC Sleep timed out after 0.050s (ON_OUTBOUND_QUEUE), seconds elapsed: 0.0510437
W20260927 18:33:31.825577 3774 connection.cc:196] Error closing socket: Network error: TlsSocket::Close: Broken pipe
[ OK ] Parameters/TestRpc.TestCallTimeoutDoesntAffectNegotiation/SSL_UnixSocket (535 ms)
[ RUN ] Parameters/TestRpc.TestRpcHandlerLatencyMetric/SSL_UnixSocket
I20260927 18:33:31.849730 3802 acceptor_pool.cc:254] collecting diagnostics on the listening RPC socket unix:/tmp/dist-test-taskVfEZK4/test-tmp/rpc-test-9f07700ee5eb41e4bc7183b3f7842238.sock every 8 connection(s)
I20260927 18:33:31.849964 3803 acceptor_pool.cc:254] collecting diagnostics on the listening RPC socket unix:/tmp/dist-test-taskVfEZK4/test-tmp/rpc-test-9f07700ee5eb41e4bc7183b3f7842238.sock every 8 connection(s)
I20260927 18:33:31.883870 3485 rpc-test.cc:1236] Sleep() min lat: 20479
I20260927 18:33:31.883939 3485 rpc-test.cc:1237] Sleep() mean lat: 20479
I20260927 18:33:31.883973 3485 rpc-test.cc:1238] Sleep() max lat: 20479
I20260927 18:33:31.883991 3485 rpc-test.cc:1239] Sleep() #calls: 1
W20260927 18:33:31.884827 3799 connection.cc:196] Error closing socket: Network error: TlsSocket::Close: Broken pipe
[ OK ] Parameters/TestRpc.TestRpcHandlerLatencyMetric/SSL_UnixSocket (60 ms)
[ RUN ] Parameters/TestRpc.TimedOutOnResponseMetricServiceQueue/SSL_UnixSocket
I20260927 18:33:31.900720 3828 acceptor_pool.cc:254] collecting diagnostics on the listening RPC socket unix:/tmp/dist-test-taskVfEZK4/test-tmp/rpc-test-c3f0e83a14b14b78b5f17820e83e8840.sock every 8 connection(s)
I20260927 18:33:31.900954 3829 acceptor_pool.cc:254] collecting diagnostics on the listening RPC socket unix:/tmp/dist-test-taskVfEZK4/test-tmp/rpc-test-c3f0e83a14b14b78b5f17820e83e8840.sock every 8 connection(s)
W20260927 18:33:31.959688 3830 rpcz_store.cc:267] Call kudu.rpc_test.CalculatorService.Sleep from unix:<unnamed> (request call id 2) took 20 ms (client timeout 20 ms). Trace:
W20260927 18:33:31.959815 3830 rpcz_store.cc:269] 0927 18:33:31.939334 (+ 0us) service_pool.cc:170] Inserting onto call queue
0927 18:33:31.959653 (+ 20319us) service_pool.cc:214] Skipping call since client already timed out
0927 18:33:31.959679 (+ 26us) inbound_call.cc:173] Queueing failure response
Metrics: {}
[ OK ] Parameters/TestRpc.TimedOutOnResponseMetricServiceQueue/SSL_UnixSocket (75 ms)
[ RUN ] Parameters/TestRpc.RpcPendingConnectionsMetric/SSL_UnixSocket
I20260927 18:33:31.968106 3851 acceptor_pool.cc:254] collecting diagnostics on the listening RPC socket 0.0.0.0:40219 every 8 connection(s)
I20260927 18:33:31.968413 3852 acceptor_pool.cc:254] collecting diagnostics on the listening RPC socket 0.0.0.0:40219 every 8 connection(s)
W20260927 18:33:31.970119 3847 negotiation.cc:337] Failed RPC negotiation. Trace:
0927 18:33:31.969600 (+ 0us) reactor.cc:625] Submitting negotiation task for server connection from 127.0.0.1:43044 (local address 127.0.0.1:40219)
0927 18:33:31.969767 (+ 167us) server_negotiation.cc:206] Beginning negotiation
0927 18:33:31.969771 (+ 4us) server_negotiation.cc:399] Waiting for connection header
0927 18:33:31.969867 (+ 96us) negotiation.cc:327] Negotiation complete: Network error: Server connection negotiation failed: server connection from 127.0.0.1:43044: BlockingRecv error: recv got EOF from 127.0.0.1:43044 (error 108)
Metrics: {"server-negotiator.queue_time_us":57}
[ OK ] Parameters/TestRpc.RpcPendingConnectionsMetric/SSL_UnixSocket (18 ms)
[ RUN ] Parameters/TestRpc.TestRpcContextClientDeadline/SSL_UnixSocket
I20260927 18:33:32.003448 3867 acceptor_pool.cc:254] collecting diagnostics on the listening RPC socket unix:/tmp/dist-test-taskVfEZK4/test-tmp/rpc-test-62639b9e2bf1495bb5e9b26807180167.sock every 8 connection(s)
I20260927 18:33:32.003644 3868 acceptor_pool.cc:254] collecting diagnostics on the listening RPC socket unix:/tmp/dist-test-taskVfEZK4/test-tmp/rpc-test-62639b9e2bf1495bb5e9b26807180167.sock every 8 connection(s)
[ OK ] Parameters/TestRpc.TestRpcContextClientDeadline/SSL_UnixSocket (69 ms)
[ RUN ] Parameters/TestRpc.TestApplicationFeatureFlagUnsupportedServer/SSL_UnixSocket
I20260927 18:33:32.073240 3892 acceptor_pool.cc:254] collecting diagnostics on the listening RPC socket unix:/tmp/dist-test-taskVfEZK4/test-tmp/rpc-test-a9f83ef8c9e44f10891f07e5d7c302a6.sock every 8 connection(s)
I20260927 18:33:32.073498 3893 acceptor_pool.cc:254] collecting diagnostics on the listening RPC socket unix:/tmp/dist-test-taskVfEZK4/test-tmp/rpc-test-a9f83ef8c9e44f10891f07e5d7c302a6.sock every 8 connection(s)
[ OK ] Parameters/TestRpc.TestApplicationFeatureFlagUnsupportedServer/SSL_UnixSocket (49 ms)
[ RUN ] Parameters/TestRpc.TestCancellationAsync/SSL_UnixSocket
I20260927 18:33:32.109465 3917 acceptor_pool.cc:254] collecting diagnostics on the listening RPC socket unix:/tmp/dist-test-taskVfEZK4/test-tmp/rpc-test-308cc54651dd470d99e8c5096db7d55c.sock every 8 connection(s)
I20260927 18:33:32.109735 3918 acceptor_pool.cc:254] collecting diagnostics on the listening RPC socket unix:/tmp/dist-test-taskVfEZK4/test-tmp/rpc-test-308cc54651dd470d99e8c5096db7d55c.sock every 8 connection(s)
I20260927 18:33:32.110611 3485 rpc-test.cc:1716] Connecting to unix:/tmp/dist-test-taskVfEZK4/test-tmp/rpc-test-308cc54651dd470d99e8c5096db7d55c.sock
I20260927 18:33:32.122525 3485 test_util.cc:268] Using random seed: 801125773
I20260927 18:33:32.154660 3921 rpc-test-base.h:240] got call: sleep_micros: 500 pattern: 4294967295 num_repetitions: 2097152 sidecar_idx: 0
I20260927 18:33:32.181022 3920 rpc-test-base.h:240] got call: sleep_micros: 500 pattern: 4294967295 num_repetitions: 2097152 sidecar_idx: 0
I20260927 18:33:32.207378 3921 rpc-test-base.h:240] got call: sleep_micros: 500 pattern: 4294967295 num_repetitions: 2097152 sidecar_idx: 0
I20260927 18:33:32.238873 3920 rpc-test-base.h:240] got call: sleep_micros: 500 pattern: 4294967295 num_repetitions: 2097152 sidecar_idx: 0
I20260927 18:33:32.261407 3921 rpc-test-base.h:240] got call: sleep_micros: 500 pattern: 4294967295 num_repetitions: 2097152 sidecar_idx: 0
I20260927 18:33:32.286949 3919 rpc-test-base.h:240] got call: sleep_micros: 500 pattern: 4294967295 num_repetitions: 2097152 sidecar_idx: 0
I20260927 18:33:32.316351 3921 rpc-test-base.h:240] got call: sleep_micros: 500 pattern: 4294967295 num_repetitions: 2097152 sidecar_idx: 0
W20260927 18:33:32.318579 3914 connection.cc:196] Error closing socket: Network error: TlsSocket::Close: Broken pipe
W20260927 18:33:32.333359 3914 connection.cc:441] server connection from unix:<unnamed> torn down before Call kudu.rpc.GenericCalculatorService.SleepWithSidecar from unix:<unnamed> (request call id 8) could send its response
W20260927 18:33:32.350010 3914 connection.cc:441] server connection from unix:<unnamed> torn down before Call kudu.rpc.GenericCalculatorService.SleepWithSidecar from unix:<unnamed> (request call id 9) could send its response
[ OK ] Parameters/TestRpc.TestCancellationAsync/SSL_UnixSocket (251 ms)
[ RUN ] Parameters/TestRpc.TestPerformanceBySocketType/SSL_UnixSocket
I20260927 18:33:32.365437 3942 acceptor_pool.cc:254] collecting diagnostics on the listening RPC socket unix:/tmp/dist-test-taskVfEZK4/test-tmp/rpc-test-cf6545012021483fb25eff77fdd311f0.sock every 8 connection(s)
I20260927 18:33:32.365727 3943 acceptor_pool.cc:254] collecting diagnostics on the listening RPC socket unix:/tmp/dist-test-taskVfEZK4/test-tmp/rpc-test-cf6545012021483fb25eff77fdd311f0.sock every 8 connection(s)
I20260927 18:33:32.366532 3485 rpc-test.cc:1846] Connecting to unix:/tmp/dist-test-taskVfEZK4/test-tmp/rpc-test-cf6545012021483fb25eff77fdd311f0.sock
I20260927 18:33:35.351814 3485 rpc-test.cc:1859] Sending 1024MB via ssl-enabled unix socket: real 2.972s user 2.939s sys 2.151s
I20260927 18:33:38.220616 3485 rpc-test.cc:1859] Sending 1024MB via ssl-enabled unix socket: real 2.869s user 2.774s sys 2.100s
I20260927 18:33:41.215081 3485 rpc-test.cc:1859] Sending 1024MB via ssl-enabled unix socket: real 2.994s user 2.899s sys 2.226s
I20260927 18:33:44.116777 3485 rpc-test.cc:1859] Sending 1024MB via ssl-enabled unix socket: real 2.902s user 2.797s sys 2.156s
I20260927 18:33:47.006798 3485 rpc-test.cc:1859] Sending 1024MB via ssl-enabled unix socket: real 2.890s user 2.781s sys 2.157s
W20260927 18:33:47.007870 3939 connection.cc:196] Error closing socket: Network error: TlsSocket::Close: Broken pipe
[ OK ] Parameters/TestRpc.TestPerformanceBySocketType/SSL_UnixSocket (14660 ms)
[----------] 20 tests from Parameters/TestRpc (48027 ms total)
[----------] 1 test from Parameters/TestRpcSocketTxRxQueue
[ RUN ] Parameters/TestRpcSocketTxRxQueue.AcceptorRxQueueSizeMetric/0
I20260927 18:33:47.021507 3967 acceptor_pool.cc:254] collecting diagnostics on the listening RPC socket 0.0.0.0:44409 every 1 connection(s)
I20260927 18:33:47.021766 3968 acceptor_pool.cc:254] collecting diagnostics on the listening RPC socket 0.0.0.0:44409 every 1 connection(s)
W20260927 18:33:47.023430 3963 negotiation.cc:337] Failed RPC negotiation. Trace:
0927 18:33:47.023058 (+ 0us) reactor.cc:625] Submitting negotiation task for server connection from 127.0.0.1:49992 (local address 127.0.0.1:44409)
0927 18:33:47.023217 (+ 159us) server_negotiation.cc:206] Beginning negotiation
0927 18:33:47.023220 (+ 3us) server_negotiation.cc:399] Waiting for connection header
0927 18:33:47.023321 (+ 101us) negotiation.cc:327] Negotiation complete: Network error: Server connection negotiation failed: server connection from 127.0.0.1:49992: BlockingRecv error: recv got EOF from 127.0.0.1:49992 (error 108)
Metrics: {"server-negotiator.queue_time_us":42}
[ OK ] Parameters/TestRpcSocketTxRxQueue.AcceptorRxQueueSizeMetric/0 (13 ms)
[----------] 1 test from Parameters/TestRpcSocketTxRxQueue (13 ms total)
[----------] Global test environment tear-down
[==========] 21 tests from 2 test suites ran. (48041 ms total)
[ PASSED ] 20 tests.
[ FAILED ] 1 test, listed below:
[ FAILED ] Parameters/TestRpc.TestCallWithChainCertAndChainCA/SSL_UnixSocket, where GetParam() = (true, true)
1 FAILED TEST