Parameters/TestRpc.TestCallWithChainCertAndRootCA/SSL_TCP: /data0/somelongdirectorytoavoidrpathissues/src/kudu/src/kudu/rpc/rpc-test.cc:303: Failure
Failed
Bad status: Runtime error: could not verify certificate chain (error with cert: subject=CN = localhost, ST = sadfjas, C = AS, emailAddress = sdflkdsajf, O = lskdfjlsad, OU = sldfkja, issuer=C = AS, ST = ASDfkjdhf, L = lskdjf, O = saldfja, OU = skdjf, CN = localhost, emailAddress = sadjflkadsj): : certificate has expired
Google Test trace:
/data0/somelongdirectorytoavoidrpathissues/src/kudu/src/kudu/rpc/rpc-test.cc:300: Connecting to 0.0.0.0:32901
I20260928 03:44:22.310137 390 test_util.cc:175] -----------------------------------------------
I20260928 03:44:22.310315 390 test_util.cc:176] Had fatal failures, leaving test files at /tmp/dist-test-taskvwY0lX/test-tmp/rpc-test.1.Parameters_TestRpc.TestCallWithChainCertAndRootCA_SSL_TCP.1790567060866964-390-0
Note: This is test shard 2 of 8.
[==========] Running 21 tests from 2 test suites.
[----------] Global test environment set-up.
[----------] 1 test from TestRpc
[ RUN ] TestRpc.TestMethodsByName
[ OK ] TestRpc.TestMethodsByName (6 ms)
[----------] 1 test from TestRpc (6 ms total)
[----------] 20 tests from Parameters/TestRpc
[ RUN ] Parameters/TestRpc.TestAcceptorPoolStartStop/SSL_TCP
WARNING: Logging before InitGoogleLogging() is written to STDERR
I20260928 03:44:20.979463 405 acceptor_pool.cc:254] collecting diagnostics on the listening RPC socket 0.0.0.0:43015 every 8 connection(s)
I20260928 03:44:20.980858 406 acceptor_pool.cc:254] collecting diagnostics on the listening RPC socket 0.0.0.0:43015 every 8 connection(s)
I20260928 03:44:22.090197 417 acceptor_pool.cc:254] collecting diagnostics on the listening RPC socket 0.0.0.0:42775 every 8 connection(s)
I20260928 03:44:22.091506 418 acceptor_pool.cc:254] collecting diagnostics on the listening RPC socket 0.0.0.0:42775 every 8 connection(s)
I20260928 03:44:22.112397 428 acceptor_pool.cc:254] collecting diagnostics on the listening RPC socket 0.0.0.0:33369 every 8 connection(s)
I20260928 03:44:22.113530 429 acceptor_pool.cc:254] collecting diagnostics on the listening RPC socket 0.0.0.0:33369 every 8 connection(s)
I20260928 03:44:22.130775 439 acceptor_pool.cc:254] collecting diagnostics on the listening RPC socket 0.0.0.0:35001 every 8 connection(s)
I20260928 03:44:22.131407 440 acceptor_pool.cc:254] collecting diagnostics on the listening RPC socket 0.0.0.0:35001 every 8 connection(s)
I20260928 03:44:22.162388 450 acceptor_pool.cc:254] collecting diagnostics on the listening RPC socket 0.0.0.0:33815 every 8 connection(s)
I20260928 03:44:22.163048 451 acceptor_pool.cc:254] collecting diagnostics on the listening RPC socket 0.0.0.0:33815 every 8 connection(s)
[ OK ] Parameters/TestRpc.TestAcceptorPoolStartStop/SSL_TCP (1243 ms)
[ RUN ] Parameters/TestRpc.TestCall/SSL_TCP
I20260928 03:44:22.187420 463 acceptor_pool.cc:254] collecting diagnostics on the listening RPC socket 0.0.0.0:36317 every 8 connection(s)
I20260928 03:44:22.189200 464 acceptor_pool.cc:254] collecting diagnostics on the listening RPC socket 0.0.0.0:36317 every 8 connection(s)
I20260928 03:44:22.194305 390 rpc-test.cc:234] Connecting to 0.0.0.0:36317
[ OK ] Parameters/TestRpc.TestCall/SSL_TCP (91 ms)
[ RUN ] Parameters/TestRpc.TestCallWithChainCertAndRootCA/SSL_TCP
I20260928 03:44:22.290262 488 acceptor_pool.cc:254] collecting diagnostics on the listening RPC socket 0.0.0.0:32901 every 8 connection(s)
I20260928 03:44:22.290935 489 acceptor_pool.cc:254] collecting diagnostics on the listening RPC socket 0.0.0.0:32901 every 8 connection(s)
/data0/somelongdirectorytoavoidrpathissues/src/kudu/src/kudu/rpc/rpc-test.cc:303: Failure
Failed
Bad status: Runtime error: could not verify certificate chain (error with cert: subject=CN = localhost, ST = sadfjas, C = AS, emailAddress = sdflkdsajf, O = lskdfjlsad, OU = sldfkja, issuer=C = AS, ST = ASDfkjdhf, L = lskdjf, O = saldfja, OU = skdjf, CN = localhost, emailAddress = sadjflkadsj): : certificate has expired
Google Test trace:
/data0/somelongdirectorytoavoidrpathissues/src/kudu/src/kudu/rpc/rpc-test.cc:300: Connecting to 0.0.0.0:32901
I20260928 03:44:22.310137 390 test_util.cc:175] -----------------------------------------------
I20260928 03:44:22.310315 390 test_util.cc:176] Had fatal failures, leaving test files at /tmp/dist-test-taskvwY0lX/test-tmp/rpc-test.1.Parameters_TestRpc.TestCallWithChainCertAndRootCA_SSL_TCP.1790567060866964-390-0
[ FAILED ] Parameters/TestRpc.TestCallWithChainCertAndRootCA/SSL_TCP, where GetParam() = (true, false) (52 ms)
[ RUN ] Parameters/TestRpc.TestCallWithBadPasswordProtectedKey/SSL_TCP
[ OK ] Parameters/TestRpc.TestCallWithBadPasswordProtectedKey/SSL_TCP (27 ms)
[ RUN ] Parameters/TestRpc.TestInvalidMethodCall/SSL_TCP
I20260928 03:44:22.353367 525 acceptor_pool.cc:254] collecting diagnostics on the listening RPC socket 0.0.0.0:33439 every 8 connection(s)
I20260928 03:44:22.354089 526 acceptor_pool.cc:254] collecting diagnostics on the listening RPC socket 0.0.0.0:33439 every 8 connection(s)
I20260928 03:44:22.357179 390 rpc-test.cc:406] Connecting to 0.0.0.0:33439
[ OK ] Parameters/TestRpc.TestInvalidMethodCall/SSL_TCP (55 ms)
[ RUN ] Parameters/TestRpc.TestHighFDs/SSL_TCP
I20260928 03:44:22.620867 550 acceptor_pool.cc:254] collecting diagnostics on the listening RPC socket 0.0.0.0:34957 every 8 connection(s)
I20260928 03:44:22.621578 551 acceptor_pool.cc:254] collecting diagnostics on the listening RPC socket 0.0.0.0:34957 every 8 connection(s)
[ OK ] Parameters/TestRpc.TestHighFDs/SSL_TCP (279 ms)
[ RUN ] Parameters/TestRpc.TestConnectionAlwaysKeepalive/SSL_TCP
I20260928 03:44:22.689474 573 acceptor_pool.cc:254] collecting diagnostics on the listening RPC socket 0.0.0.0:34021 every 8 connection(s)
I20260928 03:44:22.690186 574 acceptor_pool.cc:254] collecting diagnostics on the listening RPC socket 0.0.0.0:34021 every 8 connection(s)
I20260928 03:44:22.693059 390 rpc-test.cc:532] Connecting to 0.0.0.0:34021
[ OK ] Parameters/TestRpc.TestConnectionAlwaysKeepalive/SSL_TCP (3058 ms)
[ RUN ] Parameters/TestRpc.TestReopenOutboundConnections/SSL_TCP
I20260928 03:44:25.757630 596 acceptor_pool.cc:254] collecting diagnostics on the listening RPC socket 0.0.0.0:46429 every 8 connection(s)
I20260928 03:44:25.758302 597 acceptor_pool.cc:254] collecting diagnostics on the listening RPC socket 0.0.0.0:46429 every 8 connection(s)
I20260928 03:44:25.761256 390 rpc-test.cc:658] Connecting to 0.0.0.0:46429
[ OK ] Parameters/TestRpc.TestReopenOutboundConnections/SSL_TCP (364 ms)
[ RUN ] Parameters/TestRpc.TestConnectionNetworkPlane/SSL_TCP
I20260928 03:44:26.117203 619 acceptor_pool.cc:254] collecting diagnostics on the listening RPC socket 0.0.0.0:36801 every 8 connection(s)
I20260928 03:44:26.118912 620 acceptor_pool.cc:254] collecting diagnostics on the listening RPC socket 0.0.0.0:36801 every 8 connection(s)
I20260928 03:44:26.121322 390 rpc-test.cc:772] Connecting to 0.0.0.0:36801
[ OK ] Parameters/TestRpc.TestConnectionNetworkPlane/SSL_TCP (73 ms)
[ RUN ] Parameters/TestRpc.TestTCPKeepalive/SSL_TCP
I20260928 03:44:26.189669 644 acceptor_pool.cc:254] collecting diagnostics on the listening RPC socket 0.0.0.0:33645 every 8 connection(s)
I20260928 03:44:26.190327 645 acceptor_pool.cc:254] collecting diagnostics on the listening RPC socket 0.0.0.0:33645 every 8 connection(s)
I20260928 03:44:26.215915 648 rpc-test-base.h:222] got call: sleep_micros: 8000000 deferred: true
I20260928 03:44:34.219897 648 rpcz_store.cc:275] Call kudu.rpc.GenericCalculatorService.Sleep from 127.0.0.1:41108 (request call id 0) took 8004 ms. Trace:
I20260928 03:44:34.220283 648 rpcz_store.cc:276] 0928 03:44:26.215649 (+ 0us) service_pool.cc:170] Inserting onto call queue
0928 03:44:26.215768 (+ 119us) service_pool.cc:227] Handling call
0928 03:44:34.219738 (+8003970us) inbound_call.cc:173] Queueing success response
Metrics: {}
[ OK ] Parameters/TestRpc.TestTCPKeepalive/SSL_TCP (8062 ms)
[ RUN ] Parameters/TestRpc.TestMaxSmallSidecars/SSL_TCP
I20260928 03:44:34.262940 670 acceptor_pool.cc:254] collecting diagnostics on the listening RPC socket 0.0.0.0:35965 every 8 connection(s)
I20260928 03:44:34.263679 671 acceptor_pool.cc:254] collecting diagnostics on the listening RPC socket 0.0.0.0:35965 every 8 connection(s)
[ OK ] Parameters/TestRpc.TestMaxSmallSidecars/SSL_TCP (194 ms)
[ RUN ] Parameters/TestRpc.TestCallTimeout/SSL_TCP
I20260928 03:44:34.443002 695 acceptor_pool.cc:254] collecting diagnostics on the listening RPC socket 0.0.0.0:34757 every 8 connection(s)
I20260928 03:44:34.443646 696 acceptor_pool.cc:254] collecting diagnostics on the listening RPC socket 0.0.0.0:34757 every 8 connection(s)
I20260928 03:44:34.469329 390 rpc-test-base.h:595] status: Timed out: connection negotiation to 0.0.0.0:34757 for RPC Sleep timed out after 0.000s (ON_OUTBOUND_QUEUE), seconds elapsed: 0.00230804
I20260928 03:44:34.476681 699 rpc-test-base.h:222] got call: sleep_micros: 700000
I20260928 03:44:34.670375 390 rpc-test-base.h:595] status: Timed out: Sleep RPC to 0.0.0.0:34757 timed out after 0.200s (SENT), seconds elapsed: 0.200687
I20260928 03:44:34.671801 698 rpc-test-base.h:222] got call: sleep_micros: 2000000
W20260928 03:44:35.177294 699 rpcz_store.cc:267] Call kudu.rpc.GenericCalculatorService.Sleep from 127.0.0.1:58700 (request call id 1) took 700 ms (client timeout 200 ms). Trace:
W20260928 03:44:35.177630 699 rpcz_store.cc:269] 0928 03:44:34.476493 (+ 0us) service_pool.cc:170] Inserting onto call queue
0928 03:44:34.476627 (+ 134us) service_pool.cc:227] Handling call
0928 03:44:35.177235 (+700608us) inbound_call.cc:173] Queueing success response
Metrics: {}
I20260928 03:44:36.172855 390 rpc-test-base.h:595] status: Timed out: Sleep RPC to 0.0.0.0:34757 timed out after 1.500s (SENT), seconds elapsed: 1.50217
W20260928 03:44:36.672344 698 rpcz_store.cc:267] Call kudu.rpc.GenericCalculatorService.Sleep from 127.0.0.1:58700 (request call id 2) took 2000 ms (client timeout 1500 ms). Trace:
W20260928 03:44:36.672683 698 rpcz_store.cc:269] 0928 03:44:34.671493 (+ 0us) service_pool.cc:170] Inserting onto call queue
0928 03:44:34.671656 (+ 163us) service_pool.cc:227] Handling call
0928 03:44:36.672293 (+2000637us) inbound_call.cc:173] Queueing success response
Metrics: {}
W20260928 03:44:36.673194 694 connection.cc:441] server connection from 127.0.0.1:58700 torn down before Call kudu.rpc.GenericCalculatorService.Sleep from 127.0.0.1:58700 (request call id 2) could send its response
[ OK ] Parameters/TestRpc.TestCallTimeout/SSL_TCP (2251 ms)
[ RUN ] Parameters/TestRpc.TestServerShutsDown/SSL_TCP
I20260928 03:44:36.679522 390 rpc-test.cc:1125] Connecting to 0.0.0.0:45475
W20260928 03:44:36.687575 712 negotiation.cc:337] Failed RPC negotiation. Trace:
0928 03:44:36.686088 (+ 0us) reactor.cc:625] Submitting negotiation task for client connection to 0.0.0.0:45475 (local address 127.0.0.1:34318)
0928 03:44:36.686521 (+ 433us) negotiation.cc:107] Waiting for socket to connect
0928 03:44:36.686551 (+ 30us) client_negotiation.cc:174] Beginning negotiation
0928 03:44:36.686758 (+ 207us) client_negotiation.cc:252] Sending NEGOTIATE NegotiatePB request
0928 03:44:36.686977 (+ 219us) negotiation.cc:327] Negotiation complete: Network error: Client connection negotiation failed: client connection to 0.0.0.0:45475: BlockingWrite error: write error: Broken pipe (error 32)
Metrics: {"client-negotiator.queue_time_us":105}
[ OK ] Parameters/TestRpc.TestServerShutsDown/SSL_TCP (11 ms)
[ RUN ] Parameters/TestRpc.TimedOutOnResponseMetric/SSL_TCP
I20260928 03:44:36.709959 729 acceptor_pool.cc:254] collecting diagnostics on the listening RPC socket 0.0.0.0:42575 every 8 connection(s)
I20260928 03:44:36.710639 730 acceptor_pool.cc:254] collecting diagnostics on the listening RPC socket 0.0.0.0:42575 every 8 connection(s)
W20260928 03:44:36.949164 733 rpcz_store.cc:267] Call kudu.rpc_test.CalculatorService.Sleep from 127.0.0.1:55160 (request call id 3) took 50 ms (client timeout 25 ms). Trace:
W20260928 03:44:36.949466 733 rpcz_store.cc:269] 0928 03:44:36.898568 (+ 0us) service_pool.cc:170] Inserting onto call queue
0928 03:44:36.898674 (+ 106us) service_pool.cc:227] Handling call
0928 03:44:36.949087 (+ 50413us) inbound_call.cc:173] Queueing success response
Related trace 'test_child':
Metrics: {"test_sleep_us":50000,"child_traces":[["test_child",{"related_trace_metric":1}]]}
W20260928 03:44:37.008733 733 rpcz_store.cc:267] Call kudu.rpc_test.CalculatorService.Sleep from 127.0.0.1:55160 (request call id 4) took 50 ms (client timeout 50 ms). Trace:
W20260928 03:44:37.009008 733 rpcz_store.cc:269] 0928 03:44:36.958167 (+ 0us) service_pool.cc:170] Inserting onto call queue
0928 03:44:36.958290 (+ 123us) service_pool.cc:227] Handling call
0928 03:44:37.008674 (+ 50384us) inbound_call.cc:173] Queueing success response
Related trace 'test_child':
Metrics: {"test_sleep_us":50000,"child_traces":[["test_child",{"related_trace_metric":1}]]}
[ OK ] Parameters/TestRpc.TimedOutOnResponseMetric/SSL_TCP (326 ms)
[ RUN ] Parameters/TestRpc.AcceptorDispatchingTimesMetric/SSL_TCP
I20260928 03:44:37.027350 754 acceptor_pool.cc:254] collecting diagnostics on the listening RPC socket 0.0.0.0:42965 every 8 connection(s)
I20260928 03:44:37.027958 755 acceptor_pool.cc:254] collecting diagnostics on the listening RPC socket 0.0.0.0:42965 every 8 connection(s)
W20260928 03:44:37.032368 750 negotiation.cc:337] Failed RPC negotiation. Trace:
0928 03:44:37.031335 (+ 0us) reactor.cc:625] Submitting negotiation task for server connection from 127.0.0.1:34948 (local address 127.0.0.1:42965)
0928 03:44:37.031700 (+ 365us) server_negotiation.cc:206] Beginning negotiation
0928 03:44:37.031716 (+ 16us) server_negotiation.cc:399] Waiting for connection header
0928 03:44:37.031938 (+ 222us) negotiation.cc:327] Negotiation complete: Network error: Server connection negotiation failed: server connection from 127.0.0.1:34948: BlockingRecv error: recv got EOF from 127.0.0.1:34948 (error 108)
Metrics: {"server-negotiator.queue_time_us":90}
[ OK ] Parameters/TestRpc.AcceptorDispatchingTimesMetric/SSL_TCP (20 ms)
[ RUN ] Parameters/TestRpc.TestRpcCallbackDestroysMessenger/SSL_TCP
[ OK ] Parameters/TestRpc.TestRpcCallbackDestroysMessenger/SSL_TCP (25 ms)
[ RUN ] Parameters/TestRpc.TestApplicationFeatureFlag/SSL_TCP
I20260928 03:44:37.084656 779 acceptor_pool.cc:254] collecting diagnostics on the listening RPC socket 0.0.0.0:36935 every 8 connection(s)
I20260928 03:44:37.085291 780 acceptor_pool.cc:254] collecting diagnostics on the listening RPC socket 0.0.0.0:36935 every 8 connection(s)
W20260928 03:44:37.111416 778 messenger.cc:357] Unable to handle RPC call: Not implemented: call requires unsupported application feature flags: 99
[ OK ] Parameters/TestRpc.TestApplicationFeatureFlag/SSL_TCP (54 ms)
[ RUN ] Parameters/TestRpc.TestCancellation/SSL_TCP
I20260928 03:44:37.141484 804 acceptor_pool.cc:254] collecting diagnostics on the listening RPC socket 0.0.0.0:39267 every 8 connection(s)
I20260928 03:44:37.142158 805 acceptor_pool.cc:254] collecting diagnostics on the listening RPC socket 0.0.0.0:39267 every 8 connection(s)
I20260928 03:44:37.145004 390 rpc-test.cc:1648] Connecting to 0.0.0.0:39267
I20260928 03:44:37.262610 390 rpc-test-base.h:595] status: Aborted: Sleep RPC to 0.0.0.0:39267 is cancelled in state READY, seconds elapsed: 0.000384987
I20260928 03:44:37.392409 390 rpc-test-base.h:595] status: Aborted: Sleep RPC to 0.0.0.0:39267 is cancelled in state SENT, seconds elapsed: 0.000832457
I20260928 03:44:37.434051 807 rpc-test-base.h:222] got call: sleep_micros: 510000
I20260928 03:44:37.563657 390 rpc-test-base.h:595] status: Aborted: Sleep RPC to 0.0.0.0:39267 is cancelled in state SENT, seconds elapsed: 0.000791155
I20260928 03:44:37.600204 806 rpc-test-base.h:222] got call: sleep_micros: 510000
I20260928 03:44:37.735225 390 rpc-test-base.h:595] status: Aborted: Sleep RPC to 0.0.0.0:39267 is cancelled in state SENT, seconds elapsed: 0.000815807
W20260928 03:44:37.770469 808 rpcz_store.cc:267] Call kudu.rpc.GenericCalculatorService.Sleep from 127.0.0.1:50088 (request call id 11) took 14 ms (client timeout 10 ms). Trace:
W20260928 03:44:37.770776 808 rpcz_store.cc:269] 0928 03:44:37.755733 (+ 0us) service_pool.cc:170] Inserting onto call queue
0928 03:44:37.770214 (+ 14481us) service_pool.cc:214] Skipping call since client already timed out
0928 03:44:37.770292 (+ 78us) inbound_call.cc:173] Queueing failure response
Metrics: {}
I20260928 03:44:37.771328 808 rpc-test-base.h:222] got call: sleep_micros: 1500000
W20260928 03:44:37.944723 807 rpcz_store.cc:267] Call kudu.rpc.GenericCalculatorService.Sleep from 127.0.0.1:50088 (request call id 3) took 510 ms (client timeout 10 ms). Trace:
W20260928 03:44:37.945027 807 rpcz_store.cc:269] 0928 03:44:37.433851 (+ 0us) service_pool.cc:170] Inserting onto call queue
0928 03:44:37.433981 (+ 130us) service_pool.cc:227] Handling call
0928 03:44:37.944667 (+510686us) inbound_call.cc:173] Queueing success response
Metrics: {}
W20260928 03:44:38.110980 806 rpcz_store.cc:267] Call kudu.rpc.GenericCalculatorService.Sleep from 127.0.0.1:50088 (request call id 7) took 511 ms (client timeout 10 ms). Trace:
W20260928 03:44:38.111275 806 rpcz_store.cc:269] 0928 03:44:37.599976 (+ 0us) service_pool.cc:170] Inserting onto call queue
0928 03:44:37.600129 (+ 153us) service_pool.cc:227] Handling call
0928 03:44:38.110925 (+510796us) inbound_call.cc:173] Queueing success response
Metrics: {}
I20260928 03:44:38.736799 390 rpc-test-base.h:595] status: Timed out: Sleep RPC to 0.0.0.0:39267 timed out after 1.000s (SENT), seconds elapsed: 1.00125
I20260928 03:44:38.738061 806 rpc-test-base.h:222] got call: sleep_micros: 1500000
W20260928 03:44:39.271739 808 rpcz_store.cc:267] Call kudu.rpc.GenericCalculatorService.Sleep from 127.0.0.1:50088 (request call id 12) took 1515 ms (client timeout 1000 ms). Trace:
W20260928 03:44:39.272046 808 rpcz_store.cc:269] 0928 03:44:37.755945 (+ 0us) service_pool.cc:170] Inserting onto call queue
0928 03:44:37.771288 (+ 15343us) service_pool.cc:227] Handling call
0928 03:44:39.271691 (+1500403us) inbound_call.cc:173] Queueing success response
Metrics: {}
I20260928 03:44:39.739022 390 rpc-test-base.h:595] status: Timed out: Sleep RPC to 0.0.0.0:39267 timed out after 1.000s (SENT), seconds elapsed: 1.0019
W20260928 03:44:39.740350 801 messenger.cc:357] Unable to handle RPC call: Not implemented: call requires unsupported application feature flags: 99, 1
W20260928 03:44:39.741861 801 messenger.cc:357] Unable to handle RPC call: Not implemented: call requires unsupported application feature flags: 99, 1
W20260928 03:44:40.238549 806 rpcz_store.cc:267] Call kudu.rpc.GenericCalculatorService.Sleep from 127.0.0.1:50088 (request call id 13) took 1500 ms (client timeout 1000 ms). Trace:
W20260928 03:44:40.238857 806 rpcz_store.cc:269] 0928 03:44:38.737827 (+ 0us) service_pool.cc:170] Inserting onto call queue
0928 03:44:38.738013 (+ 186us) service_pool.cc:227] Handling call
0928 03:44:40.238502 (+1500489us) inbound_call.cc:173] Queueing success response
Metrics: {}
W20260928 03:44:40.239373 801 connection.cc:441] server connection from 127.0.0.1:50088 torn down before Call kudu.rpc.GenericCalculatorService.Sleep from 127.0.0.1:50088 (request call id 13) could send its response
[ OK ] Parameters/TestRpc.TestCancellation/SSL_TCP (3126 ms)
[ RUN ] Parameters/TestRpc.TestCancellationMultiThreads/SSL_TCP
I20260928 03:44:40.262980 829 acceptor_pool.cc:254] collecting diagnostics on the listening RPC socket 0.0.0.0:41575 every 8 connection(s)
I20260928 03:44:40.263630 830 acceptor_pool.cc:254] collecting diagnostics on the listening RPC socket 0.0.0.0:41575 every 8 connection(s)
I20260928 03:44:40.266512 390 rpc-test.cc:1808] Connecting to 0.0.0.0:41575
I20260928 03:44:40.414546 843 test_util.cc:268] Using random seed: -490320584
I20260928 03:44:40.415524 844 test_util.cc:268] Using random seed: -490319604
I20260928 03:44:40.416800 845 test_util.cc:268] Using random seed: -490318325
I20260928 03:44:40.418030 846 test_util.cc:268] Using random seed: -490317119
I20260928 03:44:40.420331 847 test_util.cc:268] Using random seed: -490314931
I20260928 03:44:40.421684 848 test_util.cc:268] Using random seed: -490313561
I20260928 03:44:40.423039 849 test_util.cc:268] Using random seed: -490312235
I20260928 03:44:40.424621 850 test_util.cc:268] Using random seed: -490310806
I20260928 03:44:40.426644 851 test_util.cc:268] Using random seed: -490308588
I20260928 03:44:40.427819 852 test_util.cc:268] Using random seed: -490307423
I20260928 03:44:40.429564 853 test_util.cc:268] Using random seed: -490305664
I20260928 03:44:40.433247 854 test_util.cc:268] Using random seed: -490302020
I20260928 03:44:40.435034 855 test_util.cc:268] Using random seed: -490300235
I20260928 03:44:40.436743 856 test_util.cc:268] Using random seed: -490298473
I20260928 03:44:40.438699 857 test_util.cc:268] Using random seed: -490296566
I20260928 03:44:40.440635 858 test_util.cc:268] Using random seed: -490294691
I20260928 03:44:40.442205 859 test_util.cc:268] Using random seed: -490293034
I20260928 03:44:40.444715 860 test_util.cc:268] Using random seed: -490290888
I20260928 03:44:40.446141 861 test_util.cc:268] Using random seed: -490289159
I20260928 03:44:40.447955 862 test_util.cc:268] Using random seed: -490287327
I20260928 03:44:40.450281 863 test_util.cc:268] Using random seed: -490285023
I20260928 03:44:40.452167 864 test_util.cc:268] Using random seed: -490283119
I20260928 03:44:40.454049 865 test_util.cc:268] Using random seed: -490281243
I20260928 03:44:40.456334 866 test_util.cc:268] Using random seed: -490278907
I20260928 03:44:40.458951 867 test_util.cc:268] Using random seed: -490276302
I20260928 03:44:40.460853 868 test_util.cc:268] Using random seed: -490274855
I20260928 03:44:40.462692 869 test_util.cc:268] Using random seed: -490273006
I20260928 03:44:40.464062 870 test_util.cc:268] Using random seed: -490271192
I20260928 03:44:40.465941 871 test_util.cc:268] Using random seed: -490269327
I20260928 03:44:40.467705 872 test_util.cc:268] Using random seed: -490267546
[ OK ] Parameters/TestRpc.TestCancellationMultiThreads/SSL_TCP (16526 ms)
[ RUN ] Parameters/TestRpc.TestCallId/SSL_TCP
I20260928 03:44:56.811295 886 acceptor_pool.cc:254] collecting diagnostics on the listening RPC socket 0.0.0.0:39989 every 8 connection(s)
I20260928 03:44:56.812032 887 acceptor_pool.cc:254] collecting diagnostics on the listening RPC socket 0.0.0.0:39989 every 8 connection(s)
[ OK ] Parameters/TestRpc.TestCallId/SSL_TCP (84 ms)
[----------] 20 tests from Parameters/TestRpc (35934 ms total)
[----------] Global test environment tear-down
[==========] 21 tests from 2 test suites ran. (35940 ms total)
[ PASSED ] 20 tests.
[ FAILED ] 1 test, listed below:
[ FAILED ] Parameters/TestRpc.TestCallWithChainCertAndRootCA/SSL_TCP, where GetParam() = (true, false)
1 FAILED TEST