Diagnosed failure
Parameters/TestRpc.TestCallWithChainCertAndChainCA/SSL_UnixSocket: /data0/somelongdirectorytoavoidrpathissues/src/kudu/src/kudu/rpc/rpc-test.cc:270: Failure
Failed
Bad status: Runtime error: could not verify certificate chain (error with cert: subject=CN = localhost, ST = sadfjas, C = AS, emailAddress = sdflkdsajf, O = lskdfjlsad, OU = sldfkja, issuer=C = AS, ST = ASDfkjdhf, L = lskdjf, O = saldfja, OU = skdjf, CN = localhost, emailAddress = sadjflkadsj): : certificate has expired
Google Test trace:
/data0/somelongdirectorytoavoidrpathissues/src/kudu/src/kudu/rpc/rpc-test.cc:267: Connecting to unix:/tmp/dist-test-taskaj8d0V/test-tmp/rpc-test-fde32625da69481898b9ca2960e3c254.sock
I20260925 06:28:40.251492 390 test_util.cc:175] -----------------------------------------------
I20260925 06:28:40.251766 390 test_util.cc:176] Had fatal failures, leaving test files at /tmp/dist-test-taskaj8d0V/test-tmp/rpc-test.6.Parameters_TestRpc.TestCallWithChainCertAndChainCA_SSL_UnixSocket.1790317718845186-390-0
Full log
Note: This is test shard 7 of 8.
[==========] Running 21 tests from 2 test suites.
[----------] Global test environment set-up.
[----------] 20 tests from Parameters/TestRpc
[ RUN ] Parameters/TestRpc.TestMessengerCreateDestroy/SSL_UnixSocket
WARNING: Logging before InitGoogleLogging() is written to STDERR
I20260925 06:28:38.946147 390 rpc-test.cc:169] started messenger TestCreateDestroy
[ OK ] Parameters/TestRpc.TestMessengerCreateDestroy/SSL_UnixSocket (1194 ms)
[ RUN ] Parameters/TestRpc.TestNegotiationDeadlock/SSL_UnixSocket
I20260925 06:28:40.129781 412 acceptor_pool.cc:254] collecting diagnostics on the listening RPC socket unix:/tmp/dist-test-taskaj8d0V/test-tmp/rpc-test-5658cb26e19f4eab8e1ee82a702766f6.sock every 8 connection(s)
I20260925 06:28:40.131193 413 acceptor_pool.cc:254] collecting diagnostics on the listening RPC socket unix:/tmp/dist-test-taskaj8d0V/test-tmp/rpc-test-5658cb26e19f4eab8e1ee82a702766f6.sock every 8 connection(s)
[ OK ] Parameters/TestRpc.TestNegotiationDeadlock/SSL_UnixSocket (96 ms)
[ RUN ] Parameters/TestRpc.TestCallWithChainCertAndChainCA/SSL_UnixSocket
I20260925 06:28:40.221541 428 acceptor_pool.cc:254] collecting diagnostics on the listening RPC socket unix:/tmp/dist-test-taskaj8d0V/test-tmp/rpc-test-fde32625da69481898b9ca2960e3c254.sock every 8 connection(s)
I20260925 06:28:40.223589 429 acceptor_pool.cc:254] collecting diagnostics on the listening RPC socket unix:/tmp/dist-test-taskaj8d0V/test-tmp/rpc-test-fde32625da69481898b9ca2960e3c254.sock every 8 connection(s)
/data0/somelongdirectorytoavoidrpathissues/src/kudu/src/kudu/rpc/rpc-test.cc:270: Failure
Failed
Bad status: Runtime error: could not verify certificate chain (error with cert: subject=CN = localhost, ST = sadfjas, C = AS, emailAddress = sdflkdsajf, O = lskdfjlsad, OU = sldfkja, issuer=C = AS, ST = ASDfkjdhf, L = lskdjf, O = saldfja, OU = skdjf, CN = localhost, emailAddress = sadjflkadsj): : certificate has expired
Google Test trace:
/data0/somelongdirectorytoavoidrpathissues/src/kudu/src/kudu/rpc/rpc-test.cc:267: Connecting to unix:/tmp/dist-test-taskaj8d0V/test-tmp/rpc-test-fde32625da69481898b9ca2960e3c254.sock
I20260925 06:28:40.251492 390 test_util.cc:175] -----------------------------------------------
I20260925 06:28:40.251766 390 test_util.cc:176] Had fatal failures, leaving test files at /tmp/dist-test-taskaj8d0V/test-tmp/rpc-test.6.Parameters_TestRpc.TestCallWithChainCertAndChainCA_SSL_UnixSocket.1790317718845186-390-0
[ FAILED ] Parameters/TestRpc.TestCallWithChainCertAndChainCA/SSL_UnixSocket, where GetParam() = (true, true) (64 ms)
[ RUN ] Parameters/TestRpc.TestCallWithPasswordProtectedKey/SSL_UnixSocket
I20260925 06:28:40.290732 453 acceptor_pool.cc:254] collecting diagnostics on the listening RPC socket unix:/tmp/dist-test-taskaj8d0V/test-tmp/rpc-test-38bb889714784d35bbb0bbd29c797bd0.sock every 8 connection(s)
I20260925 06:28:40.291472 454 acceptor_pool.cc:254] collecting diagnostics on the listening RPC socket unix:/tmp/dist-test-taskaj8d0V/test-tmp/rpc-test-38bb889714784d35bbb0bbd29c797bd0.sock every 8 connection(s)
[ OK ] Parameters/TestRpc.TestCallWithPasswordProtectedKey/SSL_UnixSocket (87 ms)
[ RUN ] Parameters/TestRpc.TestCallToBadServer/SSL_UnixSocket
I20260925 06:28:40.369700 390 rpc-test.cc:394] Status: Network error: Client connection negotiation failed: client connection to 0.0.0.0:0: connect: Connection refused (error 111)
I20260925 06:28:40.370982 390 rpc-test.cc:394] Status: Network error: Client connection negotiation failed: client connection to 0.0.0.0:0: connect: Connection refused (error 111)
I20260925 06:28:40.372195 390 rpc-test.cc:394] Status: Network error: Client connection negotiation failed: client connection to 0.0.0.0:0: connect: Connection refused (error 111)
I20260925 06:28:40.373453 390 rpc-test.cc:394] Status: Network error: Client connection negotiation failed: client connection to 0.0.0.0:0: connect: Connection refused (error 111)
I20260925 06:28:40.374706 390 rpc-test.cc:394] Status: Network error: Client connection negotiation failed: client connection to 0.0.0.0:0: connect: Connection refused (error 111)
[ OK ] Parameters/TestRpc.TestCallToBadServer/SSL_UnixSocket (37 ms)
[ RUN ] Parameters/TestRpc.TestWrongService/SSL_UnixSocket
I20260925 06:28:40.406389 488 acceptor_pool.cc:254] collecting diagnostics on the listening RPC socket unix:/tmp/dist-test-taskaj8d0V/test-tmp/rpc-test-08b7ae525c8f42e9b889f1992ad3ec9b.sock every 8 connection(s)
I20260925 06:28:40.407225 489 acceptor_pool.cc:254] collecting diagnostics on the listening RPC socket unix:/tmp/dist-test-taskaj8d0V/test-tmp/rpc-test-08b7ae525c8f42e9b889f1992ad3ec9b.sock every 8 connection(s)
I20260925 06:28:40.447436 485 messenger.cc:345] service WrongServiceName not registered on TestServer
W20260925 06:28:40.450803 485 connection.cc:196] Error closing socket: Network error: TlsSocket::Close: Broken pipe
[ OK ] Parameters/TestRpc.TestWrongService/SSL_UnixSocket (78 ms)
[ RUN ] Parameters/TestRpc.TestConnectionKeepalive/SSL_UnixSocket
I20260925 06:28:40.469475 511 acceptor_pool.cc:254] collecting diagnostics on the listening RPC socket unix:/tmp/dist-test-taskaj8d0V/test-tmp/rpc-test-3f08d903face4810a1c8e132fa7336d2.sock every 8 connection(s)
I20260925 06:28:40.470196 512 acceptor_pool.cc:254] collecting diagnostics on the listening RPC socket unix:/tmp/dist-test-taskaj8d0V/test-tmp/rpc-test-3f08d903face4810a1c8e132fa7336d2.sock every 8 connection(s)
I20260925 06:28:40.473361 390 rpc-test.cc:488] Connecting to unix:/tmp/dist-test-taskaj8d0V/test-tmp/rpc-test-3f08d903face4810a1c8e132fa7336d2.sock
W20260925 06:28:40.959118 524 connection.cc:196] Error closing socket: Network error: TlsSocket::Close: Broken pipe
[ OK ] Parameters/TestRpc.TestConnectionKeepalive/SSL_UnixSocket (1056 ms)
[ RUN ] Parameters/TestRpc.TestClientConnectionMetrics/SSL_UnixSocket
I20260925 06:28:41.534104 536 acceptor_pool.cc:254] collecting diagnostics on the listening RPC socket unix:/tmp/dist-test-taskaj8d0V/test-tmp/rpc-test-ab0e75a816274093b08113f11dd77b47.sock every 8 connection(s)
I20260925 06:28:41.534870 537 acceptor_pool.cc:254] collecting diagnostics on the listening RPC socket unix:/tmp/dist-test-taskaj8d0V/test-tmp/rpc-test-ab0e75a816274093b08113f11dd77b47.sock every 8 connection(s)
I20260925 06:28:41.537967 390 rpc-test.cc:569] Connecting to unix:/tmp/dist-test-taskaj8d0V/test-tmp/rpc-test-ab0e75a816274093b08113f11dd77b47.sock
W20260925 06:30:57.004343 533 connection.cc:196] Error closing socket: Network error: TlsSocket::Close: Broken pipe
[ OK ] Parameters/TestRpc.TestClientConnectionMetrics/SSL_UnixSocket (135499 ms)
[ RUN ] Parameters/TestRpc.TestCredentialsPolicy/SSL_UnixSocket
I20260925 06:30:57.046993 572 acceptor_pool.cc:254] collecting diagnostics on the listening RPC socket unix:/tmp/dist-test-taskaj8d0V/test-tmp/rpc-test-60f6b1186e0442edb2bbd53b8f4c0e12.sock every 8 connection(s)
I20260925 06:30:57.047842 573 acceptor_pool.cc:254] collecting diagnostics on the listening RPC socket unix:/tmp/dist-test-taskaj8d0V/test-tmp/rpc-test-60f6b1186e0442edb2bbd53b8f4c0e12.sock every 8 connection(s)
I20260925 06:30:57.050947 390 rpc-test.cc:700] Connecting to unix:/tmp/dist-test-taskaj8d0V/test-tmp/rpc-test-60f6b1186e0442edb2bbd53b8f4c0e12.sock
W20260925 06:30:57.082198 571 connection.cc:196] Error closing socket: Network error: TlsSocket::Close: Broken pipe
[ OK ] Parameters/TestRpc.TestCredentialsPolicy/SSL_UnixSocket (90 ms)
[ RUN ] Parameters/TestRpc.TestCallLongerThanKeepalive/SSL_UnixSocket
I20260925 06:30:57.127183 597 acceptor_pool.cc:254] collecting diagnostics on the listening RPC socket unix:/tmp/dist-test-taskaj8d0V/test-tmp/rpc-test-55c47a4625d74b88ba71d271841942dd.sock every 8 connection(s)
I20260925 06:30:57.127920 598 acceptor_pool.cc:254] collecting diagnostics on the listening RPC socket unix:/tmp/dist-test-taskaj8d0V/test-tmp/rpc-test-55c47a4625d74b88ba71d271841942dd.sock every 8 connection(s)
I20260925 06:30:57.169778 601 rpc-test-base.h:222] got call: sleep_micros: 3000000 deferred: true
I20260925 06:31:00.174196 601 rpcz_store.cc:275] Call kudu.rpc.GenericCalculatorService.Sleep from unix:<unnamed> (request call id 0) took 3004 ms. Trace:
I20260925 06:31:00.174705 601 rpcz_store.cc:276] 0925 06:30:57.169621 (+ 0us) service_pool.cc:170] Inserting onto call queue
0925 06:30:57.169716 (+ 95us) service_pool.cc:227] Handling call
0925 06:31:00.174014 (+3004298us) inbound_call.cc:173] Queueing success response
Metrics: {}
W20260925 06:31:00.179488 594 connection.cc:196] Error closing socket: Network error: TlsSocket::Close: Broken pipe
[ OK ] Parameters/TestRpc.TestCallLongerThanKeepalive/SSL_UnixSocket (3084 ms)
[ RUN ] Parameters/TestRpc.TestRpcSidecar/SSL_UnixSocket
I20260925 06:31:00.261858 623 acceptor_pool.cc:254] collecting diagnostics on the listening RPC socket unix:/tmp/dist-test-taskaj8d0V/test-tmp/rpc-test-e2b9edd4dbf84771b113659f8d8982cd.sock every 8 connection(s)
I20260925 06:31:00.262651 624 acceptor_pool.cc:254] collecting diagnostics on the listening RPC socket unix:/tmp/dist-test-taskaj8d0V/test-tmp/rpc-test-e2b9edd4dbf84771b113659f8d8982cd.sock every 8 connection(s)
W20260925 06:31:00.778939 620 connection.cc:196] Error closing socket: Network error: TlsSocket::Close: Broken pipe
[ OK ] Parameters/TestRpc.TestRpcSidecar/SSL_UnixSocket (596 ms)
[ RUN ] Parameters/TestRpc.TestRpcSidecarLimits/SSL_UnixSocket
I20260925 06:31:17.470595 649 acceptor_pool.cc:254] collecting diagnostics on the listening RPC socket unix:/tmp/dist-test-taskaj8d0V/test-tmp/rpc-test-99fb4501d9e540b581fb7f57a47d9f9d.sock every 8 connection(s)
I20260925 06:31:17.471393 650 acceptor_pool.cc:254] collecting diagnostics on the listening RPC socket unix:/tmp/dist-test-taskaj8d0V/test-tmp/rpc-test-99fb4501d9e540b581fb7f57a47d9f9d.sock every 8 connection(s)
W20260925 06:31:17.491150 390 serialization.cc:72] Serialized kudu.rpc_test.PushStringsRequestPB (2147483654 bytes) is larger than the maximum configured RPC message size (52428800 bytes). Sending anyway, but peer may reject the data.
W20260925 06:31:17.503062 646 connection.cc:535] server connection from unix:<unnamed> recv error: Network error: RPC frame had a length of 2147483714, but we only support messages up to 52428800 bytes long.
W20260925 06:31:17.503499 646 connection.cc:158] shutting down server connection from unix:<unnamed> with pending inbound data: 4/2147483714 bytes received; last active 0 ns ago: status Network error: RPC frame had a length of 2147483714, but we only support messages up to 52428800 bytes long.
W20260925 06:31:17.504364 662 connection.cc:698] client connection to unix:/tmp/dist-test-taskaj8d0V/test-tmp/rpc-test-99fb4501d9e540b581fb7f57a47d9f9d.sock send error: Network error: failed to write to TLS socket: Broken pipe
W20260925 06:31:17.505012 662 connection.cc:196] Error closing socket: Network error: TlsSocket::Close: Success
[ OK ] Parameters/TestRpc.TestRpcSidecarLimits/SSL_UnixSocket (17504 ms)
[ RUN ] Parameters/TestRpc.TestCallTimeoutDoesntAffectNegotiation/SSL_UnixSocket
I20260925 06:31:18.310720 674 acceptor_pool.cc:254] collecting diagnostics on the listening RPC socket unix:/tmp/dist-test-taskaj8d0V/test-tmp/rpc-test-4bf12c46ea774678ad27ac9990b9238d.sock every 8 connection(s)
I20260925 06:31:18.311468 675 acceptor_pool.cc:254] collecting diagnostics on the listening RPC socket unix:/tmp/dist-test-taskaj8d0V/test-tmp/rpc-test-4bf12c46ea774678ad27ac9990b9238d.sock every 8 connection(s)
W20260925 06:31:18.328509 670 negotiation.cc:266] Injecting 500ms delay in negotiation
I20260925 06:31:18.379109 390 rpc-test-base.h:595] status: Timed out: connection negotiation to unix:/tmp/dist-test-taskaj8d0V/test-tmp/rpc-test-4bf12c46ea774678ad27ac9990b9238d.sock for RPC Sleep timed out after 0.050s (ON_OUTBOUND_QUEUE), seconds elapsed: 0.0515957
[ OK ] Parameters/TestRpc.TestCallTimeoutDoesntAffectNegotiation/SSL_UnixSocket (557 ms)
[ RUN ] Parameters/TestRpc.TestRpcHandlerLatencyMetric/SSL_UnixSocket
I20260925 06:31:18.877113 699 acceptor_pool.cc:254] collecting diagnostics on the listening RPC socket unix:/tmp/dist-test-taskaj8d0V/test-tmp/rpc-test-f7fe58b8d118410dbe77762bc4e5b985.sock every 8 connection(s)
I20260925 06:31:18.877935 700 acceptor_pool.cc:254] collecting diagnostics on the listening RPC socket unix:/tmp/dist-test-taskaj8d0V/test-tmp/rpc-test-f7fe58b8d118410dbe77762bc4e5b985.sock every 8 connection(s)
I20260925 06:31:18.938470 390 rpc-test.cc:1236] Sleep() min lat: 21548
I20260925 06:31:18.938659 390 rpc-test.cc:1237] Sleep() mean lat: 21548
I20260925 06:31:18.938787 390 rpc-test.cc:1238] Sleep() max lat: 21548
I20260925 06:31:18.938898 390 rpc-test.cc:1239] Sleep() #calls: 1
W20260925 06:31:18.941682 696 connection.cc:196] Error closing socket: Network error: TlsSocket::Close: Broken pipe
[ OK ] Parameters/TestRpc.TestRpcHandlerLatencyMetric/SSL_UnixSocket (99 ms)
[ RUN ] Parameters/TestRpc.TimedOutOnResponseMetricServiceQueue/SSL_UnixSocket
I20260925 06:31:18.982733 725 acceptor_pool.cc:254] collecting diagnostics on the listening RPC socket unix:/tmp/dist-test-taskaj8d0V/test-tmp/rpc-test-22e2053c16c942c0bcf995d5413a6941.sock every 8 connection(s)
I20260925 06:31:18.983623 726 acceptor_pool.cc:254] collecting diagnostics on the listening RPC socket unix:/tmp/dist-test-taskaj8d0V/test-tmp/rpc-test-22e2053c16c942c0bcf995d5413a6941.sock every 8 connection(s)
W20260925 06:31:19.057670 727 rpcz_store.cc:267] Call kudu.rpc_test.CalculatorService.Sleep from unix:<unnamed> (request call id 2) took 20 ms (client timeout 20 ms). Trace:
W20260925 06:31:19.058039 727 rpcz_store.cc:269] 0925 06:31:19.037237 (+ 0us) service_pool.cc:170] Inserting onto call queue
0925 06:31:19.057544 (+ 20307us) service_pool.cc:214] Skipping call since client already timed out
0925 06:31:19.057622 (+ 78us) inbound_call.cc:173] Queueing failure response
Metrics: {}
W20260925 06:31:19.060599 722 connection.cc:196] Error closing socket: Network error: TlsSocket::Close: Broken pipe
[ OK ] Parameters/TestRpc.TimedOutOnResponseMetricServiceQueue/SSL_UnixSocket (118 ms)
[ RUN ] Parameters/TestRpc.RpcPendingConnectionsMetric/SSL_UnixSocket
I20260925 06:31:19.074536 748 acceptor_pool.cc:254] collecting diagnostics on the listening RPC socket 0.0.0.0:36735 every 8 connection(s)
I20260925 06:31:19.075300 749 acceptor_pool.cc:254] collecting diagnostics on the listening RPC socket 0.0.0.0:36735 every 8 connection(s)
W20260925 06:31:19.089715 744 negotiation.cc:337] Failed RPC negotiation. Trace:
0925 06:31:19.088058 (+ 0us) reactor.cc:625] Submitting negotiation task for server connection from 127.0.0.1:43074 (local address 127.0.0.1:36735)
0925 06:31:19.088853 (+ 795us) server_negotiation.cc:206] Beginning negotiation
0925 06:31:19.088881 (+ 28us) server_negotiation.cc:399] Waiting for connection header
0925 06:31:19.089185 (+ 304us) negotiation.cc:327] Negotiation complete: Network error: Server connection negotiation failed: server connection from 127.0.0.1:43074: BlockingRecv error: recv got EOF from 127.0.0.1:43074 (error 108)
Metrics: {"server-negotiator.queue_time_us":297}
[ OK ] Parameters/TestRpc.RpcPendingConnectionsMetric/SSL_UnixSocket (38 ms)
[ RUN ] Parameters/TestRpc.TestRpcContextClientDeadline/SSL_UnixSocket
I20260925 06:31:19.128804 764 acceptor_pool.cc:254] collecting diagnostics on the listening RPC socket unix:/tmp/dist-test-taskaj8d0V/test-tmp/rpc-test-5851c4e5a8584bb199bac2d64473cdd3.sock every 8 connection(s)
I20260925 06:31:19.129606 765 acceptor_pool.cc:254] collecting diagnostics on the listening RPC socket unix:/tmp/dist-test-taskaj8d0V/test-tmp/rpc-test-5851c4e5a8584bb199bac2d64473cdd3.sock every 8 connection(s)
[ OK ] Parameters/TestRpc.TestRpcContextClientDeadline/SSL_UnixSocket (82 ms)
[ RUN ] Parameters/TestRpc.TestApplicationFeatureFlagUnsupportedServer/SSL_UnixSocket
I20260925 06:31:19.212873 789 acceptor_pool.cc:254] collecting diagnostics on the listening RPC socket unix:/tmp/dist-test-taskaj8d0V/test-tmp/rpc-test-ec1e6d1f986f4af888b935599082d591.sock every 8 connection(s)
I20260925 06:31:19.213624 790 acceptor_pool.cc:254] collecting diagnostics on the listening RPC socket unix:/tmp/dist-test-taskaj8d0V/test-tmp/rpc-test-ec1e6d1f986f4af888b935599082d591.sock every 8 connection(s)
W20260925 06:31:19.241798 786 connection.cc:196] Error closing socket: Network error: TlsSocket::Close: Broken pipe
[ OK ] Parameters/TestRpc.TestApplicationFeatureFlagUnsupportedServer/SSL_UnixSocket (60 ms)
[ RUN ] Parameters/TestRpc.TestCancellationAsync/SSL_UnixSocket
I20260925 06:31:19.273885 814 acceptor_pool.cc:254] collecting diagnostics on the listening RPC socket unix:/tmp/dist-test-taskaj8d0V/test-tmp/rpc-test-16242068d6574fb591d681fd06bff96a.sock every 8 connection(s)
I20260925 06:31:19.274586 815 acceptor_pool.cc:254] collecting diagnostics on the listening RPC socket unix:/tmp/dist-test-taskaj8d0V/test-tmp/rpc-test-16242068d6574fb591d681fd06bff96a.sock every 8 connection(s)
I20260925 06:31:19.277611 390 rpc-test.cc:1716] Connecting to unix:/tmp/dist-test-taskaj8d0V/test-tmp/rpc-test-16242068d6574fb591d681fd06bff96a.sock
I20260925 06:31:19.296348 390 test_util.cc:268] Using random seed: -583335618
I20260925 06:31:19.559466 818 rpc-test-base.h:240] got call: sleep_micros: 500 pattern: 4294967295 num_repetitions: 2097152 sidecar_idx: 0
I20260925 06:31:19.776237 817 rpc-test-base.h:240] got call: sleep_micros: 500 pattern: 4294967295 num_repetitions: 2097152 sidecar_idx: 0
I20260925 06:31:19.994617 817 rpc-test-base.h:240] got call: sleep_micros: 500 pattern: 4294967295 num_repetitions: 2097152 sidecar_idx: 0
I20260925 06:31:20.210798 817 rpc-test-base.h:240] got call: sleep_micros: 500 pattern: 4294967295 num_repetitions: 2097152 sidecar_idx: 0
I20260925 06:31:20.429576 817 rpc-test-base.h:240] got call: sleep_micros: 500 pattern: 4294967295 num_repetitions: 2097152 sidecar_idx: 0
I20260925 06:31:20.632517 818 rpc-test-base.h:240] got call: sleep_micros: 500 pattern: 4294967295 num_repetitions: 2097152 sidecar_idx: 0
I20260925 06:31:20.855397 818 rpc-test-base.h:240] got call: sleep_micros: 500 pattern: 4294967295 num_repetitions: 2097152 sidecar_idx: 0
I20260925 06:31:21.068609 818 rpc-test-base.h:240] got call: sleep_micros: 500 pattern: 4294967295 num_repetitions: 2097152 sidecar_idx: 0
I20260925 06:31:21.269205 817 rpc-test-base.h:240] got call: sleep_micros: 500 pattern: 4294967295 num_repetitions: 2097152 sidecar_idx: 0
W20260925 06:31:21.288501 811 connection.cc:196] Error closing socket: Network error: TlsSocket::Close: Broken pipe
W20260925 06:31:21.407454 811 connection.cc:441] server connection from unix:<unnamed> torn down before Call kudu.rpc.GenericCalculatorService.SleepWithSidecar from unix:<unnamed> (request call id 9) could send its response
[ OK ] Parameters/TestRpc.TestCancellationAsync/SSL_UnixSocket (2174 ms)
[ RUN ] Parameters/TestRpc.TestPerformanceBySocketType/SSL_UnixSocket
I20260925 06:31:21.520732 840 acceptor_pool.cc:254] collecting diagnostics on the listening RPC socket unix:/tmp/dist-test-taskaj8d0V/test-tmp/rpc-test-7b8f61064c484adca35503cca6c78117.sock every 8 connection(s)
I20260925 06:31:21.521600 841 acceptor_pool.cc:254] collecting diagnostics on the listening RPC socket unix:/tmp/dist-test-taskaj8d0V/test-tmp/rpc-test-7b8f61064c484adca35503cca6c78117.sock every 8 connection(s)
I20260925 06:31:21.524715 390 rpc-test.cc:1846] Connecting to unix:/tmp/dist-test-taskaj8d0V/test-tmp/rpc-test-7b8f61064c484adca35503cca6c78117.sock
I20260925 06:31:42.905071 390 rpc-test.cc:1859] Sending 1024MB via ssl-enabled unix socket: real 21.325s user 19.110s sys 12.765s
I20260925 06:32:04.057835 390 rpc-test.cc:1859] Sending 1024MB via ssl-enabled unix socket: real 21.152s user 18.929s sys 12.644s
I20260925 06:32:25.243117 390 rpc-test.cc:1859] Sending 1024MB via ssl-enabled unix socket: real 21.185s user 18.812s sys 12.771s
I20260925 06:32:46.265902 390 rpc-test.cc:1859] Sending 1024MB via ssl-enabled unix socket: real 21.022s user 18.728s sys 12.574s
I20260925 06:33:07.444746 390 rpc-test.cc:1859] Sending 1024MB via ssl-enabled unix socket: real 21.178s user 18.725s sys 12.889s
W20260925 06:33:07.450964 837 connection.cc:196] Error closing socket: Network error: TlsSocket::Close: Broken pipe
[ OK ] Parameters/TestRpc.TestPerformanceBySocketType/SSL_UnixSocket (106040 ms)
[----------] 20 tests from Parameters/TestRpc (268566 ms total)
[----------] 1 test from Parameters/TestRpcSocketTxRxQueue
[ RUN ] Parameters/TestRpcSocketTxRxQueue.AcceptorRxQueueSizeMetric/0
I20260925 06:33:07.477283 875 acceptor_pool.cc:254] collecting diagnostics on the listening RPC socket 0.0.0.0:35277 every 1 connection(s)
I20260925 06:33:07.478235 876 acceptor_pool.cc:254] collecting diagnostics on the listening RPC socket 0.0.0.0:35277 every 1 connection(s)
W20260925 06:33:07.483573 871 negotiation.cc:337] Failed RPC negotiation. Trace:
0925 06:33:07.482042 (+ 0us) reactor.cc:625] Submitting negotiation task for server connection from 127.0.0.1:44608 (local address 127.0.0.1:35277)
0925 06:33:07.482496 (+ 454us) server_negotiation.cc:206] Beginning negotiation
0925 06:33:07.482519 (+ 23us) server_negotiation.cc:399] Waiting for connection header
0925 06:33:07.482754 (+ 235us) negotiation.cc:327] Negotiation complete: Network error: Server connection negotiation failed: server connection from 127.0.0.1:44608: BlockingRecv error: recv got EOF from 127.0.0.1:44608 (error 108)
Metrics: {"server-negotiator.queue_time_us":115}
[ OK ] Parameters/TestRpcSocketTxRxQueue.AcceptorRxQueueSizeMetric/0 (27 ms)
[----------] 1 test from Parameters/TestRpcSocketTxRxQueue (28 ms total)
[----------] Global test environment tear-down
[==========] 21 tests from 2 test suites ran. (268595 ms total)
[ PASSED ] 20 tests.
[ FAILED ] 1 test, listed below:
[ FAILED ] Parameters/TestRpc.TestCallWithChainCertAndChainCA/SSL_UnixSocket, where GetParam() = (true, true)
1 FAILED TEST