Diagnosed failure

Parameters/TestRpc.TestCallWithChainCertAndChainCA/SSL_UnixSocket: /data0/somelongdirectorytoavoidrpathissues/src/kudu/src/kudu/rpc/rpc-test.cc:270: Failure
Failed
Bad status: Runtime error: could not verify certificate chain (error with cert: subject=CN = localhost, ST = sadfjas, C = AS, emailAddress = sdflkdsajf, O = lskdfjlsad, OU = sldfkja, issuer=C = AS, ST = ASDfkjdhf, L = lskdjf, O = saldfja, OU = skdjf, CN = localhost, emailAddress = sadjflkadsj): : certificate has expired
Google Test trace:
/data0/somelongdirectorytoavoidrpathissues/src/kudu/src/kudu/rpc/rpc-test.cc:267: Connecting to unix:/tmp/dist-test-taskGzk9m1/test-tmp/rpc-test-058f1afee757441f93fdc007e69f0a53.sock
I20260928 23:50:06.501219 32230 test_util.cc:175] -----------------------------------------------
I20260928 23:50:06.501391 32230 test_util.cc:176] Had fatal failures, leaving test files at /tmp/dist-test-taskGzk9m1/test-tmp/rpc-test.6.Parameters_TestRpc.TestCallWithChainCertAndChainCA_SSL_UnixSocket.1790639405089912-32230-0

Full log

Note: This is test shard 7 of 8.
[==========] Running 21 tests from 2 test suites.
[----------] Global test environment set-up.
[----------] 20 tests from Parameters/TestRpc
[ RUN      ] Parameters/TestRpc.TestMessengerCreateDestroy/SSL_UnixSocket
WARNING: Logging before InitGoogleLogging() is written to STDERR
I20260928 23:50:05.200569 32230 rpc-test.cc:169] started messenger TestCreateDestroy
[       OK ] Parameters/TestRpc.TestMessengerCreateDestroy/SSL_UnixSocket (1227 ms)
[ RUN      ] Parameters/TestRpc.TestNegotiationDeadlock/SSL_UnixSocket
I20260928 23:50:06.391299 32252 acceptor_pool.cc:254] collecting diagnostics on the listening RPC socket unix:/tmp/dist-test-taskGzk9m1/test-tmp/rpc-test-0d230b9a913541e59319f61333153389.sock every 8 connection(s)
I20260928 23:50:06.392693 32253 acceptor_pool.cc:254] collecting diagnostics on the listening RPC socket unix:/tmp/dist-test-taskGzk9m1/test-tmp/rpc-test-0d230b9a913541e59319f61333153389.sock every 8 connection(s)
[       OK ] Parameters/TestRpc.TestNegotiationDeadlock/SSL_UnixSocket (73 ms)
[ RUN      ] Parameters/TestRpc.TestCallWithChainCertAndChainCA/SSL_UnixSocket
I20260928 23:50:06.469771 32268 acceptor_pool.cc:254] collecting diagnostics on the listening RPC socket unix:/tmp/dist-test-taskGzk9m1/test-tmp/rpc-test-058f1afee757441f93fdc007e69f0a53.sock every 8 connection(s)
I20260928 23:50:06.472287 32269 acceptor_pool.cc:254] collecting diagnostics on the listening RPC socket unix:/tmp/dist-test-taskGzk9m1/test-tmp/rpc-test-058f1afee757441f93fdc007e69f0a53.sock every 8 connection(s)
/data0/somelongdirectorytoavoidrpathissues/src/kudu/src/kudu/rpc/rpc-test.cc:270: Failure
Failed
Bad status: Runtime error: could not verify certificate chain (error with cert: subject=CN = localhost, ST = sadfjas, C = AS, emailAddress = sdflkdsajf, O = lskdfjlsad, OU = sldfkja, issuer=C = AS, ST = ASDfkjdhf, L = lskdjf, O = saldfja, OU = skdjf, CN = localhost, emailAddress = sadjflkadsj): : certificate has expired
Google Test trace:
/data0/somelongdirectorytoavoidrpathissues/src/kudu/src/kudu/rpc/rpc-test.cc:267: Connecting to unix:/tmp/dist-test-taskGzk9m1/test-tmp/rpc-test-058f1afee757441f93fdc007e69f0a53.sock
I20260928 23:50:06.501219 32230 test_util.cc:175] -----------------------------------------------
I20260928 23:50:06.501391 32230 test_util.cc:176] Had fatal failures, leaving test files at /tmp/dist-test-taskGzk9m1/test-tmp/rpc-test.6.Parameters_TestRpc.TestCallWithChainCertAndChainCA_SSL_UnixSocket.1790639405089912-32230-0
[  FAILED  ] Parameters/TestRpc.TestCallWithChainCertAndChainCA/SSL_UnixSocket, where GetParam() = (true, true) (57 ms)
[ RUN      ] Parameters/TestRpc.TestCallWithPasswordProtectedKey/SSL_UnixSocket
I20260928 23:50:06.529371 32293 acceptor_pool.cc:254] collecting diagnostics on the listening RPC socket unix:/tmp/dist-test-taskGzk9m1/test-tmp/rpc-test-b9dc48fa04194fd2970529e33a56e232.sock every 8 connection(s)
I20260928 23:50:06.530087 32294 acceptor_pool.cc:254] collecting diagnostics on the listening RPC socket unix:/tmp/dist-test-taskGzk9m1/test-tmp/rpc-test-b9dc48fa04194fd2970529e33a56e232.sock every 8 connection(s)
W20260928 23:50:06.573221 32290 connection.cc:196] Error closing socket: Network error: TlsSocket::Close: Broken pipe
[       OK ] Parameters/TestRpc.TestCallWithPasswordProtectedKey/SSL_UnixSocket (76 ms)
[ RUN      ] Parameters/TestRpc.TestCallToBadServer/SSL_UnixSocket
I20260928 23:50:06.593840 32230 rpc-test.cc:394] Status: Network error: Client connection negotiation failed: client connection to 0.0.0.0:0: connect: Connection refused (error 111)
I20260928 23:50:06.595270 32230 rpc-test.cc:394] Status: Network error: Client connection negotiation failed: client connection to 0.0.0.0:0: connect: Connection refused (error 111)
I20260928 23:50:06.596514 32230 rpc-test.cc:394] Status: Network error: Client connection negotiation failed: client connection to 0.0.0.0:0: connect: Connection refused (error 111)
I20260928 23:50:06.597934 32230 rpc-test.cc:394] Status: Network error: Client connection negotiation failed: client connection to 0.0.0.0:0: connect: Connection refused (error 111)
I20260928 23:50:06.599210 32230 rpc-test.cc:394] Status: Network error: Client connection negotiation failed: client connection to 0.0.0.0:0: connect: Connection refused (error 111)
[       OK ] Parameters/TestRpc.TestCallToBadServer/SSL_UnixSocket (23 ms)
[ RUN      ] Parameters/TestRpc.TestWrongService/SSL_UnixSocket
I20260928 23:50:06.619673 32328 acceptor_pool.cc:254] collecting diagnostics on the listening RPC socket unix:/tmp/dist-test-taskGzk9m1/test-tmp/rpc-test-4f9e1ad699a5441bb7997ab59800a3ad.sock every 8 connection(s)
I20260928 23:50:06.620544 32329 acceptor_pool.cc:254] collecting diagnostics on the listening RPC socket unix:/tmp/dist-test-taskGzk9m1/test-tmp/rpc-test-4f9e1ad699a5441bb7997ab59800a3ad.sock every 8 connection(s)
I20260928 23:50:06.654749 32325 messenger.cc:345] service WrongServiceName not registered on TestServer
[       OK ] Parameters/TestRpc.TestWrongService/SSL_UnixSocket (61 ms)
[ RUN      ] Parameters/TestRpc.TestConnectionKeepalive/SSL_UnixSocket
I20260928 23:50:06.680102 32351 acceptor_pool.cc:254] collecting diagnostics on the listening RPC socket unix:/tmp/dist-test-taskGzk9m1/test-tmp/rpc-test-9773d8bab1f34f94809eaa30bca1a425.sock every 8 connection(s)
I20260928 23:50:06.680840 32352 acceptor_pool.cc:254] collecting diagnostics on the listening RPC socket unix:/tmp/dist-test-taskGzk9m1/test-tmp/rpc-test-9773d8bab1f34f94809eaa30bca1a425.sock every 8 connection(s)
I20260928 23:50:06.684047 32230 rpc-test.cc:488] Connecting to unix:/tmp/dist-test-taskGzk9m1/test-tmp/rpc-test-9773d8bab1f34f94809eaa30bca1a425.sock
W20260928 23:50:07.166164 32364 connection.cc:196] Error closing socket: Network error: TlsSocket::Close: Broken pipe
[       OK ] Parameters/TestRpc.TestConnectionKeepalive/SSL_UnixSocket (1065 ms)
[ RUN      ] Parameters/TestRpc.TestClientConnectionMetrics/SSL_UnixSocket
I20260928 23:50:07.745543 32376 acceptor_pool.cc:254] collecting diagnostics on the listening RPC socket unix:/tmp/dist-test-taskGzk9m1/test-tmp/rpc-test-c2567da5a7ae40bfb50f93e4e164fd66.sock every 8 connection(s)
I20260928 23:50:07.746274 32377 acceptor_pool.cc:254] collecting diagnostics on the listening RPC socket unix:/tmp/dist-test-taskGzk9m1/test-tmp/rpc-test-c2567da5a7ae40bfb50f93e4e164fd66.sock every 8 connection(s)
I20260928 23:50:07.749399 32230 rpc-test.cc:569] Connecting to unix:/tmp/dist-test-taskGzk9m1/test-tmp/rpc-test-c2567da5a7ae40bfb50f93e4e164fd66.sock
W20260928 23:52:25.177127 32373 connection.cc:196] Error closing socket: Network error: TlsSocket::Close: Broken pipe
[       OK ] Parameters/TestRpc.TestClientConnectionMetrics/SSL_UnixSocket (137457 ms)
[ RUN      ] Parameters/TestRpc.TestCredentialsPolicy/SSL_UnixSocket
I20260928 23:52:25.211508 32412 acceptor_pool.cc:254] collecting diagnostics on the listening RPC socket unix:/tmp/dist-test-taskGzk9m1/test-tmp/rpc-test-dbb7be53d9fc4ef98740b003c957e2a6.sock every 8 connection(s)
I20260928 23:52:25.212291 32413 acceptor_pool.cc:254] collecting diagnostics on the listening RPC socket unix:/tmp/dist-test-taskGzk9m1/test-tmp/rpc-test-dbb7be53d9fc4ef98740b003c957e2a6.sock every 8 connection(s)
I20260928 23:52:25.215581 32230 rpc-test.cc:700] Connecting to unix:/tmp/dist-test-taskGzk9m1/test-tmp/rpc-test-dbb7be53d9fc4ef98740b003c957e2a6.sock
W20260928 23:52:25.251292 32411 connection.cc:196] Error closing socket: Network error: TlsSocket::Close: Broken pipe
[       OK ] Parameters/TestRpc.TestCredentialsPolicy/SSL_UnixSocket (96 ms)
[ RUN      ] Parameters/TestRpc.TestCallLongerThanKeepalive/SSL_UnixSocket
I20260928 23:52:25.300670 32437 acceptor_pool.cc:254] collecting diagnostics on the listening RPC socket unix:/tmp/dist-test-taskGzk9m1/test-tmp/rpc-test-c2a36c6989a04506926feee34e07f010.sock every 8 connection(s)
I20260928 23:52:25.301404 32438 acceptor_pool.cc:254] collecting diagnostics on the listening RPC socket unix:/tmp/dist-test-taskGzk9m1/test-tmp/rpc-test-c2a36c6989a04506926feee34e07f010.sock every 8 connection(s)
I20260928 23:52:25.329568 32441 rpc-test-base.h:222] got call: sleep_micros: 3000000 deferred: true
I20260928 23:52:28.334054 32441 rpcz_store.cc:275] Call kudu.rpc.GenericCalculatorService.Sleep from unix:<unnamed> (request call id 0) took 3004 ms. Trace:
I20260928 23:52:28.334484 32441 rpcz_store.cc:276] 0928 23:52:25.329416 (+     0us) service_pool.cc:170] Inserting onto call queue
0928 23:52:25.329517 (+   101us) service_pool.cc:227] Handling call
0928 23:52:28.333874 (+3004357us) inbound_call.cc:173] Queueing success response
Metrics: {}
W20260928 23:52:28.339586 32434 connection.cc:196] Error closing socket: Network error: TlsSocket::Close: Broken pipe
[       OK ] Parameters/TestRpc.TestCallLongerThanKeepalive/SSL_UnixSocket (3064 ms)
[ RUN      ] Parameters/TestRpc.TestRpcSidecar/SSL_UnixSocket
I20260928 23:52:28.366291 32463 acceptor_pool.cc:254] collecting diagnostics on the listening RPC socket unix:/tmp/dist-test-taskGzk9m1/test-tmp/rpc-test-e0a074c3f10641ad9f556e944462f885.sock every 8 connection(s)
I20260928 23:52:28.367192 32464 acceptor_pool.cc:254] collecting diagnostics on the listening RPC socket unix:/tmp/dist-test-taskGzk9m1/test-tmp/rpc-test-e0a074c3f10641ad9f556e944462f885.sock every 8 connection(s)
W20260928 23:52:28.941047 32460 connection.cc:196] Error closing socket: Network error: TlsSocket::Close: Broken pipe
[       OK ] Parameters/TestRpc.TestRpcSidecar/SSL_UnixSocket (598 ms)
[ RUN      ] Parameters/TestRpc.TestRpcSidecarLimits/SSL_UnixSocket
I20260928 23:52:46.716300 32490 acceptor_pool.cc:254] collecting diagnostics on the listening RPC socket unix:/tmp/dist-test-taskGzk9m1/test-tmp/rpc-test-769f9f4b3e5f44778a73bf61650659c5.sock every 8 connection(s)
I20260928 23:52:46.717120 32491 acceptor_pool.cc:254] collecting diagnostics on the listening RPC socket unix:/tmp/dist-test-taskGzk9m1/test-tmp/rpc-test-769f9f4b3e5f44778a73bf61650659c5.sock every 8 connection(s)
W20260928 23:52:46.737707 32230 serialization.cc:72] Serialized kudu.rpc_test.PushStringsRequestPB (2147483654 bytes) is larger than the maximum configured RPC message size (52428800 bytes). Sending anyway, but peer may reject the data.
W20260928 23:52:46.747368 32487 connection.cc:535] server connection from unix:<unnamed> recv error: Network error: RPC frame had a length of 2147483714, but we only support messages up to 52428800 bytes long.
W20260928 23:52:46.747665 32487 connection.cc:158] shutting down server connection from unix:<unnamed> with pending inbound data: 4/2147483714 bytes received; last active 0 ns ago: status Network error: RPC frame had a length of 2147483714, but we only support messages up to 52428800 bytes long.
W20260928 23:52:46.748431 32503 connection.cc:698] client connection to unix:/tmp/dist-test-taskGzk9m1/test-tmp/rpc-test-769f9f4b3e5f44778a73bf61650659c5.sock send error: Network error: failed to write to TLS socket: Broken pipe
W20260928 23:52:46.748970 32503 connection.cc:196] Error closing socket: Network error: TlsSocket::Close: Success
[       OK ] Parameters/TestRpc.TestRpcSidecarLimits/SSL_UnixSocket (18434 ms)
[ RUN      ] Parameters/TestRpc.TestCallTimeoutDoesntAffectNegotiation/SSL_UnixSocket
I20260928 23:52:47.400539 32515 acceptor_pool.cc:254] collecting diagnostics on the listening RPC socket unix:/tmp/dist-test-taskGzk9m1/test-tmp/rpc-test-b4ca862a1b06457cbab9d01998f5772b.sock every 8 connection(s)
I20260928 23:52:47.401261 32516 acceptor_pool.cc:254] collecting diagnostics on the listening RPC socket unix:/tmp/dist-test-taskGzk9m1/test-tmp/rpc-test-b4ca862a1b06457cbab9d01998f5772b.sock every 8 connection(s)
W20260928 23:52:47.420677 32511 negotiation.cc:266] Injecting 500ms delay in negotiation
I20260928 23:52:47.470328 32230 rpc-test-base.h:595] status: Timed out: connection negotiation to unix:/tmp/dist-test-taskGzk9m1/test-tmp/rpc-test-b4ca862a1b06457cbab9d01998f5772b.sock for RPC Sleep timed out after 0.050s (ON_OUTBOUND_QUEUE), seconds elapsed: 0.0505673
W20260928 23:52:47.932588 32512 connection.cc:196] Error closing socket: Network error: TlsSocket::Close: Broken pipe
[       OK ] Parameters/TestRpc.TestCallTimeoutDoesntAffectNegotiation/SSL_UnixSocket (556 ms)
[ RUN      ] Parameters/TestRpc.TestRpcHandlerLatencyMetric/SSL_UnixSocket
I20260928 23:52:47.957293 32540 acceptor_pool.cc:254] collecting diagnostics on the listening RPC socket unix:/tmp/dist-test-taskGzk9m1/test-tmp/rpc-test-0337a17fe89b4cca8dfac8f2abfa0164.sock every 8 connection(s)
I20260928 23:52:47.958048 32541 acceptor_pool.cc:254] collecting diagnostics on the listening RPC socket unix:/tmp/dist-test-taskGzk9m1/test-tmp/rpc-test-0337a17fe89b4cca8dfac8f2abfa0164.sock every 8 connection(s)
I20260928 23:52:48.024509 32230 rpc-test.cc:1236] Sleep() min lat: 21720
I20260928 23:52:48.024695 32230 rpc-test.cc:1237] Sleep() mean lat: 21720
I20260928 23:52:48.024819 32230 rpc-test.cc:1238] Sleep() max lat: 21720
I20260928 23:52:48.024952 32230 rpc-test.cc:1239] Sleep() #calls: 1
[       OK ] Parameters/TestRpc.TestRpcHandlerLatencyMetric/SSL_UnixSocket (95 ms)
[ RUN      ] Parameters/TestRpc.TimedOutOnResponseMetricServiceQueue/SSL_UnixSocket
I20260928 23:52:48.062191 32566 acceptor_pool.cc:254] collecting diagnostics on the listening RPC socket unix:/tmp/dist-test-taskGzk9m1/test-tmp/rpc-test-5ef02a39362c4100a0c2707d642bc9f1.sock every 8 connection(s)
I20260928 23:52:48.062940 32567 acceptor_pool.cc:254] collecting diagnostics on the listening RPC socket unix:/tmp/dist-test-taskGzk9m1/test-tmp/rpc-test-5ef02a39362c4100a0c2707d642bc9f1.sock every 8 connection(s)
W20260928 23:52:48.127800 32568 rpcz_store.cc:267] Call kudu.rpc_test.CalculatorService.Sleep from unix:<unnamed> (request call id 2) took 20 ms (client timeout 20 ms). Trace:
W20260928 23:52:48.128206 32568 rpcz_store.cc:269] 0928 23:52:48.107370 (+     0us) service_pool.cc:170] Inserting onto call queue
0928 23:52:48.127641 (+ 20271us) service_pool.cc:214] Skipping call since client already timed out
0928 23:52:48.127716 (+    75us) inbound_call.cc:173] Queueing failure response
Metrics: {}
W20260928 23:52:48.130635 32563 connection.cc:196] Error closing socket: Network error: TlsSocket::Close: Broken pipe
[       OK ] Parameters/TestRpc.TimedOutOnResponseMetricServiceQueue/SSL_UnixSocket (102 ms)
[ RUN      ] Parameters/TestRpc.RpcPendingConnectionsMetric/SSL_UnixSocket
I20260928 23:52:48.145182 32589 acceptor_pool.cc:254] collecting diagnostics on the listening RPC socket 0.0.0.0:41421 every 8 connection(s)
I20260928 23:52:48.145939 32590 acceptor_pool.cc:254] collecting diagnostics on the listening RPC socket 0.0.0.0:41421 every 8 connection(s)
W20260928 23:52:48.150876 32585 negotiation.cc:337] Failed RPC negotiation. Trace:
0928 23:52:48.149684 (+     0us) reactor.cc:625] Submitting negotiation task for server connection from 127.0.0.1:47120 (local address 127.0.0.1:41421)
0928 23:52:48.150102 (+   418us) server_negotiation.cc:206] Beginning negotiation
0928 23:52:48.150119 (+    17us) server_negotiation.cc:399] Waiting for connection header
0928 23:52:48.150344 (+   225us) negotiation.cc:327] Negotiation complete: Network error: Server connection negotiation failed: server connection from 127.0.0.1:47120: BlockingRecv error: recv got EOF from 127.0.0.1:47120 (error 108)
Metrics: {"server-negotiator.queue_time_us":104}
[       OK ] Parameters/TestRpc.RpcPendingConnectionsMetric/SSL_UnixSocket (29 ms)
[ RUN      ] Parameters/TestRpc.TestRpcContextClientDeadline/SSL_UnixSocket
I20260928 23:52:48.202584 32605 acceptor_pool.cc:254] collecting diagnostics on the listening RPC socket unix:/tmp/dist-test-taskGzk9m1/test-tmp/rpc-test-8102d0f2f33a4835a3adf39707b7e1fc.sock every 8 connection(s)
I20260928 23:52:48.203353 32606 acceptor_pool.cc:254] collecting diagnostics on the listening RPC socket unix:/tmp/dist-test-taskGzk9m1/test-tmp/rpc-test-8102d0f2f33a4835a3adf39707b7e1fc.sock every 8 connection(s)
[       OK ] Parameters/TestRpc.TestRpcContextClientDeadline/SSL_UnixSocket (107 ms)
[ RUN      ] Parameters/TestRpc.TestApplicationFeatureFlagUnsupportedServer/SSL_UnixSocket
I20260928 23:52:48.320120 32630 acceptor_pool.cc:254] collecting diagnostics on the listening RPC socket unix:/tmp/dist-test-taskGzk9m1/test-tmp/rpc-test-a302d725d6dc40a78e22f0aeeb2ff83b.sock every 8 connection(s)
I20260928 23:52:48.320849 32631 acceptor_pool.cc:254] collecting diagnostics on the listening RPC socket unix:/tmp/dist-test-taskGzk9m1/test-tmp/rpc-test-a302d725d6dc40a78e22f0aeeb2ff83b.sock every 8 connection(s)
W20260928 23:52:48.351442 32627 connection.cc:196] Error closing socket: Network error: TlsSocket::Close: Broken pipe
[       OK ] Parameters/TestRpc.TestApplicationFeatureFlagUnsupportedServer/SSL_UnixSocket (84 ms)
[ RUN      ] Parameters/TestRpc.TestCancellationAsync/SSL_UnixSocket
I20260928 23:52:48.375603 32655 acceptor_pool.cc:254] collecting diagnostics on the listening RPC socket unix:/tmp/dist-test-taskGzk9m1/test-tmp/rpc-test-c2590b219edb4d7db413b5d9da69003a.sock every 8 connection(s)
I20260928 23:52:48.376299 32656 acceptor_pool.cc:254] collecting diagnostics on the listening RPC socket unix:/tmp/dist-test-taskGzk9m1/test-tmp/rpc-test-c2590b219edb4d7db413b5d9da69003a.sock every 8 connection(s)
I20260928 23:52:48.379462 32230 rpc-test.cc:1716] Connecting to unix:/tmp/dist-test-taskGzk9m1/test-tmp/rpc-test-c2590b219edb4d7db413b5d9da69003a.sock
I20260928 23:52:48.403705 32230 test_util.cc:268] Using random seed: -1016775454
I20260928 23:52:48.625607 32659 rpc-test-base.h:240] got call: sleep_micros: 500 pattern: 4294967295 num_repetitions: 2097152 sidecar_idx: 0
I20260928 23:52:48.849009 32658 rpc-test-base.h:240] got call: sleep_micros: 500 pattern: 4294967295 num_repetitions: 2097152 sidecar_idx: 0
I20260928 23:52:49.087205 32658 rpc-test-base.h:240] got call: sleep_micros: 500 pattern: 4294967295 num_repetitions: 2097152 sidecar_idx: 0
I20260928 23:52:49.278021 32659 rpc-test-base.h:240] got call: sleep_micros: 500 pattern: 4294967295 num_repetitions: 2097152 sidecar_idx: 0
I20260928 23:52:49.507640 32659 rpc-test-base.h:240] got call: sleep_micros: 500 pattern: 4294967295 num_repetitions: 2097152 sidecar_idx: 0
I20260928 23:52:49.729053 32659 rpc-test-base.h:240] got call: sleep_micros: 500 pattern: 4294967295 num_repetitions: 2097152 sidecar_idx: 0
I20260928 23:52:49.934185 32658 rpc-test-base.h:240] got call: sleep_micros: 500 pattern: 4294967295 num_repetitions: 2097152 sidecar_idx: 0
I20260928 23:52:50.161013 32658 rpc-test-base.h:240] got call: sleep_micros: 500 pattern: 4294967295 num_repetitions: 2097152 sidecar_idx: 0
I20260928 23:52:50.394593 32658 rpc-test-base.h:240] got call: sleep_micros: 500 pattern: 4294967295 num_repetitions: 2097152 sidecar_idx: 0
W20260928 23:52:50.538899 32652 connection.cc:441] server connection from unix:<unnamed> torn down before Call kudu.rpc.GenericCalculatorService.SleepWithSidecar from unix:<unnamed> (request call id 9) could send its response
[       OK ] Parameters/TestRpc.TestCancellationAsync/SSL_UnixSocket (2192 ms)
[ RUN      ] Parameters/TestRpc.TestPerformanceBySocketType/SSL_UnixSocket
I20260928 23:52:50.633972 32680 acceptor_pool.cc:254] collecting diagnostics on the listening RPC socket unix:/tmp/dist-test-taskGzk9m1/test-tmp/rpc-test-a08c394233304c97a0575c8087421636.sock every 8 connection(s)
I20260928 23:52:50.634690 32681 acceptor_pool.cc:254] collecting diagnostics on the listening RPC socket unix:/tmp/dist-test-taskGzk9m1/test-tmp/rpc-test-a08c394233304c97a0575c8087421636.sock every 8 connection(s)
I20260928 23:52:50.637729 32230 rpc-test.cc:1846] Connecting to unix:/tmp/dist-test-taskGzk9m1/test-tmp/rpc-test-a08c394233304c97a0575c8087421636.sock
I20260928 23:53:12.321558 32230 rpc-test.cc:1859] Sending 1024MB via ssl-enabled unix socket: real 21.659s	user 19.451s	sys 12.854s
I20260928 23:53:33.925375 32230 rpc-test.cc:1859] Sending 1024MB via ssl-enabled unix socket: real 21.603s	user 19.269s	sys 12.834s
I20260928 23:53:55.680999 32230 rpc-test.cc:1859] Sending 1024MB via ssl-enabled unix socket: real 21.755s	user 19.542s	sys 13.001s
I20260928 23:54:17.356576 32230 rpc-test.cc:1859] Sending 1024MB via ssl-enabled unix socket: real 21.675s	user 18.915s	sys 13.387s
I20260928 23:54:39.081199 32230 rpc-test.cc:1859] Sending 1024MB via ssl-enabled unix socket: real 21.724s	user 19.722s	sys 12.739s
[       OK ] Parameters/TestRpc.TestPerformanceBySocketType/SSL_UnixSocket (108550 ms)
[----------] 20 tests from Parameters/TestRpc (273958 ms total)

[----------] 1 test from Parameters/TestRpcSocketTxRxQueue
[ RUN      ] Parameters/TestRpcSocketTxRxQueue.AcceptorRxQueueSizeMetric/0
I20260928 23:54:39.116156 32716 acceptor_pool.cc:254] collecting diagnostics on the listening RPC socket 0.0.0.0:38093 every 1 connection(s)
I20260928 23:54:39.116966 32717 acceptor_pool.cc:254] collecting diagnostics on the listening RPC socket 0.0.0.0:38093 every 1 connection(s)
W20260928 23:54:39.122470 32712 negotiation.cc:337] Failed RPC negotiation. Trace:
0928 23:54:39.120823 (+     0us) reactor.cc:625] Submitting negotiation task for server connection from 127.0.0.1:52200 (local address 127.0.0.1:38093)
0928 23:54:39.121287 (+   464us) server_negotiation.cc:206] Beginning negotiation
0928 23:54:39.121311 (+    24us) server_negotiation.cc:399] Waiting for connection header
0928 23:54:39.121551 (+   240us) negotiation.cc:327] Negotiation complete: Network error: Server connection negotiation failed: server connection from 127.0.0.1:52200: BlockingRecv error: recv got EOF from 127.0.0.1:52200 (error 108)
Metrics: {"server-negotiator.queue_time_us":124}
[       OK ] Parameters/TestRpcSocketTxRxQueue.AcceptorRxQueueSizeMetric/0 (29 ms)
[----------] 1 test from Parameters/TestRpcSocketTxRxQueue (29 ms total)

[----------] Global test environment tear-down
[==========] 21 tests from 2 test suites ran. (273988 ms total)
[  PASSED  ] 20 tests.
[  FAILED  ] 1 test, listed below:
[  FAILED  ] Parameters/TestRpc.TestCallWithChainCertAndChainCA/SSL_UnixSocket, where GetParam() = (true, true)

 1 FAILED TEST