Diagnosed failure

Parameters/TestRpc.TestCallWithChainCertAndChainCA/SSL_UnixSocket: /data0/somelongdirectorytoavoidrpathissues/src/kudu/src/kudu/rpc/rpc-test.cc:270: Failure
Failed
Bad status: Runtime error: could not verify certificate chain (error with cert: subject=CN = localhost, ST = sadfjas, C = AS, emailAddress = sdflkdsajf, O = lskdfjlsad, OU = sldfkja, issuer=C = AS, ST = ASDfkjdhf, L = lskdjf, O = saldfja, OU = skdjf, CN = localhost, emailAddress = sadjflkadsj): : certificate has expired
Google Test trace:
/data0/somelongdirectorytoavoidrpathissues/src/kudu/src/kudu/rpc/rpc-test.cc:267: Connecting to unix:/tmp/dist-test-taskFlwhiE/test-tmp/rpc-test-ed4e04e2ae884408b3d22ba3535fdf1f.sock
I20260925 17:52:20.467793   379 test_util.cc:175] -----------------------------------------------
I20260925 17:52:20.467880   379 test_util.cc:176] Had fatal failures, leaving test files at /tmp/dist-test-taskFlwhiE/test-tmp/rpc-test.6.Parameters_TestRpc.TestCallWithChainCertAndChainCA_SSL_UnixSocket.1790358740365914-379-0

Full log

Note: This is test shard 7 of 8.
[==========] Running 21 tests from 2 test suites.
[----------] Global test environment set-up.
[----------] 20 tests from Parameters/TestRpc
[ RUN      ] Parameters/TestRpc.TestMessengerCreateDestroy/SSL_UnixSocket
WARNING: Logging before InitGoogleLogging() is written to STDERR
I20260925 17:52:20.409085   379 rpc-test.cc:169] started messenger TestCreateDestroy
[       OK ] Parameters/TestRpc.TestMessengerCreateDestroy/SSL_UnixSocket (27 ms)
[ RUN      ] Parameters/TestRpc.TestNegotiationDeadlock/SSL_UnixSocket
I20260925 17:52:20.425035   399 acceptor_pool.cc:254] collecting diagnostics on the listening RPC socket unix:/tmp/dist-test-taskFlwhiE/test-tmp/rpc-test-cf86b0da213d4ffe8fb9394d9f3d7aa8.sock every 8 connection(s)
I20260925 17:52:20.425349   400 acceptor_pool.cc:254] collecting diagnostics on the listening RPC socket unix:/tmp/dist-test-taskFlwhiE/test-tmp/rpc-test-cf86b0da213d4ffe8fb9394d9f3d7aa8.sock every 8 connection(s)
[       OK ] Parameters/TestRpc.TestNegotiationDeadlock/SSL_UnixSocket (31 ms)
[ RUN      ] Parameters/TestRpc.TestCallWithChainCertAndChainCA/SSL_UnixSocket
I20260925 17:52:20.457590   415 acceptor_pool.cc:254] collecting diagnostics on the listening RPC socket unix:/tmp/dist-test-taskFlwhiE/test-tmp/rpc-test-ed4e04e2ae884408b3d22ba3535fdf1f.sock every 8 connection(s)
I20260925 17:52:20.457883   416 acceptor_pool.cc:254] collecting diagnostics on the listening RPC socket unix:/tmp/dist-test-taskFlwhiE/test-tmp/rpc-test-ed4e04e2ae884408b3d22ba3535fdf1f.sock every 8 connection(s)
/data0/somelongdirectorytoavoidrpathissues/src/kudu/src/kudu/rpc/rpc-test.cc:270: Failure
Failed
Bad status: Runtime error: could not verify certificate chain (error with cert: subject=CN = localhost, ST = sadfjas, C = AS, emailAddress = sdflkdsajf, O = lskdfjlsad, OU = sldfkja, issuer=C = AS, ST = ASDfkjdhf, L = lskdjf, O = saldfja, OU = skdjf, CN = localhost, emailAddress = sadjflkadsj): : certificate has expired
Google Test trace:
/data0/somelongdirectorytoavoidrpathissues/src/kudu/src/kudu/rpc/rpc-test.cc:267: Connecting to unix:/tmp/dist-test-taskFlwhiE/test-tmp/rpc-test-ed4e04e2ae884408b3d22ba3535fdf1f.sock
I20260925 17:52:20.467793   379 test_util.cc:175] -----------------------------------------------
I20260925 17:52:20.467880   379 test_util.cc:176] Had fatal failures, leaving test files at /tmp/dist-test-taskFlwhiE/test-tmp/rpc-test.6.Parameters_TestRpc.TestCallWithChainCertAndChainCA_SSL_UnixSocket.1790358740365914-379-0
[  FAILED  ] Parameters/TestRpc.TestCallWithChainCertAndChainCA/SSL_UnixSocket, where GetParam() = (true, true) (24 ms)
[ RUN      ] Parameters/TestRpc.TestCallWithPasswordProtectedKey/SSL_UnixSocket
I20260925 17:52:20.482864   440 acceptor_pool.cc:254] collecting diagnostics on the listening RPC socket unix:/tmp/dist-test-taskFlwhiE/test-tmp/rpc-test-c85993cc13f54cb4a5336f0a95fa636d.sock every 8 connection(s)
I20260925 17:52:20.483076   441 acceptor_pool.cc:254] collecting diagnostics on the listening RPC socket unix:/tmp/dist-test-taskFlwhiE/test-tmp/rpc-test-c85993cc13f54cb4a5336f0a95fa636d.sock every 8 connection(s)
W20260925 17:52:20.511528   437 connection.cc:196] Error closing socket: Network error: TlsSocket::Close: Broken pipe
[       OK ] Parameters/TestRpc.TestCallWithPasswordProtectedKey/SSL_UnixSocket (47 ms)
[ RUN      ] Parameters/TestRpc.TestCallToBadServer/SSL_UnixSocket
I20260925 17:52:20.534936   379 rpc-test.cc:394] Status: Network error: Client connection negotiation failed: client connection to 0.0.0.0:0: connect: Connection refused (error 111)
I20260925 17:52:20.535737   379 rpc-test.cc:394] Status: Network error: Client connection negotiation failed: client connection to 0.0.0.0:0: connect: Connection refused (error 111)
I20260925 17:52:20.536448   379 rpc-test.cc:394] Status: Network error: Client connection negotiation failed: client connection to 0.0.0.0:0: connect: Connection refused (error 111)
I20260925 17:52:20.537055   379 rpc-test.cc:394] Status: Network error: Client connection negotiation failed: client connection to 0.0.0.0:0: connect: Connection refused (error 111)
I20260925 17:52:20.537621   379 rpc-test.cc:394] Status: Network error: Client connection negotiation failed: client connection to 0.0.0.0:0: connect: Connection refused (error 111)
[       OK ] Parameters/TestRpc.TestCallToBadServer/SSL_UnixSocket (24 ms)
[ RUN      ] Parameters/TestRpc.TestWrongService/SSL_UnixSocket
I20260925 17:52:20.556845   475 acceptor_pool.cc:254] collecting diagnostics on the listening RPC socket unix:/tmp/dist-test-taskFlwhiE/test-tmp/rpc-test-7268330bd7b44c3ca134d2cbbce13f00.sock every 8 connection(s)
I20260925 17:52:20.557093   476 acceptor_pool.cc:254] collecting diagnostics on the listening RPC socket unix:/tmp/dist-test-taskFlwhiE/test-tmp/rpc-test-7268330bd7b44c3ca134d2cbbce13f00.sock every 8 connection(s)
I20260925 17:52:20.579742   472 messenger.cc:345] service WrongServiceName not registered on TestServer
W20260925 17:52:20.581465   472 connection.cc:196] Error closing socket: Network error: TlsSocket::Close: Broken pipe
[       OK ] Parameters/TestRpc.TestWrongService/SSL_UnixSocket (44 ms)
[ RUN      ] Parameters/TestRpc.TestConnectionKeepalive/SSL_UnixSocket
I20260925 17:52:20.595440   498 acceptor_pool.cc:254] collecting diagnostics on the listening RPC socket unix:/tmp/dist-test-taskFlwhiE/test-tmp/rpc-test-9ca73879ad034bf1908493bf6e4252dc.sock every 8 connection(s)
I20260925 17:52:20.595656   499 acceptor_pool.cc:254] collecting diagnostics on the listening RPC socket unix:/tmp/dist-test-taskFlwhiE/test-tmp/rpc-test-9ca73879ad034bf1908493bf6e4252dc.sock every 8 connection(s)
I20260925 17:52:20.596463   379 rpc-test.cc:488] Connecting to unix:/tmp/dist-test-taskFlwhiE/test-tmp/rpc-test-9ca73879ad034bf1908493bf6e4252dc.sock
W20260925 17:52:21.087031   511 connection.cc:196] Error closing socket: Network error: TlsSocket::Close: Broken pipe
[       OK ] Parameters/TestRpc.TestConnectionKeepalive/SSL_UnixSocket (1055 ms)
[ RUN      ] Parameters/TestRpc.TestClientConnectionMetrics/SSL_UnixSocket
I20260925 17:52:21.656689   523 acceptor_pool.cc:254] collecting diagnostics on the listening RPC socket unix:/tmp/dist-test-taskFlwhiE/test-tmp/rpc-test-e2a0910c69534b2d8fc3dcac576ad97e.sock every 8 connection(s)
I20260925 17:52:21.656879   524 acceptor_pool.cc:254] collecting diagnostics on the listening RPC socket unix:/tmp/dist-test-taskFlwhiE/test-tmp/rpc-test-e2a0910c69534b2d8fc3dcac576ad97e.sock every 8 connection(s)
I20260925 17:52:21.657755   379 rpc-test.cc:569] Connecting to unix:/tmp/dist-test-taskFlwhiE/test-tmp/rpc-test-e2a0910c69534b2d8fc3dcac576ad97e.sock
W20260925 17:52:41.505340   520 connection.cc:196] Error closing socket: Network error: TlsSocket::Close: Broken pipe
[       OK ] Parameters/TestRpc.TestClientConnectionMetrics/SSL_UnixSocket (19870 ms)
[ RUN      ] Parameters/TestRpc.TestCredentialsPolicy/SSL_UnixSocket
I20260925 17:52:41.522511   546 acceptor_pool.cc:254] collecting diagnostics on the listening RPC socket unix:/tmp/dist-test-taskFlwhiE/test-tmp/rpc-test-c9d576df462446eca855c93fce09c4c2.sock every 8 connection(s)
I20260925 17:52:41.522742   547 acceptor_pool.cc:254] collecting diagnostics on the listening RPC socket unix:/tmp/dist-test-taskFlwhiE/test-tmp/rpc-test-c9d576df462446eca855c93fce09c4c2.sock every 8 connection(s)
I20260925 17:52:41.523626   379 rpc-test.cc:700] Connecting to unix:/tmp/dist-test-taskFlwhiE/test-tmp/rpc-test-c9d576df462446eca855c93fce09c4c2.sock
W20260925 17:52:41.558802   545 connection.cc:196] Error closing socket: Network error: TlsSocket::Close: Broken pipe
W20260925 17:52:41.565434   545 connection.cc:196] Error closing socket: Network error: TlsSocket::Close: Broken pipe
[       OK ] Parameters/TestRpc.TestCredentialsPolicy/SSL_UnixSocket (57 ms)
[ RUN      ] Parameters/TestRpc.TestCallLongerThanKeepalive/SSL_UnixSocket
I20260925 17:52:41.592384   571 acceptor_pool.cc:254] collecting diagnostics on the listening RPC socket unix:/tmp/dist-test-taskFlwhiE/test-tmp/rpc-test-17f8f3cbb63d42aea6d4f588a7d852d8.sock every 8 connection(s)
I20260925 17:52:41.592618   572 acceptor_pool.cc:254] collecting diagnostics on the listening RPC socket unix:/tmp/dist-test-taskFlwhiE/test-tmp/rpc-test-17f8f3cbb63d42aea6d4f588a7d852d8.sock every 8 connection(s)
I20260925 17:52:41.609829   575 rpc-test-base.h:222] got call: sleep_micros: 3000000 deferred: true
I20260925 17:52:44.611459   575 rpcz_store.cc:275] Call kudu.rpc.GenericCalculatorService.Sleep from unix:<unnamed> (request call id 0) took 3001 ms. Trace:
I20260925 17:52:44.611615   575 rpcz_store.cc:276] 0925 17:52:41.609720 (+     0us) service_pool.cc:170] Inserting onto call queue
0925 17:52:41.609785 (+    65us) service_pool.cc:227] Handling call
0925 17:52:44.611419 (+3001634us) inbound_call.cc:173] Queueing success response
Metrics: {}
[       OK ] Parameters/TestRpc.TestCallLongerThanKeepalive/SSL_UnixSocket (3049 ms)
[ RUN      ] Parameters/TestRpc.TestRpcSidecar/SSL_UnixSocket
I20260925 17:52:44.643921   596 acceptor_pool.cc:254] collecting diagnostics on the listening RPC socket unix:/tmp/dist-test-taskFlwhiE/test-tmp/rpc-test-207c828a75a940a38ce61ddec51ca1dc.sock every 8 connection(s)
I20260925 17:52:44.644162   597 acceptor_pool.cc:254] collecting diagnostics on the listening RPC socket unix:/tmp/dist-test-taskFlwhiE/test-tmp/rpc-test-207c828a75a940a38ce61ddec51ca1dc.sock every 8 connection(s)
W20260925 17:52:44.747717   593 connection.cc:196] Error closing socket: Network error: TlsSocket::Close: Broken pipe
[       OK ] Parameters/TestRpc.TestRpcSidecar/SSL_UnixSocket (133 ms)
[ RUN      ] Parameters/TestRpc.TestRpcSidecarLimits/SSL_UnixSocket
I20260925 17:52:46.804080   621 acceptor_pool.cc:254] collecting diagnostics on the listening RPC socket unix:/tmp/dist-test-taskFlwhiE/test-tmp/rpc-test-594086435b604f2b9f7f6aa74875d295.sock every 8 connection(s)
I20260925 17:52:46.804327   622 acceptor_pool.cc:254] collecting diagnostics on the listening RPC socket unix:/tmp/dist-test-taskFlwhiE/test-tmp/rpc-test-594086435b604f2b9f7f6aa74875d295.sock every 8 connection(s)
W20260925 17:52:46.831360   379 serialization.cc:72] Serialized kudu.rpc_test.PushStringsRequestPB (2147483654 bytes) is larger than the maximum configured RPC message size (52428800 bytes). Sending anyway, but peer may reject the data.
W20260925 17:52:46.837216   618 connection.cc:535] server connection from unix:<unnamed> recv error: Network error: RPC frame had a length of 2147483714, but we only support messages up to 52428800 bytes long.
W20260925 17:52:46.837330   618 connection.cc:158] shutting down server connection from unix:<unnamed> with pending inbound data: 4/2147483714 bytes received; last active 0 ns ago: status Network error: RPC frame had a length of 2147483714, but we only support messages up to 52428800 bytes long.
W20260925 17:52:46.837618   634 connection.cc:698] client connection to unix:/tmp/dist-test-taskFlwhiE/test-tmp/rpc-test-594086435b604f2b9f7f6aa74875d295.sock send error: Network error: failed to write to TLS socket: Broken pipe
W20260925 17:52:46.837882   634 connection.cc:196] Error closing socket: Network error: TlsSocket::Close: Success
I20260925 17:52:46.855038   646 acceptor_pool.cc:254] collecting diagnostics on the listening RPC socket unix:/tmp/dist-test-taskFlwhiE/test-tmp/rpc-test-594086435b604f2b9f7f6aa74875d295.sock every 8 connection(s)
I20260925 17:52:46.855183   647 acceptor_pool.cc:254] collecting diagnostics on the listening RPC socket unix:/tmp/dist-test-taskFlwhiE/test-tmp/rpc-test-594086435b604f2b9f7f6aa74875d295.sock every 8 connection(s)
W20260925 17:52:52.369429   643 connection.cc:577] server connection from unix:<unnamed>: received bad data: 'Corruption: Invalid packet: message had a length of 2147483710, but we only support messages up to 2147483647 bytes
'
W20260925 17:52:52.370085   659 connection.cc:196] Error closing socket: Network error: TlsSocket::Close: Broken pipe
[       OK ] Parameters/TestRpc.TestRpcSidecarLimits/SSL_UnixSocket (8027 ms)
[ RUN      ] Parameters/TestRpc.TestCallTimeoutDoesntAffectNegotiation/SSL_UnixSocket
I20260925 17:52:52.800417   671 acceptor_pool.cc:254] collecting diagnostics on the listening RPC socket unix:/tmp/dist-test-taskFlwhiE/test-tmp/rpc-test-4e3b7fc55f994e5cb8f94e3845717340.sock every 8 connection(s)
I20260925 17:52:52.800652   672 acceptor_pool.cc:254] collecting diagnostics on the listening RPC socket unix:/tmp/dist-test-taskFlwhiE/test-tmp/rpc-test-4e3b7fc55f994e5cb8f94e3845717340.sock every 8 connection(s)
W20260925 17:52:52.820510   667 negotiation.cc:266] Injecting 500ms delay in negotiation
I20260925 17:52:52.870995   379 rpc-test-base.h:595] status: Timed out: connection negotiation to unix:/tmp/dist-test-taskFlwhiE/test-tmp/rpc-test-4e3b7fc55f994e5cb8f94e3845717340.sock for RPC Sleep timed out after 0.050s (ON_OUTBOUND_QUEUE), seconds elapsed: 0.0510194
W20260925 17:52:53.327602   668 connection.cc:196] Error closing socket: Network error: TlsSocket::Close: Broken pipe
[       OK ] Parameters/TestRpc.TestCallTimeoutDoesntAffectNegotiation/SSL_UnixSocket (551 ms)
[ RUN      ] Parameters/TestRpc.TestRpcHandlerLatencyMetric/SSL_UnixSocket
I20260925 17:52:53.348335   696 acceptor_pool.cc:254] collecting diagnostics on the listening RPC socket unix:/tmp/dist-test-taskFlwhiE/test-tmp/rpc-test-0d1ea0f96f3d4ef995ae984e45a38dd8.sock every 8 connection(s)
I20260925 17:52:53.348534   697 acceptor_pool.cc:254] collecting diagnostics on the listening RPC socket unix:/tmp/dist-test-taskFlwhiE/test-tmp/rpc-test-0d1ea0f96f3d4ef995ae984e45a38dd8.sock every 8 connection(s)
I20260925 17:52:53.395339   379 rpc-test.cc:1236] Sleep() min lat: 20637
I20260925 17:52:53.395438   379 rpc-test.cc:1237] Sleep() mean lat: 20637
I20260925 17:52:53.395478   379 rpc-test.cc:1238] Sleep() max lat: 20637
I20260925 17:52:53.395495   379 rpc-test.cc:1239] Sleep() #calls: 1
[       OK ] Parameters/TestRpc.TestRpcHandlerLatencyMetric/SSL_UnixSocket (69 ms)
[ RUN      ] Parameters/TestRpc.TimedOutOnResponseMetricServiceQueue/SSL_UnixSocket
I20260925 17:52:53.430389   722 acceptor_pool.cc:254] collecting diagnostics on the listening RPC socket unix:/tmp/dist-test-taskFlwhiE/test-tmp/rpc-test-cf7735dc444b4e60aad884c11a54908e.sock every 8 connection(s)
I20260925 17:52:53.430588   723 acceptor_pool.cc:254] collecting diagnostics on the listening RPC socket unix:/tmp/dist-test-taskFlwhiE/test-tmp/rpc-test-cf7735dc444b4e60aad884c11a54908e.sock every 8 connection(s)
W20260925 17:52:53.504345   724 rpcz_store.cc:267] Call kudu.rpc_test.CalculatorService.Sleep from unix:<unnamed> (request call id 2) took 20 ms (client timeout 20 ms). Trace:
W20260925 17:52:53.504504   724 rpcz_store.cc:269] 0925 17:52:53.483870 (+     0us) service_pool.cc:170] Inserting onto call queue
0925 17:52:53.504257 (+ 20387us) service_pool.cc:214] Skipping call since client already timed out
0925 17:52:53.504323 (+    66us) inbound_call.cc:173] Queueing failure response
Metrics: {}
[       OK ] Parameters/TestRpc.TimedOutOnResponseMetricServiceQueue/SSL_UnixSocket (108 ms)
[ RUN      ] Parameters/TestRpc.RpcPendingConnectionsMetric/SSL_UnixSocket
I20260925 17:52:53.512876   745 acceptor_pool.cc:254] collecting diagnostics on the listening RPC socket 0.0.0.0:35645 every 8 connection(s)
I20260925 17:52:53.513060   746 acceptor_pool.cc:254] collecting diagnostics on the listening RPC socket 0.0.0.0:35645 every 8 connection(s)
W20260925 17:52:53.522743   741 negotiation.cc:337] Failed RPC negotiation. Trace:
0925 17:52:53.521489 (+     0us) reactor.cc:625] Submitting negotiation task for server connection from 127.0.0.1:36198 (local address 127.0.0.1:35645)
0925 17:52:53.522157 (+   668us) server_negotiation.cc:206] Beginning negotiation
0925 17:52:53.522163 (+     6us) server_negotiation.cc:399] Waiting for connection header
0925 17:52:53.522330 (+   167us) negotiation.cc:327] Negotiation complete: Network error: Server connection negotiation failed: server connection from 127.0.0.1:36198: BlockingRecv error: recv got EOF from 127.0.0.1:36198 (error 108)
Metrics: {"server-negotiator.queue_time_us":518}
[       OK ] Parameters/TestRpc.RpcPendingConnectionsMetric/SSL_UnixSocket (25 ms)
[ RUN      ] Parameters/TestRpc.TestRpcContextClientDeadline/SSL_UnixSocket
I20260925 17:52:53.546098   761 acceptor_pool.cc:254] collecting diagnostics on the listening RPC socket unix:/tmp/dist-test-taskFlwhiE/test-tmp/rpc-test-13abbdbd43144a80b73d6880cf4a6af8.sock every 8 connection(s)
I20260925 17:52:53.546303   762 acceptor_pool.cc:254] collecting diagnostics on the listening RPC socket unix:/tmp/dist-test-taskFlwhiE/test-tmp/rpc-test-13abbdbd43144a80b73d6880cf4a6af8.sock every 8 connection(s)
[       OK ] Parameters/TestRpc.TestRpcContextClientDeadline/SSL_UnixSocket (51 ms)
[ RUN      ] Parameters/TestRpc.TestApplicationFeatureFlagUnsupportedServer/SSL_UnixSocket
I20260925 17:52:53.607652   786 acceptor_pool.cc:254] collecting diagnostics on the listening RPC socket unix:/tmp/dist-test-taskFlwhiE/test-tmp/rpc-test-fc8d7a4f71904ee181821a73e0bfa03b.sock every 8 connection(s)
I20260925 17:52:53.607834   787 acceptor_pool.cc:254] collecting diagnostics on the listening RPC socket unix:/tmp/dist-test-taskFlwhiE/test-tmp/rpc-test-fc8d7a4f71904ee181821a73e0bfa03b.sock every 8 connection(s)
[       OK ] Parameters/TestRpc.TestApplicationFeatureFlagUnsupportedServer/SSL_UnixSocket (48 ms)
[ RUN      ] Parameters/TestRpc.TestCancellationAsync/SSL_UnixSocket
I20260925 17:52:53.648224   811 acceptor_pool.cc:254] collecting diagnostics on the listening RPC socket unix:/tmp/dist-test-taskFlwhiE/test-tmp/rpc-test-a480d996e9e047aa974698f161c653ef.sock every 8 connection(s)
I20260925 17:52:53.648386   812 acceptor_pool.cc:254] collecting diagnostics on the listening RPC socket unix:/tmp/dist-test-taskFlwhiE/test-tmp/rpc-test-a480d996e9e047aa974698f161c653ef.sock every 8 connection(s)
I20260925 17:52:53.649286   379 rpc-test.cc:1716] Connecting to unix:/tmp/dist-test-taskFlwhiE/test-tmp/rpc-test-a480d996e9e047aa974698f161c653ef.sock
I20260925 17:52:53.682117   379 test_util.cc:268] Using random seed: 1656344498
I20260925 17:52:53.716354   815 rpc-test-base.h:240] got call: sleep_micros: 500 pattern: 4294967295 num_repetitions: 2097152 sidecar_idx: 0
I20260925 17:52:53.743410   814 rpc-test-base.h:240] got call: sleep_micros: 500 pattern: 4294967295 num_repetitions: 2097152 sidecar_idx: 0
I20260925 17:52:53.771097   815 rpc-test-base.h:240] got call: sleep_micros: 500 pattern: 4294967295 num_repetitions: 2097152 sidecar_idx: 0
I20260925 17:52:53.799820   814 rpc-test-base.h:240] got call: sleep_micros: 500 pattern: 4294967295 num_repetitions: 2097152 sidecar_idx: 0
I20260925 17:52:53.828693   815 rpc-test-base.h:240] got call: sleep_micros: 500 pattern: 4294967295 num_repetitions: 2097152 sidecar_idx: 0
I20260925 17:52:53.857554   814 rpc-test-base.h:240] got call: sleep_micros: 500 pattern: 4294967295 num_repetitions: 2097152 sidecar_idx: 0
I20260925 17:52:53.886332   815 rpc-test-base.h:240] got call: sleep_micros: 500 pattern: 4294967295 num_repetitions: 2097152 sidecar_idx: 0
W20260925 17:52:53.888513   808 connection.cc:196] Error closing socket: Network error: TlsSocket::Close: Broken pipe
W20260925 17:52:53.921924   808 connection.cc:441] server connection from unix:<unnamed> torn down before Call kudu.rpc.GenericCalculatorService.SleepWithSidecar from unix:<unnamed> (request call id 8) could send its response
W20260925 17:52:53.936383   808 connection.cc:441] server connection from unix:<unnamed> torn down before Call kudu.rpc.GenericCalculatorService.SleepWithSidecar from unix:<unnamed> (request call id 9) could send its response
[       OK ] Parameters/TestRpc.TestCancellationAsync/SSL_UnixSocket (304 ms)
[ RUN      ] Parameters/TestRpc.TestPerformanceBySocketType/SSL_UnixSocket
I20260925 17:52:53.972607   836 acceptor_pool.cc:254] collecting diagnostics on the listening RPC socket unix:/tmp/dist-test-taskFlwhiE/test-tmp/rpc-test-a5401f8e2d24463485bb0e37000eb176.sock every 8 connection(s)
I20260925 17:52:53.972787   837 acceptor_pool.cc:254] collecting diagnostics on the listening RPC socket unix:/tmp/dist-test-taskFlwhiE/test-tmp/rpc-test-a5401f8e2d24463485bb0e37000eb176.sock every 8 connection(s)
I20260925 17:52:53.973963   379 rpc-test.cc:1846] Connecting to unix:/tmp/dist-test-taskFlwhiE/test-tmp/rpc-test-a5401f8e2d24463485bb0e37000eb176.sock
I20260925 17:52:56.920516   379 rpc-test.cc:1859] Sending 1024MB via ssl-enabled unix socket: real 2.927s	user 3.011s	sys 1.937s
I20260925 17:52:59.923435   379 rpc-test.cc:1859] Sending 1024MB via ssl-enabled unix socket: real 3.003s	user 3.081s	sys 1.999s
I20260925 17:53:02.957451   379 rpc-test.cc:1859] Sending 1024MB via ssl-enabled unix socket: real 3.034s	user 3.147s	sys 2.012s
I20260925 17:53:05.877832   379 rpc-test.cc:1859] Sending 1024MB via ssl-enabled unix socket: real 2.920s	user 2.882s	sys 2.064s
I20260925 17:53:08.888010   379 rpc-test.cc:1859] Sending 1024MB via ssl-enabled unix socket: real 3.010s	user 2.900s	sys 2.204s
W20260925 17:53:08.889024   833 connection.cc:196] Error closing socket: Network error: TlsSocket::Close: Broken pipe
[       OK ] Parameters/TestRpc.TestPerformanceBySocketType/SSL_UnixSocket (14955 ms)
[----------] 20 tests from Parameters/TestRpc (48510 ms total)

[----------] 1 test from Parameters/TestRpcSocketTxRxQueue
[ RUN      ] Parameters/TestRpcSocketTxRxQueue.AcceptorRxQueueSizeMetric/0
I20260925 17:53:08.899529   861 acceptor_pool.cc:254] collecting diagnostics on the listening RPC socket 0.0.0.0:44275 every 1 connection(s)
I20260925 17:53:08.899750   862 acceptor_pool.cc:254] collecting diagnostics on the listening RPC socket 0.0.0.0:44275 every 1 connection(s)
W20260925 17:53:08.901328   857 negotiation.cc:337] Failed RPC negotiation. Trace:
0925 17:53:08.900981 (+     0us) reactor.cc:625] Submitting negotiation task for server connection from 127.0.0.1:58988 (local address 127.0.0.1:44275)
0925 17:53:08.901109 (+   128us) server_negotiation.cc:206] Beginning negotiation
0925 17:53:08.901113 (+     4us) server_negotiation.cc:399] Waiting for connection header
0925 17:53:08.901225 (+   112us) negotiation.cc:327] Negotiation complete: Network error: Server connection negotiation failed: server connection from 127.0.0.1:58988: BlockingRecv error: recv got EOF from 127.0.0.1:58988 (error 108)
Metrics: {"server-negotiator.queue_time_us":37}
[       OK ] Parameters/TestRpcSocketTxRxQueue.AcceptorRxQueueSizeMetric/0 (9 ms)
[----------] 1 test from Parameters/TestRpcSocketTxRxQueue (9 ms total)

[----------] Global test environment tear-down
[==========] 21 tests from 2 test suites ran. (48521 ms total)
[  PASSED  ] 20 tests.
[  FAILED  ] 1 test, listed below:
[  FAILED  ] Parameters/TestRpc.TestCallWithChainCertAndChainCA/SSL_UnixSocket, where GetParam() = (true, true)

 1 FAILED TEST