Diagnosed failure

Parameters/TestRpc.TestCallWithChainCertAndChainCA/SSL_TCP: /data0/somelongdirectorytoavoidrpathissues/src/kudu/src/kudu/rpc/rpc-test.cc:270: Failure
Failed
Bad status: Runtime error: could not verify certificate chain (error with cert: subject=CN = localhost, ST = sadfjas, C = AS, emailAddress = sdflkdsajf, O = lskdfjlsad, OU = sldfkja, issuer=C = AS, ST = ASDfkjdhf, L = lskdjf, O = saldfja, OU = skdjf, CN = localhost, emailAddress = sadjflkadsj): : certificate has expired
Google Test trace:
/data0/somelongdirectorytoavoidrpathissues/src/kudu/src/kudu/rpc/rpc-test.cc:267: Connecting to 0.0.0.0:40195
I20260925 15:07:42.663633 11752 test_util.cc:175] -----------------------------------------------
I20260925 15:07:42.663714 11752 test_util.cc:176] Had fatal failures, leaving test files at /tmp/dist-test-taskcdziJl/test-tmp/rpc-test.5.Parameters_TestRpc.TestCallWithChainCertAndChainCA_SSL_TCP.1790348862540372-11752-0

Parameters/TestRpc.TimedOutOnResponseMetricServiceQueue/SSL_TCP: /data0/somelongdirectorytoavoidrpathissues/src/kudu/src/kudu/rpc/rpc-test.cc:1427: Failure
Expected equality of these values:
  3
  latency_histogram->TotalCount()
    Which is: 2
W20260925 15:08:15.021059 12097 rpcz_store.cc:267] Call kudu.rpc_test.CalculatorService.Sleep from 127.0.0.1:32964 (request call id 2) took 20 ms (client timeout 20 ms). Trace:
W20260925 15:08:15.021199 12097 rpcz_store.cc:269] 0925 15:08:15.000382 (+     0us) service_pool.cc:170] Inserting onto call queue
0925 15:08:15.020975 (+ 20593us) service_pool.cc:214] Skipping call since client already timed out
0925 15:08:15.021035 (+    60us) inbound_call.cc:173] Queueing failure response
Metrics: {}
I20260925 15:08:15.025332 11752 test_util.cc:175] -----------------------------------------------
I20260925 15:08:15.025427 11752 test_util.cc:176] Had fatal failures, leaving test files at /tmp/dist-test-taskcdziJl/test-tmp/rpc-test.5.Parameters_TestRpc.TimedOutOnResponseMetricServiceQueue_SSL_TCP.1790348862540372-11752-0

Full log

Note: This is test shard 6 of 8.
[==========] Running 21 tests from 2 test suites.
[----------] Global test environment set-up.
[----------] 20 tests from Parameters/TestRpc
[ RUN      ] Parameters/TestRpc.TestMessengerCreateDestroy/SSL_TCP
WARNING: Logging before InitGoogleLogging() is written to STDERR
I20260925 15:07:42.598392 11752 rpc-test.cc:169] started messenger TestCreateDestroy
[       OK ] Parameters/TestRpc.TestMessengerCreateDestroy/SSL_TCP (42 ms)
[ RUN      ] Parameters/TestRpc.TestNegotiationDeadlock/SSL_TCP
I20260925 15:07:42.609711 11772 acceptor_pool.cc:254] collecting diagnostics on the listening RPC socket 0.0.0.0:42769 every 8 connection(s)
I20260925 15:07:42.609982 11773 acceptor_pool.cc:254] collecting diagnostics on the listening RPC socket 0.0.0.0:42769 every 8 connection(s)
[       OK ] Parameters/TestRpc.TestNegotiationDeadlock/SSL_TCP (26 ms)
[ RUN      ] Parameters/TestRpc.TestCallWithChainCertAndChainCA/SSL_TCP
I20260925 15:07:42.652056 11788 acceptor_pool.cc:254] collecting diagnostics on the listening RPC socket 0.0.0.0:40195 every 8 connection(s)
I20260925 15:07:42.652397 11789 acceptor_pool.cc:254] collecting diagnostics on the listening RPC socket 0.0.0.0:40195 every 8 connection(s)
/data0/somelongdirectorytoavoidrpathissues/src/kudu/src/kudu/rpc/rpc-test.cc:270: Failure
Failed
Bad status: Runtime error: could not verify certificate chain (error with cert: subject=CN = localhost, ST = sadfjas, C = AS, emailAddress = sdflkdsajf, O = lskdfjlsad, OU = sldfkja, issuer=C = AS, ST = ASDfkjdhf, L = lskdjf, O = saldfja, OU = skdjf, CN = localhost, emailAddress = sadjflkadsj): : certificate has expired
Google Test trace:
/data0/somelongdirectorytoavoidrpathissues/src/kudu/src/kudu/rpc/rpc-test.cc:267: Connecting to 0.0.0.0:40195
I20260925 15:07:42.663633 11752 test_util.cc:175] -----------------------------------------------
I20260925 15:07:42.663714 11752 test_util.cc:176] Had fatal failures, leaving test files at /tmp/dist-test-taskcdziJl/test-tmp/rpc-test.5.Parameters_TestRpc.TestCallWithChainCertAndChainCA_SSL_TCP.1790348862540372-11752-0
[  FAILED  ] Parameters/TestRpc.TestCallWithChainCertAndChainCA/SSL_TCP, where GetParam() = (true, false) (35 ms)
[ RUN      ] Parameters/TestRpc.TestCallWithPasswordProtectedKey/SSL_TCP
I20260925 15:07:42.673631 11813 acceptor_pool.cc:254] collecting diagnostics on the listening RPC socket 0.0.0.0:45165 every 8 connection(s)
I20260925 15:07:42.673872 11814 acceptor_pool.cc:254] collecting diagnostics on the listening RPC socket 0.0.0.0:45165 every 8 connection(s)
[       OK ] Parameters/TestRpc.TestCallWithPasswordProtectedKey/SSL_TCP (44 ms)
[ RUN      ] Parameters/TestRpc.TestCallToBadServer/SSL_TCP
I20260925 15:07:42.725939 11752 rpc-test.cc:394] Status: Network error: Client connection negotiation failed: client connection to 0.0.0.0:0: connect: Connection refused (error 111)
I20260925 15:07:42.726625 11752 rpc-test.cc:394] Status: Network error: Client connection negotiation failed: client connection to 0.0.0.0:0: connect: Connection refused (error 111)
I20260925 15:07:42.727187 11752 rpc-test.cc:394] Status: Network error: Client connection negotiation failed: client connection to 0.0.0.0:0: connect: Connection refused (error 111)
I20260925 15:07:42.727742 11752 rpc-test.cc:394] Status: Network error: Client connection negotiation failed: client connection to 0.0.0.0:0: connect: Connection refused (error 111)
I20260925 15:07:42.728250 11752 rpc-test.cc:394] Status: Network error: Client connection negotiation failed: client connection to 0.0.0.0:0: connect: Connection refused (error 111)
[       OK ] Parameters/TestRpc.TestCallToBadServer/SSL_TCP (21 ms)
[ RUN      ] Parameters/TestRpc.TestWrongService/SSL_TCP
I20260925 15:07:42.761145 11848 acceptor_pool.cc:254] collecting diagnostics on the listening RPC socket 0.0.0.0:34145 every 8 connection(s)
I20260925 15:07:42.761394 11849 acceptor_pool.cc:254] collecting diagnostics on the listening RPC socket 0.0.0.0:34145 every 8 connection(s)
I20260925 15:07:42.782651 11847 messenger.cc:345] service WrongServiceName not registered on TestServer
[       OK ] Parameters/TestRpc.TestWrongService/SSL_TCP (57 ms)
[ RUN      ] Parameters/TestRpc.TestConnectionKeepalive/SSL_TCP
I20260925 15:07:42.800035 11871 acceptor_pool.cc:254] collecting diagnostics on the listening RPC socket 0.0.0.0:44535 every 8 connection(s)
I20260925 15:07:42.800285 11872 acceptor_pool.cc:254] collecting diagnostics on the listening RPC socket 0.0.0.0:44535 every 8 connection(s)
I20260925 15:07:42.801121 11752 rpc-test.cc:488] Connecting to 0.0.0.0:44535
[       OK ] Parameters/TestRpc.TestConnectionKeepalive/SSL_TCP (1046 ms)
[ RUN      ] Parameters/TestRpc.TestClientConnectionMetrics/SSL_TCP
I20260925 15:07:43.847680 11896 acceptor_pool.cc:254] collecting diagnostics on the listening RPC socket 0.0.0.0:41519 every 8 connection(s)
I20260925 15:07:43.847970 11897 acceptor_pool.cc:254] collecting diagnostics on the listening RPC socket 0.0.0.0:41519 every 8 connection(s)
I20260925 15:07:43.848937 11752 rpc-test.cc:569] Connecting to 0.0.0.0:41519
[       OK ] Parameters/TestRpc.TestClientConnectionMetrics/SSL_TCP (19570 ms)
[ RUN      ] Parameters/TestRpc.TestCredentialsPolicy/SSL_TCP
I20260925 15:08:03.411942 11919 acceptor_pool.cc:254] collecting diagnostics on the listening RPC socket 0.0.0.0:40727 every 8 connection(s)
I20260925 15:08:03.412182 11920 acceptor_pool.cc:254] collecting diagnostics on the listening RPC socket 0.0.0.0:40727 every 8 connection(s)
I20260925 15:08:03.413036 11752 rpc-test.cc:700] Connecting to 0.0.0.0:40727
[       OK ] Parameters/TestRpc.TestCredentialsPolicy/SSL_TCP (46 ms)
[ RUN      ] Parameters/TestRpc.TestCallLongerThanKeepalive/SSL_TCP
I20260925 15:08:03.458557 11944 acceptor_pool.cc:254] collecting diagnostics on the listening RPC socket 0.0.0.0:38735 every 8 connection(s)
I20260925 15:08:03.458810 11945 acceptor_pool.cc:254] collecting diagnostics on the listening RPC socket 0.0.0.0:38735 every 8 connection(s)
I20260925 15:08:03.483361 11948 rpc-test-base.h:222] got call: sleep_micros: 3000000 deferred: true
I20260925 15:08:06.484973 11948 rpcz_store.cc:275] Call kudu.rpc.GenericCalculatorService.Sleep from 127.0.0.1:44140 (request call id 0) took 3001 ms. Trace:
I20260925 15:08:06.485121 11948 rpcz_store.cc:276] 0925 15:08:03.483260 (+     0us) service_pool.cc:170] Inserting onto call queue
0925 15:08:03.483319 (+    59us) service_pool.cc:227] Handling call
0925 15:08:06.484926 (+3001607us) inbound_call.cc:173] Queueing success response
Metrics: {}
[       OK ] Parameters/TestRpc.TestCallLongerThanKeepalive/SSL_TCP (3041 ms)
[ RUN      ] Parameters/TestRpc.TestRpcSidecar/SSL_TCP
I20260925 15:08:06.506379 11969 acceptor_pool.cc:254] collecting diagnostics on the listening RPC socket 0.0.0.0:37745 every 8 connection(s)
I20260925 15:08:06.506625 11970 acceptor_pool.cc:254] collecting diagnostics on the listening RPC socket 0.0.0.0:37745 every 8 connection(s)
[       OK ] Parameters/TestRpc.TestRpcSidecar/SSL_TCP (120 ms)
[ RUN      ] Parameters/TestRpc.TestRpcSidecarLimits/SSL_TCP
I20260925 15:08:08.635861 11994 acceptor_pool.cc:254] collecting diagnostics on the listening RPC socket 0.0.0.0:40461 every 8 connection(s)
I20260925 15:08:08.636138 11995 acceptor_pool.cc:254] collecting diagnostics on the listening RPC socket 0.0.0.0:40461 every 8 connection(s)
W20260925 15:08:08.651240 11752 serialization.cc:72] Serialized kudu.rpc_test.PushStringsRequestPB (2147483654 bytes) is larger than the maximum configured RPC message size (52428800 bytes). Sending anyway, but peer may reject the data.
W20260925 15:08:08.657858 11992 connection.cc:535] server connection from 127.0.0.1:59906 recv error: Network error: RPC frame had a length of 2147483714, but we only support messages up to 52428800 bytes long.
W20260925 15:08:08.658025 11992 connection.cc:158] shutting down server connection from 127.0.0.1:59906 with pending inbound data: 4/2147483714 bytes received; last active 0 ns ago: status Network error: RPC frame had a length of 2147483714, but we only support messages up to 52428800 bytes long.
W20260925 15:08:08.658596 12007 connection.cc:196] Error closing socket: Network error: TlsSocket::Close: Connection reset by peer
I20260925 15:08:08.677199 12019 acceptor_pool.cc:254] collecting diagnostics on the listening RPC socket 0.0.0.0:39967 every 8 connection(s)
I20260925 15:08:08.677743 12020 acceptor_pool.cc:254] collecting diagnostics on the listening RPC socket 0.0.0.0:39967 every 8 connection(s)
W20260925 15:08:13.876724 12018 connection.cc:577] server connection from 127.0.0.1:53522: received bad data: 'Corruption: Invalid packet: message had a length of 2147483710, but we only support messages up to 2147483647 bytes
'
[       OK ] Parameters/TestRpc.TestRpcSidecarLimits/SSL_TCP (7714 ms)
[ RUN      ] Parameters/TestRpc.TestCallTimeoutDoesntAffectNegotiation/SSL_TCP
I20260925 15:08:14.357329 12044 acceptor_pool.cc:254] collecting diagnostics on the listening RPC socket 0.0.0.0:46359 every 8 connection(s)
I20260925 15:08:14.357615 12045 acceptor_pool.cc:254] collecting diagnostics on the listening RPC socket 0.0.0.0:46359 every 8 connection(s)
W20260925 15:08:14.367506 12040 negotiation.cc:266] Injecting 500ms delay in negotiation
I20260925 15:08:14.418184 11752 rpc-test-base.h:595] status: Timed out: connection negotiation to 0.0.0.0:46359 for RPC Sleep timed out after 0.050s (ON_OUTBOUND_QUEUE), seconds elapsed: 0.0512204
[       OK ] Parameters/TestRpc.TestCallTimeoutDoesntAffectNegotiation/SSL_TCP (549 ms)
[ RUN      ] Parameters/TestRpc.TestRpcHandlerLatencyMetric/SSL_TCP
I20260925 15:08:14.894832 12069 acceptor_pool.cc:254] collecting diagnostics on the listening RPC socket 0.0.0.0:45437 every 8 connection(s)
I20260925 15:08:14.895045 12070 acceptor_pool.cc:254] collecting diagnostics on the listening RPC socket 0.0.0.0:45437 every 8 connection(s)
I20260925 15:08:14.941175 11752 rpc-test.cc:1236] Sleep() min lat: 20671
I20260925 15:08:14.941252 11752 rpc-test.cc:1237] Sleep() mean lat: 20671
I20260925 15:08:14.941287 11752 rpc-test.cc:1238] Sleep() max lat: 20671
I20260925 15:08:14.941305 11752 rpc-test.cc:1239] Sleep() #calls: 1
[       OK ] Parameters/TestRpc.TestRpcHandlerLatencyMetric/SSL_TCP (68 ms)
[ RUN      ] Parameters/TestRpc.TimedOutOnResponseMetricServiceQueue/SSL_TCP
I20260925 15:08:14.960105 12095 acceptor_pool.cc:254] collecting diagnostics on the listening RPC socket 0.0.0.0:42977 every 8 connection(s)
I20260925 15:08:14.960317 12096 acceptor_pool.cc:254] collecting diagnostics on the listening RPC socket 0.0.0.0:42977 every 8 connection(s)
/data0/somelongdirectorytoavoidrpathissues/src/kudu/src/kudu/rpc/rpc-test.cc:1427: Failure
Expected equality of these values:
  3
  latency_histogram->TotalCount()
    Which is: 2
W20260925 15:08:15.021059 12097 rpcz_store.cc:267] Call kudu.rpc_test.CalculatorService.Sleep from 127.0.0.1:32964 (request call id 2) took 20 ms (client timeout 20 ms). Trace:
W20260925 15:08:15.021199 12097 rpcz_store.cc:269] 0925 15:08:15.000382 (+     0us) service_pool.cc:170] Inserting onto call queue
0925 15:08:15.020975 (+ 20593us) service_pool.cc:214] Skipping call since client already timed out
0925 15:08:15.021035 (+    60us) inbound_call.cc:173] Queueing failure response
Metrics: {}
I20260925 15:08:15.025332 11752 test_util.cc:175] -----------------------------------------------
I20260925 15:08:15.025427 11752 test_util.cc:176] Had fatal failures, leaving test files at /tmp/dist-test-taskcdziJl/test-tmp/rpc-test.5.Parameters_TestRpc.TimedOutOnResponseMetricServiceQueue_SSL_TCP.1790348862540372-11752-0
[  FAILED  ] Parameters/TestRpc.TimedOutOnResponseMetricServiceQueue/SSL_TCP, where GetParam() = (true, false) (78 ms)
[ RUN      ] Parameters/TestRpc.RpcPendingConnectionsMetric/SSL_TCP
I20260925 15:08:15.029430 12118 acceptor_pool.cc:254] collecting diagnostics on the listening RPC socket 0.0.0.0:42433 every 8 connection(s)
I20260925 15:08:15.029690 12119 acceptor_pool.cc:254] collecting diagnostics on the listening RPC socket 0.0.0.0:42433 every 8 connection(s)
W20260925 15:08:15.031554 12114 negotiation.cc:337] Failed RPC negotiation. Trace:
0925 15:08:15.030987 (+     0us) reactor.cc:625] Submitting negotiation task for server connection from 127.0.0.1:59750 (local address 127.0.0.1:42433)
0925 15:08:15.031132 (+   145us) server_negotiation.cc:206] Beginning negotiation
0925 15:08:15.031136 (+     4us) server_negotiation.cc:399] Waiting for connection header
0925 15:08:15.031261 (+   125us) negotiation.cc:327] Negotiation complete: Network error: Server connection negotiation failed: server connection from 127.0.0.1:59750: BlockingRecv error: recv got EOF from 127.0.0.1:59750 (error 108)
Metrics: {"server-negotiator.queue_time_us":56}
[       OK ] Parameters/TestRpc.RpcPendingConnectionsMetric/SSL_TCP (18 ms)
[ RUN      ] Parameters/TestRpc.TestRpcContextClientDeadline/SSL_TCP
I20260925 15:08:15.061352 12134 acceptor_pool.cc:254] collecting diagnostics on the listening RPC socket 0.0.0.0:40899 every 8 connection(s)
I20260925 15:08:15.061679 12135 acceptor_pool.cc:254] collecting diagnostics on the listening RPC socket 0.0.0.0:40899 every 8 connection(s)
[       OK ] Parameters/TestRpc.TestRpcContextClientDeadline/SSL_TCP (61 ms)
[ RUN      ] Parameters/TestRpc.TestApplicationFeatureFlagUnsupportedServer/SSL_TCP
I20260925 15:08:15.119788 12159 acceptor_pool.cc:254] collecting diagnostics on the listening RPC socket 0.0.0.0:42877 every 8 connection(s)
I20260925 15:08:15.120030 12160 acceptor_pool.cc:254] collecting diagnostics on the listening RPC socket 0.0.0.0:42877 every 8 connection(s)
[       OK ] Parameters/TestRpc.TestApplicationFeatureFlagUnsupportedServer/SSL_TCP (45 ms)
[ RUN      ] Parameters/TestRpc.TestCancellationAsync/SSL_TCP
I20260925 15:08:15.178447 12184 acceptor_pool.cc:254] collecting diagnostics on the listening RPC socket 0.0.0.0:45437 every 8 connection(s)
I20260925 15:08:15.178676 12185 acceptor_pool.cc:254] collecting diagnostics on the listening RPC socket 0.0.0.0:45437 every 8 connection(s)
I20260925 15:08:15.179515 11752 rpc-test.cc:1716] Connecting to 0.0.0.0:45437
I20260925 15:08:15.216936 11752 test_util.cc:268] Using random seed: 367813901
I20260925 15:08:15.261358 12188 rpc-test-base.h:240] got call: sleep_micros: 500 pattern: 4294967295 num_repetitions: 2097152 sidecar_idx: 0
I20260925 15:08:15.292564 12188 rpc-test-base.h:240] got call: sleep_micros: 500 pattern: 4294967295 num_repetitions: 2097152 sidecar_idx: 0
I20260925 15:08:15.322649 12187 rpc-test-base.h:240] got call: sleep_micros: 500 pattern: 4294967295 num_repetitions: 2097152 sidecar_idx: 0
I20260925 15:08:15.352818 12188 rpc-test-base.h:240] got call: sleep_micros: 500 pattern: 4294967295 num_repetitions: 2097152 sidecar_idx: 0
I20260925 15:08:15.382437 12188 rpc-test-base.h:240] got call: sleep_micros: 500 pattern: 4294967295 num_repetitions: 2097152 sidecar_idx: 0
I20260925 15:08:15.412505 12187 rpc-test-base.h:240] got call: sleep_micros: 500 pattern: 4294967295 num_repetitions: 2097152 sidecar_idx: 0
W20260925 15:08:15.443347 12183 connection.cc:196] Error closing socket: Network error: TlsSocket::Close: Broken pipe
W20260925 15:08:15.444054 12183 connection.cc:441] server connection from 127.0.0.1:54540 torn down before Call kudu.rpc.GenericCalculatorService.SleepWithSidecar from 127.0.0.1:54540 (request call id 8) could send its response
[       OK ] Parameters/TestRpc.TestCancellationAsync/SSL_TCP (295 ms)
[ RUN      ] Parameters/TestRpc.TestPerformanceBySocketType/SSL_TCP
I20260925 15:08:15.463961 12209 acceptor_pool.cc:254] collecting diagnostics on the listening RPC socket 0.0.0.0:39245 every 8 connection(s)
I20260925 15:08:15.464177 12210 acceptor_pool.cc:254] collecting diagnostics on the listening RPC socket 0.0.0.0:39245 every 8 connection(s)
I20260925 15:08:15.465035 11752 rpc-test.cc:1846] Connecting to 0.0.0.0:39245
I20260925 15:08:18.152529 11752 rpc-test.cc:1859] Sending 1024MB via ssl-enabled tcp socket: real 2.671s	user 2.554s	sys 1.894s
I20260925 15:08:20.910914 11752 rpc-test.cc:1859] Sending 1024MB via ssl-enabled tcp socket: real 2.758s	user 2.494s	sys 2.112s
I20260925 15:08:23.719640 11752 rpc-test.cc:1859] Sending 1024MB via ssl-enabled tcp socket: real 2.809s	user 2.518s	sys 2.186s
I20260925 15:08:26.455950 11752 rpc-test.cc:1859] Sending 1024MB via ssl-enabled tcp socket: real 2.736s	user 2.326s	sys 2.210s
I20260925 15:08:29.212255 11752 rpc-test.cc:1859] Sending 1024MB via ssl-enabled tcp socket: real 2.756s	user 2.409s	sys 2.161s
[       OK ] Parameters/TestRpc.TestPerformanceBySocketType/SSL_TCP (13772 ms)
[----------] 20 tests from Parameters/TestRpc (46660 ms total)

[----------] 1 test from Parameters/TestRpcSocketTxRxQueue
[ RUN      ] Parameters/TestRpcSocketTxRxQueue.OverCapacity/0
W20260925 15:08:29.517740 12244 negotiation.cc:337] Failed RPC negotiation. Trace:
0925 15:08:29.232922 (+     0us) reactor.cc:625] Submitting negotiation task for client connection to 0.0.0.0:45603 (local address 127.0.0.1:45410)
0925 15:08:29.233070 (+   148us) negotiation.cc:107] Waiting for socket to connect
0925 15:08:29.233084 (+    14us) client_negotiation.cc:174] Beginning negotiation
0925 15:08:29.233166 (+    82us) client_negotiation.cc:252] Sending NEGOTIATE NegotiatePB request
0925 15:08:29.516954 (+283788us) negotiation.cc:327] Negotiation complete: Network error: Client connection negotiation failed: client connection to 0.0.0.0:45603: BlockingRecv error: recv error from unknown peer: Transport endpoint is not connected (error 107)
Metrics: {"client-negotiator.queue_time_us":46}
W20260925 15:08:29.518373 12226 negotiation.cc:337] Failed RPC negotiation. Trace:
0925 15:08:29.227793 (+     0us) reactor.cc:625] Submitting negotiation task for client connection to 0.0.0.0:45603 (local address 127.0.0.1:45386)
0925 15:08:29.227997 (+   204us) negotiation.cc:107] Waiting for socket to connect
0925 15:08:29.228015 (+    18us) client_negotiation.cc:174] Beginning negotiation
0925 15:08:29.228132 (+   117us) client_negotiation.cc:252] Sending NEGOTIATE NegotiatePB request
0925 15:08:29.516969 (+288837us) negotiation.cc:327] Negotiation complete: Network error: Client connection negotiation failed: client connection to 0.0.0.0:45603: BlockingRecv error: recv error from unknown peer: Transport endpoint is not connected (error 107)
Metrics: {"client-negotiator.queue_time_us":74}
W20260925 15:08:29.518450 12253 negotiation.cc:337] Failed RPC negotiation. Trace:
0925 15:08:29.235212 (+     0us) reactor.cc:625] Submitting negotiation task for client connection to 0.0.0.0:45603 (local address 127.0.0.1:45422)
0925 15:08:29.235361 (+   149us) negotiation.cc:107] Waiting for socket to connect
0925 15:08:29.235373 (+    12us) client_negotiation.cc:174] Beginning negotiation
0925 15:08:29.235457 (+    84us) client_negotiation.cc:252] Sending NEGOTIATE NegotiatePB request
0925 15:08:29.516974 (+281517us) negotiation.cc:327] Negotiation complete: Network error: Client connection negotiation failed: client connection to 0.0.0.0:45603: BlockingRecv error: recv error from unknown peer: Transport endpoint is not connected (error 107)
Metrics: {"client-negotiator.queue_time_us":47}
W20260925 15:08:29.518815 12235 negotiation.cc:337] Failed RPC negotiation. Trace:
0925 15:08:29.230738 (+     0us) reactor.cc:625] Submitting negotiation task for client connection to 0.0.0.0:45603 (local address 127.0.0.1:45400)
0925 15:08:29.230900 (+   162us) negotiation.cc:107] Waiting for socket to connect
0925 15:08:29.230921 (+    21us) client_negotiation.cc:174] Beginning negotiation
0925 15:08:29.231017 (+    96us) client_negotiation.cc:252] Sending NEGOTIATE NegotiatePB request
0925 15:08:29.517639 (+286622us) negotiation.cc:327] Negotiation complete: Network error: Client connection negotiation failed: client connection to 0.0.0.0:45603: BlockingRecv error: recv error from unknown peer: Transport endpoint is not connected (error 107)
Metrics: {"client-negotiator.queue_time_us":47}
W20260925 15:08:29.518913 12271 negotiation.cc:337] Failed RPC negotiation. Trace:
0925 15:08:29.240151 (+     0us) reactor.cc:625] Submitting negotiation task for client connection to 0.0.0.0:45603 (local address 127.0.0.1:45438)
0925 15:08:29.240317 (+   166us) negotiation.cc:107] Waiting for socket to connect
0925 15:08:29.240332 (+    15us) client_negotiation.cc:174] Beginning negotiation
0925 15:08:29.240418 (+    86us) client_negotiation.cc:252] Sending NEGOTIATE NegotiatePB request
0925 15:08:29.517742 (+277324us) negotiation.cc:327] Negotiation complete: Network error: Client connection negotiation failed: client connection to 0.0.0.0:45603: BlockingRecv error: recv error from unknown peer: Transport endpoint is not connected (error 107)
Metrics: {"client-negotiator.queue_time_us":48}
W20260925 15:08:29.518953 12262 negotiation.cc:337] Failed RPC negotiation. Trace:
0925 15:08:29.237729 (+     0us) reactor.cc:625] Submitting negotiation task for client connection to 0.0.0.0:45603 (local address 127.0.0.1:45424)
0925 15:08:29.237898 (+   169us) negotiation.cc:107] Waiting for socket to connect
0925 15:08:29.237915 (+    17us) client_negotiation.cc:174] Beginning negotiation
0925 15:08:29.237990 (+    75us) client_negotiation.cc:252] Sending NEGOTIATE NegotiatePB request
0925 15:08:29.517755 (+279765us) negotiation.cc:327] Negotiation complete: Network error: Client connection negotiation failed: client connection to 0.0.0.0:45603: BlockingRecv error: recv error from unknown peer: Transport endpoint is not connected (error 107)
Metrics: {"client-negotiator.queue_time_us":46}
[       OK ] Parameters/TestRpcSocketTxRxQueue.OverCapacity/0 (1068 ms)
[----------] 1 test from Parameters/TestRpcSocketTxRxQueue (1068 ms total)

[----------] Global test environment tear-down
[==========] 21 tests from 2 test suites ran. (47728 ms total)
[  PASSED  ] 19 tests.
[  FAILED  ] 2 tests, listed below:
[  FAILED  ] Parameters/TestRpc.TestCallWithChainCertAndChainCA/SSL_TCP, where GetParam() = (true, false)
[  FAILED  ] Parameters/TestRpc.TimedOutOnResponseMetricServiceQueue/SSL_TCP, where GetParam() = (true, false)

 2 FAILED TESTS