Diagnosed failure
Parameters/TestRpc.TestCallWithChainCertAndChainCA/SSL_UnixSocket: /data0/somelongdirectorytoavoidrpathissues/src/kudu/src/kudu/rpc/rpc-test.cc:270: Failure
Failed
Bad status: Runtime error: could not verify certificate chain (error with cert: subject=CN = localhost, ST = sadfjas, C = AS, emailAddress = sdflkdsajf, O = lskdfjlsad, OU = sldfkja, issuer=C = AS, ST = ASDfkjdhf, L = lskdjf, O = saldfja, OU = skdjf, CN = localhost, emailAddress = sadjflkadsj): : certificate has expired
Google Test trace:
/data0/somelongdirectorytoavoidrpathissues/src/kudu/src/kudu/rpc/rpc-test.cc:267: Connecting to unix:/tmp/dist-test-taskUhax5f/test-tmp/rpc-test-fb00fbd3963949d0857bc3605e74b886.sock
I20260928 19:32:17.789427 8517 test_util.cc:175] -----------------------------------------------
I20260928 19:32:17.789634 8517 test_util.cc:176] Had fatal failures, leaving test files at /tmp/dist-test-taskUhax5f/test-tmp/rpc-test.6.Parameters_TestRpc.TestCallWithChainCertAndChainCA_SSL_UnixSocket.1790623936396563-8517-0
Full log
Note: This is test shard 7 of 8.
[==========] Running 21 tests from 2 test suites.
[----------] Global test environment set-up.
[----------] 20 tests from Parameters/TestRpc
[ RUN ] Parameters/TestRpc.TestMessengerCreateDestroy/SSL_UnixSocket
WARNING: Logging before InitGoogleLogging() is written to STDERR
I20260928 19:32:16.499719 8517 rpc-test.cc:169] started messenger TestCreateDestroy
[ OK ] Parameters/TestRpc.TestMessengerCreateDestroy/SSL_UnixSocket (1184 ms)
[ RUN ] Parameters/TestRpc.TestNegotiationDeadlock/SSL_UnixSocket
I20260928 19:32:17.653878 8539 acceptor_pool.cc:254] collecting diagnostics on the listening RPC socket unix:/tmp/dist-test-taskUhax5f/test-tmp/rpc-test-8381b4f2647f4f888396ffa873f6d85a.sock every 8 connection(s)
I20260928 19:32:17.655674 8540 acceptor_pool.cc:254] collecting diagnostics on the listening RPC socket unix:/tmp/dist-test-taskUhax5f/test-tmp/rpc-test-8381b4f2647f4f888396ffa873f6d85a.sock every 8 connection(s)
[ OK ] Parameters/TestRpc.TestNegotiationDeadlock/SSL_UnixSocket (76 ms)
[ RUN ] Parameters/TestRpc.TestCallWithChainCertAndChainCA/SSL_UnixSocket
I20260928 19:32:17.756682 8555 acceptor_pool.cc:254] collecting diagnostics on the listening RPC socket unix:/tmp/dist-test-taskUhax5f/test-tmp/rpc-test-fb00fbd3963949d0857bc3605e74b886.sock every 8 connection(s)
I20260928 19:32:17.759295 8556 acceptor_pool.cc:254] collecting diagnostics on the listening RPC socket unix:/tmp/dist-test-taskUhax5f/test-tmp/rpc-test-fb00fbd3963949d0857bc3605e74b886.sock every 8 connection(s)
/data0/somelongdirectorytoavoidrpathissues/src/kudu/src/kudu/rpc/rpc-test.cc:270: Failure
Failed
Bad status: Runtime error: could not verify certificate chain (error with cert: subject=CN = localhost, ST = sadfjas, C = AS, emailAddress = sdflkdsajf, O = lskdfjlsad, OU = sldfkja, issuer=C = AS, ST = ASDfkjdhf, L = lskdjf, O = saldfja, OU = skdjf, CN = localhost, emailAddress = sadjflkadsj): : certificate has expired
Google Test trace:
/data0/somelongdirectorytoavoidrpathissues/src/kudu/src/kudu/rpc/rpc-test.cc:267: Connecting to unix:/tmp/dist-test-taskUhax5f/test-tmp/rpc-test-fb00fbd3963949d0857bc3605e74b886.sock
I20260928 19:32:17.789427 8517 test_util.cc:175] -----------------------------------------------
I20260928 19:32:17.789634 8517 test_util.cc:176] Had fatal failures, leaving test files at /tmp/dist-test-taskUhax5f/test-tmp/rpc-test.6.Parameters_TestRpc.TestCallWithChainCertAndChainCA_SSL_UnixSocket.1790623936396563-8517-0
[ FAILED ] Parameters/TestRpc.TestCallWithChainCertAndChainCA/SSL_UnixSocket, where GetParam() = (true, true) (79 ms)
[ RUN ] Parameters/TestRpc.TestCallWithPasswordProtectedKey/SSL_UnixSocket
I20260928 19:32:17.824256 8580 acceptor_pool.cc:254] collecting diagnostics on the listening RPC socket unix:/tmp/dist-test-taskUhax5f/test-tmp/rpc-test-ee5c23e423f245a7a8816fa13900263f.sock every 8 connection(s)
I20260928 19:32:17.825103 8581 acceptor_pool.cc:254] collecting diagnostics on the listening RPC socket unix:/tmp/dist-test-taskUhax5f/test-tmp/rpc-test-ee5c23e423f245a7a8816fa13900263f.sock every 8 connection(s)
[ OK ] Parameters/TestRpc.TestCallWithPasswordProtectedKey/SSL_UnixSocket (86 ms)
[ RUN ] Parameters/TestRpc.TestCallToBadServer/SSL_UnixSocket
I20260928 19:32:17.909825 8517 rpc-test.cc:394] Status: Network error: Client connection negotiation failed: client connection to 0.0.0.0:0: connect: Connection refused (error 111)
I20260928 19:32:17.911427 8517 rpc-test.cc:394] Status: Network error: Client connection negotiation failed: client connection to 0.0.0.0:0: connect: Connection refused (error 111)
I20260928 19:32:17.912711 8517 rpc-test.cc:394] Status: Network error: Client connection negotiation failed: client connection to 0.0.0.0:0: connect: Connection refused (error 111)
I20260928 19:32:17.914043 8517 rpc-test.cc:394] Status: Network error: Client connection negotiation failed: client connection to 0.0.0.0:0: connect: Connection refused (error 111)
I20260928 19:32:17.915330 8517 rpc-test.cc:394] Status: Network error: Client connection negotiation failed: client connection to 0.0.0.0:0: connect: Connection refused (error 111)
[ OK ] Parameters/TestRpc.TestCallToBadServer/SSL_UnixSocket (41 ms)
[ RUN ] Parameters/TestRpc.TestWrongService/SSL_UnixSocket
I20260928 19:32:17.939432 8615 acceptor_pool.cc:254] collecting diagnostics on the listening RPC socket unix:/tmp/dist-test-taskUhax5f/test-tmp/rpc-test-74d17ee4a8464ab9a7202dc6fd0c0db5.sock every 8 connection(s)
I20260928 19:32:17.940315 8616 acceptor_pool.cc:254] collecting diagnostics on the listening RPC socket unix:/tmp/dist-test-taskUhax5f/test-tmp/rpc-test-74d17ee4a8464ab9a7202dc6fd0c0db5.sock every 8 connection(s)
I20260928 19:32:17.982174 8612 messenger.cc:345] service WrongServiceName not registered on TestServer
[ OK ] Parameters/TestRpc.TestWrongService/SSL_UnixSocket (73 ms)
[ RUN ] Parameters/TestRpc.TestConnectionKeepalive/SSL_UnixSocket
I20260928 19:32:18.023298 8638 acceptor_pool.cc:254] collecting diagnostics on the listening RPC socket unix:/tmp/dist-test-taskUhax5f/test-tmp/rpc-test-590af713a92f4b23ab9a480bc19ea4c0.sock every 8 connection(s)
I20260928 19:32:18.024015 8639 acceptor_pool.cc:254] collecting diagnostics on the listening RPC socket unix:/tmp/dist-test-taskUhax5f/test-tmp/rpc-test-590af713a92f4b23ab9a480bc19ea4c0.sock every 8 connection(s)
I20260928 19:32:18.027334 8517 rpc-test.cc:488] Connecting to unix:/tmp/dist-test-taskUhax5f/test-tmp/rpc-test-590af713a92f4b23ab9a480bc19ea4c0.sock
W20260928 19:32:18.494418 8651 connection.cc:196] Error closing socket: Network error: TlsSocket::Close: Broken pipe
[ OK ] Parameters/TestRpc.TestConnectionKeepalive/SSL_UnixSocket (1078 ms)
[ RUN ] Parameters/TestRpc.TestClientConnectionMetrics/SSL_UnixSocket
I20260928 19:32:19.107793 8663 acceptor_pool.cc:254] collecting diagnostics on the listening RPC socket unix:/tmp/dist-test-taskUhax5f/test-tmp/rpc-test-cedcfd921c6a4ef297b72b0a11cf6af3.sock every 8 connection(s)
I20260928 19:32:19.108544 8664 acceptor_pool.cc:254] collecting diagnostics on the listening RPC socket unix:/tmp/dist-test-taskUhax5f/test-tmp/rpc-test-cedcfd921c6a4ef297b72b0a11cf6af3.sock every 8 connection(s)
I20260928 19:32:19.112015 8517 rpc-test.cc:569] Connecting to unix:/tmp/dist-test-taskUhax5f/test-tmp/rpc-test-cedcfd921c6a4ef297b72b0a11cf6af3.sock
W20260928 19:34:41.477190 8660 connection.cc:196] Error closing socket: Network error: TlsSocket::Close: Broken pipe
[ OK ] Parameters/TestRpc.TestClientConnectionMetrics/SSL_UnixSocket (142414 ms)
[ RUN ] Parameters/TestRpc.TestCredentialsPolicy/SSL_UnixSocket
I20260928 19:34:41.532261 8700 acceptor_pool.cc:254] collecting diagnostics on the listening RPC socket unix:/tmp/dist-test-taskUhax5f/test-tmp/rpc-test-ad8d3bb18a95456f9ceac448a91c8a80.sock every 8 connection(s)
I20260928 19:34:41.533262 8701 acceptor_pool.cc:254] collecting diagnostics on the listening RPC socket unix:/tmp/dist-test-taskUhax5f/test-tmp/rpc-test-ad8d3bb18a95456f9ceac448a91c8a80.sock every 8 connection(s)
I20260928 19:34:41.536625 8517 rpc-test.cc:700] Connecting to unix:/tmp/dist-test-taskUhax5f/test-tmp/rpc-test-ad8d3bb18a95456f9ceac448a91c8a80.sock
W20260928 19:34:41.572116 8699 connection.cc:196] Error closing socket: Network error: TlsSocket::Close: Broken pipe
[ OK ] Parameters/TestRpc.TestCredentialsPolicy/SSL_UnixSocket (109 ms)
[ RUN ] Parameters/TestRpc.TestCallLongerThanKeepalive/SSL_UnixSocket
I20260928 19:34:41.627910 8725 acceptor_pool.cc:254] collecting diagnostics on the listening RPC socket unix:/tmp/dist-test-taskUhax5f/test-tmp/rpc-test-b09ebfa3379c417b8561b22488c1c641.sock every 8 connection(s)
I20260928 19:34:41.628779 8726 acceptor_pool.cc:254] collecting diagnostics on the listening RPC socket unix:/tmp/dist-test-taskUhax5f/test-tmp/rpc-test-b09ebfa3379c417b8561b22488c1c641.sock every 8 connection(s)
I20260928 19:34:41.664223 8729 rpc-test-base.h:222] got call: sleep_micros: 3000000 deferred: true
I20260928 19:34:44.668623 8729 rpcz_store.cc:275] Call kudu.rpc.GenericCalculatorService.Sleep from unix:<unnamed> (request call id 0) took 3004 ms. Trace:
I20260928 19:34:44.668958 8729 rpcz_store.cc:276] 0928 19:34:41.664065 (+ 0us) service_pool.cc:170] Inserting onto call queue
0928 19:34:41.664166 (+ 101us) service_pool.cc:227] Handling call
0928 19:34:44.668572 (+3004406us) inbound_call.cc:173] Queueing success response
Metrics: {}
W20260928 19:34:44.673666 8722 connection.cc:196] Error closing socket: Network error: TlsSocket::Close: Broken pipe
[ OK ] Parameters/TestRpc.TestCallLongerThanKeepalive/SSL_UnixSocket (3084 ms)
[ RUN ] Parameters/TestRpc.TestRpcSidecar/SSL_UnixSocket
I20260928 19:34:44.714604 8750 acceptor_pool.cc:254] collecting diagnostics on the listening RPC socket unix:/tmp/dist-test-taskUhax5f/test-tmp/rpc-test-fd9784f7341247359ac2ee254c6f8fbe.sock every 8 connection(s)
I20260928 19:34:44.715384 8751 acceptor_pool.cc:254] collecting diagnostics on the listening RPC socket unix:/tmp/dist-test-taskUhax5f/test-tmp/rpc-test-fd9784f7341247359ac2ee254c6f8fbe.sock every 8 connection(s)
[ OK ] Parameters/TestRpc.TestRpcSidecar/SSL_UnixSocket (610 ms)
[ RUN ] Parameters/TestRpc.TestRpcSidecarLimits/SSL_UnixSocket
I20260928 19:35:02.431008 8777 acceptor_pool.cc:254] collecting diagnostics on the listening RPC socket unix:/tmp/dist-test-taskUhax5f/test-tmp/rpc-test-6e2bea7c69bc47ee8ca6a874ebbc5a15.sock every 8 connection(s)
I20260928 19:35:02.431694 8778 acceptor_pool.cc:254] collecting diagnostics on the listening RPC socket unix:/tmp/dist-test-taskUhax5f/test-tmp/rpc-test-6e2bea7c69bc47ee8ca6a874ebbc5a15.sock every 8 connection(s)
W20260928 19:35:02.451740 8517 serialization.cc:72] Serialized kudu.rpc_test.PushStringsRequestPB (2147483654 bytes) is larger than the maximum configured RPC message size (52428800 bytes). Sending anyway, but peer may reject the data.
W20260928 19:35:02.462052 8774 connection.cc:535] server connection from unix:<unnamed> recv error: Network error: RPC frame had a length of 2147483714, but we only support messages up to 52428800 bytes long.
W20260928 19:35:02.462466 8774 connection.cc:158] shutting down server connection from unix:<unnamed> with pending inbound data: 4/2147483714 bytes received; last active 0 ns ago: status Network error: RPC frame had a length of 2147483714, but we only support messages up to 52428800 bytes long.
W20260928 19:35:02.463305 8790 connection.cc:698] client connection to unix:/tmp/dist-test-taskUhax5f/test-tmp/rpc-test-6e2bea7c69bc47ee8ca6a874ebbc5a15.sock send error: Network error: failed to write to TLS socket: Broken pipe
W20260928 19:35:02.464001 8790 connection.cc:196] Error closing socket: Network error: TlsSocket::Close: Success
[ OK ] Parameters/TestRpc.TestRpcSidecarLimits/SSL_UnixSocket (17901 ms)
[ RUN ] Parameters/TestRpc.TestCallTimeoutDoesntAffectNegotiation/SSL_UnixSocket
I20260928 19:35:03.237830 8802 acceptor_pool.cc:254] collecting diagnostics on the listening RPC socket unix:/tmp/dist-test-taskUhax5f/test-tmp/rpc-test-209551b816be4c3bb8491f1d355a5528.sock every 8 connection(s)
I20260928 19:35:03.238582 8803 acceptor_pool.cc:254] collecting diagnostics on the listening RPC socket unix:/tmp/dist-test-taskUhax5f/test-tmp/rpc-test-209551b816be4c3bb8491f1d355a5528.sock every 8 connection(s)
W20260928 19:35:03.266753 8798 negotiation.cc:266] Injecting 500ms delay in negotiation
I20260928 19:35:03.316994 8517 rpc-test-base.h:595] status: Timed out: connection negotiation to unix:/tmp/dist-test-taskUhax5f/test-tmp/rpc-test-209551b816be4c3bb8491f1d355a5528.sock for RPC Sleep timed out after 0.050s (ON_OUTBOUND_QUEUE), seconds elapsed: 0.0513182
W20260928 19:35:03.780377 8799 connection.cc:196] Error closing socket: Network error: TlsSocket::Close: Broken pipe
[ OK ] Parameters/TestRpc.TestCallTimeoutDoesntAffectNegotiation/SSL_UnixSocket (593 ms)
[ RUN ] Parameters/TestRpc.TestRpcHandlerLatencyMetric/SSL_UnixSocket
I20260928 19:35:03.802158 8827 acceptor_pool.cc:254] collecting diagnostics on the listening RPC socket unix:/tmp/dist-test-taskUhax5f/test-tmp/rpc-test-45db57f3822b400596d93545d4a7a687.sock every 8 connection(s)
I20260928 19:35:03.802896 8828 acceptor_pool.cc:254] collecting diagnostics on the listening RPC socket unix:/tmp/dist-test-taskUhax5f/test-tmp/rpc-test-45db57f3822b400596d93545d4a7a687.sock every 8 connection(s)
I20260928 19:35:03.856849 8517 rpc-test.cc:1236] Sleep() min lat: 21629
I20260928 19:35:03.857105 8517 rpc-test.cc:1237] Sleep() mean lat: 21629
I20260928 19:35:03.857363 8517 rpc-test.cc:1238] Sleep() max lat: 21629
I20260928 19:35:03.857571 8517 rpc-test.cc:1239] Sleep() #calls: 1
W20260928 19:35:03.860286 8824 connection.cc:196] Error closing socket: Network error: TlsSocket::Close: Broken pipe
[ OK ] Parameters/TestRpc.TestRpcHandlerLatencyMetric/SSL_UnixSocket (83 ms)
[ RUN ] Parameters/TestRpc.TimedOutOnResponseMetricServiceQueue/SSL_UnixSocket
I20260928 19:35:03.893906 8853 acceptor_pool.cc:254] collecting diagnostics on the listening RPC socket unix:/tmp/dist-test-taskUhax5f/test-tmp/rpc-test-57fab4c45e344c8c97b0d6670e6d4ab9.sock every 8 connection(s)
I20260928 19:35:03.894721 8854 acceptor_pool.cc:254] collecting diagnostics on the listening RPC socket unix:/tmp/dist-test-taskUhax5f/test-tmp/rpc-test-57fab4c45e344c8c97b0d6670e6d4ab9.sock every 8 connection(s)
W20260928 19:35:03.973654 8855 rpcz_store.cc:267] Call kudu.rpc_test.CalculatorService.Sleep from unix:<unnamed> (request call id 2) took 20 ms (client timeout 20 ms). Trace:
W20260928 19:35:03.974104 8855 rpcz_store.cc:269] 0928 19:35:03.953130 (+ 0us) service_pool.cc:170] Inserting onto call queue
0928 19:35:03.973520 (+ 20390us) service_pool.cc:214] Skipping call since client already timed out
0928 19:35:03.973608 (+ 88us) inbound_call.cc:173] Queueing failure response
Metrics: {}
[ OK ] Parameters/TestRpc.TimedOutOnResponseMetricServiceQueue/SSL_UnixSocket (112 ms)
[ RUN ] Parameters/TestRpc.RpcPendingConnectionsMetric/SSL_UnixSocket
I20260928 19:35:03.991155 8876 acceptor_pool.cc:254] collecting diagnostics on the listening RPC socket 0.0.0.0:33571 every 8 connection(s)
I20260928 19:35:03.991894 8877 acceptor_pool.cc:254] collecting diagnostics on the listening RPC socket 0.0.0.0:33571 every 8 connection(s)
W20260928 19:35:03.996846 8872 negotiation.cc:337] Failed RPC negotiation. Trace:
0928 19:35:03.995662 (+ 0us) reactor.cc:625] Submitting negotiation task for server connection from 127.0.0.1:43438 (local address 127.0.0.1:33571)
0928 19:35:03.996022 (+ 360us) server_negotiation.cc:206] Beginning negotiation
0928 19:35:03.996040 (+ 18us) server_negotiation.cc:399] Waiting for connection header
0928 19:35:03.996301 (+ 261us) negotiation.cc:327] Negotiation complete: Network error: Server connection negotiation failed: server connection from 127.0.0.1:43438: BlockingRecv error: recv got EOF from 127.0.0.1:43438 (error 108)
Metrics: {"server-negotiator.queue_time_us":88}
[ OK ] Parameters/TestRpc.RpcPendingConnectionsMetric/SSL_UnixSocket (29 ms)
[ RUN ] Parameters/TestRpc.TestRpcContextClientDeadline/SSL_UnixSocket
I20260928 19:35:04.036084 8892 acceptor_pool.cc:254] collecting diagnostics on the listening RPC socket unix:/tmp/dist-test-taskUhax5f/test-tmp/rpc-test-e158df2190a1475494463d4d4cacd773.sock every 8 connection(s)
I20260928 19:35:04.036867 8893 acceptor_pool.cc:254] collecting diagnostics on the listening RPC socket unix:/tmp/dist-test-taskUhax5f/test-tmp/rpc-test-e158df2190a1475494463d4d4cacd773.sock every 8 connection(s)
W20260928 19:35:04.090361 8889 connection.cc:196] Error closing socket: Network error: TlsSocket::Close: Broken pipe
[ OK ] Parameters/TestRpc.TestRpcContextClientDeadline/SSL_UnixSocket (84 ms)
[ RUN ] Parameters/TestRpc.TestApplicationFeatureFlagUnsupportedServer/SSL_UnixSocket
I20260928 19:35:04.119117 8917 acceptor_pool.cc:254] collecting diagnostics on the listening RPC socket unix:/tmp/dist-test-taskUhax5f/test-tmp/rpc-test-45170ef0fbe64cc29c0db0ef099e58e9.sock every 8 connection(s)
I20260928 19:35:04.119853 8918 acceptor_pool.cc:254] collecting diagnostics on the listening RPC socket unix:/tmp/dist-test-taskUhax5f/test-tmp/rpc-test-45170ef0fbe64cc29c0db0ef099e58e9.sock every 8 connection(s)
W20260928 19:35:04.149854 8914 connection.cc:196] Error closing socket: Network error: TlsSocket::Close: Broken pipe
[ OK ] Parameters/TestRpc.TestApplicationFeatureFlagUnsupportedServer/SSL_UnixSocket (60 ms)
[ RUN ] Parameters/TestRpc.TestCancellationAsync/SSL_UnixSocket
I20260928 19:35:04.174567 8942 acceptor_pool.cc:254] collecting diagnostics on the listening RPC socket unix:/tmp/dist-test-taskUhax5f/test-tmp/rpc-test-fa45b18fdf8242d4919fea9c7eaad3d1.sock every 8 connection(s)
I20260928 19:35:04.175292 8943 acceptor_pool.cc:254] collecting diagnostics on the listening RPC socket unix:/tmp/dist-test-taskUhax5f/test-tmp/rpc-test-fa45b18fdf8242d4919fea9c7eaad3d1.sock every 8 connection(s)
I20260928 19:35:04.178365 8517 rpc-test.cc:1716] Connecting to unix:/tmp/dist-test-taskUhax5f/test-tmp/rpc-test-fa45b18fdf8242d4919fea9c7eaad3d1.sock
I20260928 19:35:04.197168 8517 test_util.cc:268] Using random seed: 698887189
I20260928 19:35:04.418002 8946 rpc-test-base.h:240] got call: sleep_micros: 500 pattern: 4294967295 num_repetitions: 2097152 sidecar_idx: 0
I20260928 19:35:04.639390 8946 rpc-test-base.h:240] got call: sleep_micros: 500 pattern: 4294967295 num_repetitions: 2097152 sidecar_idx: 0
I20260928 19:35:04.869145 8946 rpc-test-base.h:240] got call: sleep_micros: 500 pattern: 4294967295 num_repetitions: 2097152 sidecar_idx: 0
I20260928 19:35:05.097675 8946 rpc-test-base.h:240] got call: sleep_micros: 500 pattern: 4294967295 num_repetitions: 2097152 sidecar_idx: 0
I20260928 19:35:05.315409 8945 rpc-test-base.h:240] got call: sleep_micros: 500 pattern: 4294967295 num_repetitions: 2097152 sidecar_idx: 0
I20260928 19:35:05.537673 8945 rpc-test-base.h:240] got call: sleep_micros: 500 pattern: 4294967295 num_repetitions: 2097152 sidecar_idx: 0
I20260928 19:35:05.723507 8946 rpc-test-base.h:240] got call: sleep_micros: 500 pattern: 4294967295 num_repetitions: 2097152 sidecar_idx: 0
I20260928 19:35:05.973308 8945 rpc-test-base.h:240] got call: sleep_micros: 500 pattern: 4294967295 num_repetitions: 2097152 sidecar_idx: 0
I20260928 19:35:06.203224 8945 rpc-test-base.h:240] got call: sleep_micros: 500 pattern: 4294967295 num_repetitions: 2097152 sidecar_idx: 0
W20260928 19:35:06.224808 8939 connection.cc:196] Error closing socket: Network error: TlsSocket::Close: Broken pipe
W20260928 19:35:06.352651 8939 connection.cc:441] server connection from unix:<unnamed> torn down before Call kudu.rpc.GenericCalculatorService.SleepWithSidecar from unix:<unnamed> (request call id 9) could send its response
[ OK ] Parameters/TestRpc.TestCancellationAsync/SSL_UnixSocket (2207 ms)
[ RUN ] Parameters/TestRpc.TestPerformanceBySocketType/SSL_UnixSocket
I20260928 19:35:06.454448 8967 acceptor_pool.cc:254] collecting diagnostics on the listening RPC socket unix:/tmp/dist-test-taskUhax5f/test-tmp/rpc-test-4f4dc9ed5fb042d3980571d3ca00da89.sock every 8 connection(s)
I20260928 19:35:06.455236 8968 acceptor_pool.cc:254] collecting diagnostics on the listening RPC socket unix:/tmp/dist-test-taskUhax5f/test-tmp/rpc-test-4f4dc9ed5fb042d3980571d3ca00da89.sock every 8 connection(s)
I20260928 19:35:06.458403 8517 rpc-test.cc:1846] Connecting to unix:/tmp/dist-test-taskUhax5f/test-tmp/rpc-test-4f4dc9ed5fb042d3980571d3ca00da89.sock
I20260928 19:35:28.511524 8517 rpc-test.cc:1859] Sending 1024MB via ssl-enabled unix socket: real 22.041s user 20.009s sys 13.166s
I20260928 19:35:50.194505 8517 rpc-test.cc:1859] Sending 1024MB via ssl-enabled unix socket: real 21.682s user 19.437s sys 13.142s
I20260928 19:36:11.990096 8517 rpc-test.cc:1859] Sending 1024MB via ssl-enabled unix socket: real 21.795s user 19.887s sys 12.884s
I20260928 19:36:33.715580 8517 rpc-test.cc:1859] Sending 1024MB via ssl-enabled unix socket: real 21.725s user 19.435s sys 13.185s
I20260928 19:36:55.446980 8517 rpc-test.cc:1859] Sending 1024MB via ssl-enabled unix socket: real 21.731s user 19.554s sys 13.065s
W20260928 19:36:55.453454 8964 connection.cc:196] Error closing socket: Network error: TlsSocket::Close: Broken pipe
[ OK ] Parameters/TestRpc.TestPerformanceBySocketType/SSL_UnixSocket (109101 ms)
[----------] 20 tests from Parameters/TestRpc (279016 ms total)
[----------] 1 test from Parameters/TestRpcSocketTxRxQueue
[ RUN ] Parameters/TestRpcSocketTxRxQueue.AcceptorRxQueueSizeMetric/0
I20260928 19:36:55.480569 9003 acceptor_pool.cc:254] collecting diagnostics on the listening RPC socket 0.0.0.0:38097 every 1 connection(s)
I20260928 19:36:55.481341 9004 acceptor_pool.cc:254] collecting diagnostics on the listening RPC socket 0.0.0.0:38097 every 1 connection(s)
W20260928 19:36:55.486871 8999 negotiation.cc:337] Failed RPC negotiation. Trace:
0928 19:36:55.485089 (+ 0us) reactor.cc:625] Submitting negotiation task for server connection from 127.0.0.1:32990 (local address 127.0.0.1:38097)
0928 19:36:55.485548 (+ 459us) server_negotiation.cc:206] Beginning negotiation
0928 19:36:55.485572 (+ 24us) server_negotiation.cc:399] Waiting for connection header
0928 19:36:55.485799 (+ 227us) negotiation.cc:327] Negotiation complete: Network error: Server connection negotiation failed: server connection from 127.0.0.1:32990: BlockingRecv error: recv got EOF from 127.0.0.1:32990 (error 108)
Metrics: {"server-negotiator.queue_time_us":124}
[ OK ] Parameters/TestRpcSocketTxRxQueue.AcceptorRxQueueSizeMetric/0 (28 ms)
[----------] 1 test from Parameters/TestRpcSocketTxRxQueue (28 ms total)
[----------] Global test environment tear-down
[==========] 21 tests from 2 test suites ran. (279046 ms total)
[ PASSED ] 20 tests.
[ FAILED ] 1 test, listed below:
[ FAILED ] Parameters/TestRpc.TestCallWithChainCertAndChainCA/SSL_UnixSocket, where GetParam() = (true, true)
1 FAILED TEST