Parameters/TestRpc.TestCallWithChainCertAndRootCA/SSL_UnixSocket: /data0/somelongdirectorytoavoidrpathissues/src/kudu/src/kudu/rpc/rpc-test.cc:303: Failure
Failed
Bad status: Runtime error: could not verify certificate chain (error with cert: subject=CN = localhost, ST = sadfjas, C = AS, emailAddress = sdflkdsajf, O = lskdfjlsad, OU = sldfkja, issuer=C = AS, ST = ASDfkjdhf, L = lskdjf, O = saldfja, OU = skdjf, CN = localhost, emailAddress = sadjflkadsj): : certificate has expired
Google Test trace:
/data0/somelongdirectorytoavoidrpathissues/src/kudu/src/kudu/rpc/rpc-test.cc:300: Connecting to unix:/tmp/dist-test-taskqgm8EH/test-tmp/rpc-test-5fd0bb6fc7e4446fad00106318ec292f.sock
I20260923 14:34:22.858577 29112 test_util.cc:175] -----------------------------------------------
I20260923 14:34:22.858780 29112 test_util.cc:176] Had fatal failures, leaving test files at /tmp/dist-test-taskqgm8EH/test-tmp/rpc-test.2.Parameters_TestRpc.TestCallWithChainCertAndRootCA_SSL_UnixSocket.1790174059370160-29112-0
Note: This is test shard 3 of 8.
[==========] Running 21 tests from 2 test suites.
[----------] Global test environment set-up.
[----------] 1 test from TestRpc
[ RUN ] TestRpc.TestNegotiationTimeout
WARNING: Logging before InitGoogleLogging() is written to STDERR
I20260923 14:34:19.581269 29112 rpc-test-base.h:595] status: Timed out: connection negotiation to 0.0.0.0:45647 for RPC Sleep timed out after 0.100s (ON_OUTBOUND_QUEUE), seconds elapsed: 0.101313
W20260923 14:34:22.521711 29122 negotiation.cc:337] Failed RPC negotiation. Trace:
0923 14:34:19.481075 (+ 0us) reactor.cc:625] Submitting negotiation task for client connection to 0.0.0.0:45647 (local address 127.0.0.1:51650)
0923 14:34:19.481878 (+ 803us) negotiation.cc:107] Waiting for socket to connect
0923 14:34:19.481938 (+ 60us) client_negotiation.cc:174] Beginning negotiation
0923 14:34:19.499682 (+ 17744us) client_negotiation.cc:252] Sending NEGOTIATE NegotiatePB request
0923 14:34:22.520348 (+3020666us) negotiation.cc:327] Negotiation complete: Timed out: Client connection negotiation failed: client connection to 0.0.0.0:45647: received 0 of 4 requested bytes
Metrics: {"client-negotiator.queue_time_us":248}
[ OK ] TestRpc.TestNegotiationTimeout (3095 ms)
[----------] 1 test from TestRpc (3096 ms total)
[----------] 20 tests from Parameters/TestRpc
[ RUN ] Parameters/TestRpc.TestAcceptorPoolStartStop/SSL_UnixSocket
I20260923 14:34:22.569976 29138 acceptor_pool.cc:254] collecting diagnostics on the listening RPC socket unix:/tmp/dist-test-taskqgm8EH/test-tmp/rpc-test-2e1daa91259f4831af7f2bfecbb56cdd.sock every 8 connection(s)
I20260923 14:34:22.573012 29139 acceptor_pool.cc:254] collecting diagnostics on the listening RPC socket unix:/tmp/dist-test-taskqgm8EH/test-tmp/rpc-test-2e1daa91259f4831af7f2bfecbb56cdd.sock every 8 connection(s)
I20260923 14:34:22.617684 29149 acceptor_pool.cc:254] collecting diagnostics on the listening RPC socket unix:/tmp/dist-test-taskqgm8EH/test-tmp/rpc-test-2e1daa91259f4831af7f2bfecbb56cdd.sock every 8 connection(s)
I20260923 14:34:22.621009 29150 acceptor_pool.cc:254] collecting diagnostics on the listening RPC socket unix:/tmp/dist-test-taskqgm8EH/test-tmp/rpc-test-2e1daa91259f4831af7f2bfecbb56cdd.sock every 8 connection(s)
I20260923 14:34:22.651378 29160 acceptor_pool.cc:254] collecting diagnostics on the listening RPC socket unix:/tmp/dist-test-taskqgm8EH/test-tmp/rpc-test-2e1daa91259f4831af7f2bfecbb56cdd.sock every 8 connection(s)
I20260923 14:34:22.652169 29161 acceptor_pool.cc:254] collecting diagnostics on the listening RPC socket unix:/tmp/dist-test-taskqgm8EH/test-tmp/rpc-test-2e1daa91259f4831af7f2bfecbb56cdd.sock every 8 connection(s)
I20260923 14:34:22.673947 29172 acceptor_pool.cc:254] collecting diagnostics on the listening RPC socket unix:/tmp/dist-test-taskqgm8EH/test-tmp/rpc-test-2e1daa91259f4831af7f2bfecbb56cdd.sock every 8 connection(s)
I20260923 14:34:22.674871 29173 acceptor_pool.cc:254] collecting diagnostics on the listening RPC socket unix:/tmp/dist-test-taskqgm8EH/test-tmp/rpc-test-2e1daa91259f4831af7f2bfecbb56cdd.sock every 8 connection(s)
I20260923 14:34:22.691980 29183 acceptor_pool.cc:254] collecting diagnostics on the listening RPC socket unix:/tmp/dist-test-taskqgm8EH/test-tmp/rpc-test-2e1daa91259f4831af7f2bfecbb56cdd.sock every 8 connection(s)
I20260923 14:34:22.692809 29184 acceptor_pool.cc:254] collecting diagnostics on the listening RPC socket unix:/tmp/dist-test-taskqgm8EH/test-tmp/rpc-test-2e1daa91259f4831af7f2bfecbb56cdd.sock every 8 connection(s)
[ OK ] Parameters/TestRpc.TestAcceptorPoolStartStop/SSL_UnixSocket (170 ms)
[ RUN ] Parameters/TestRpc.TestCall/SSL_UnixSocket
I20260923 14:34:22.733335 29196 acceptor_pool.cc:254] collecting diagnostics on the listening RPC socket unix:/tmp/dist-test-taskqgm8EH/test-tmp/rpc-test-dd3dc5c1689e4ab79eb068a9e4e3ae35.sock every 8 connection(s)
I20260923 14:34:22.736910 29197 acceptor_pool.cc:254] collecting diagnostics on the listening RPC socket unix:/tmp/dist-test-taskqgm8EH/test-tmp/rpc-test-dd3dc5c1689e4ab79eb068a9e4e3ae35.sock every 8 connection(s)
I20260923 14:34:22.744354 29112 rpc-test.cc:234] Connecting to unix:/tmp/dist-test-taskqgm8EH/test-tmp/rpc-test-dd3dc5c1689e4ab79eb068a9e4e3ae35.sock
W20260923 14:34:22.808444 29193 connection.cc:196] Error closing socket: Network error: TlsSocket::Close: Broken pipe
[ OK ] Parameters/TestRpc.TestCall/SSL_UnixSocket (116 ms)
[ RUN ] Parameters/TestRpc.TestCallWithChainCertAndRootCA/SSL_UnixSocket
I20260923 14:34:22.832995 29221 acceptor_pool.cc:254] collecting diagnostics on the listening RPC socket unix:/tmp/dist-test-taskqgm8EH/test-tmp/rpc-test-5fd0bb6fc7e4446fad00106318ec292f.sock every 8 connection(s)
I20260923 14:34:22.833935 29222 acceptor_pool.cc:254] collecting diagnostics on the listening RPC socket unix:/tmp/dist-test-taskqgm8EH/test-tmp/rpc-test-5fd0bb6fc7e4446fad00106318ec292f.sock every 8 connection(s)
/data0/somelongdirectorytoavoidrpathissues/src/kudu/src/kudu/rpc/rpc-test.cc:303: Failure
Failed
Bad status: Runtime error: could not verify certificate chain (error with cert: subject=CN = localhost, ST = sadfjas, C = AS, emailAddress = sdflkdsajf, O = lskdfjlsad, OU = sldfkja, issuer=C = AS, ST = ASDfkjdhf, L = lskdjf, O = saldfja, OU = skdjf, CN = localhost, emailAddress = sadjflkadsj): : certificate has expired
Google Test trace:
/data0/somelongdirectorytoavoidrpathissues/src/kudu/src/kudu/rpc/rpc-test.cc:300: Connecting to unix:/tmp/dist-test-taskqgm8EH/test-tmp/rpc-test-5fd0bb6fc7e4446fad00106318ec292f.sock
I20260923 14:34:22.858577 29112 test_util.cc:175] -----------------------------------------------
I20260923 14:34:22.858780 29112 test_util.cc:176] Had fatal failures, leaving test files at /tmp/dist-test-taskqgm8EH/test-tmp/rpc-test.2.Parameters_TestRpc.TestCallWithChainCertAndRootCA_SSL_UnixSocket.1790174059370160-29112-0
[ FAILED ] Parameters/TestRpc.TestCallWithChainCertAndRootCA/SSL_UnixSocket, where GetParam() = (true, true) (45 ms)
[ RUN ] Parameters/TestRpc.TestCallWithBadPasswordProtectedKey/SSL_UnixSocket
[ OK ] Parameters/TestRpc.TestCallWithBadPasswordProtectedKey/SSL_UnixSocket (37 ms)
[ RUN ] Parameters/TestRpc.TestInvalidMethodCall/SSL_UnixSocket
I20260923 14:34:22.915236 29258 acceptor_pool.cc:254] collecting diagnostics on the listening RPC socket unix:/tmp/dist-test-taskqgm8EH/test-tmp/rpc-test-3ee73ab22b794a6591a0c92bf5d3d7cf.sock every 8 connection(s)
I20260923 14:34:22.916152 29259 acceptor_pool.cc:254] collecting diagnostics on the listening RPC socket unix:/tmp/dist-test-taskqgm8EH/test-tmp/rpc-test-3ee73ab22b794a6591a0c92bf5d3d7cf.sock every 8 connection(s)
I20260923 14:34:22.919894 29112 rpc-test.cc:406] Connecting to unix:/tmp/dist-test-taskqgm8EH/test-tmp/rpc-test-3ee73ab22b794a6591a0c92bf5d3d7cf.sock
W20260923 14:34:22.964769 29255 connection.cc:196] Error closing socket: Network error: TlsSocket::Close: Broken pipe
[ OK ] Parameters/TestRpc.TestInvalidMethodCall/SSL_UnixSocket (73 ms)
[ RUN ] Parameters/TestRpc.TestHighFDs/SSL_UnixSocket
I20260923 14:34:23.201426 29283 acceptor_pool.cc:254] collecting diagnostics on the listening RPC socket unix:/tmp/dist-test-taskqgm8EH/test-tmp/rpc-test-df748466c93c4d918532d17290215c0d.sock every 8 connection(s)
I20260923 14:34:23.202399 29284 acceptor_pool.cc:254] collecting diagnostics on the listening RPC socket unix:/tmp/dist-test-taskqgm8EH/test-tmp/rpc-test-df748466c93c4d918532d17290215c0d.sock every 8 connection(s)
W20260923 14:34:23.248096 29280 connection.cc:196] Error closing socket: Network error: TlsSocket::Close: Broken pipe
[ OK ] Parameters/TestRpc.TestHighFDs/SSL_UnixSocket (290 ms)
[ RUN ] Parameters/TestRpc.TestConnectionAlwaysKeepalive/SSL_UnixSocket
I20260923 14:34:23.277017 29306 acceptor_pool.cc:254] collecting diagnostics on the listening RPC socket unix:/tmp/dist-test-taskqgm8EH/test-tmp/rpc-test-a611b1e7cc5d46cab2a987264f16d448.sock every 8 connection(s)
I20260923 14:34:23.277923 29307 acceptor_pool.cc:254] collecting diagnostics on the listening RPC socket unix:/tmp/dist-test-taskqgm8EH/test-tmp/rpc-test-a611b1e7cc5d46cab2a987264f16d448.sock every 8 connection(s)
I20260923 14:34:23.281920 29112 rpc-test.cc:532] Connecting to unix:/tmp/dist-test-taskqgm8EH/test-tmp/rpc-test-a611b1e7cc5d46cab2a987264f16d448.sock
W20260923 14:34:26.321122 29305 connection.cc:196] Error closing socket: Network error: TlsSocket::Close: Broken pipe
[ OK ] Parameters/TestRpc.TestConnectionAlwaysKeepalive/SSL_UnixSocket (3066 ms)
[ RUN ] Parameters/TestRpc.TestReopenOutboundConnections/SSL_UnixSocket
I20260923 14:34:26.372320 29330 acceptor_pool.cc:254] collecting diagnostics on the listening RPC socket unix:/tmp/dist-test-taskqgm8EH/test-tmp/rpc-test-72a759cf65174f399df6b4c031ae3d9a.sock every 8 connection(s)
I20260923 14:34:26.373075 29331 acceptor_pool.cc:254] collecting diagnostics on the listening RPC socket unix:/tmp/dist-test-taskqgm8EH/test-tmp/rpc-test-72a759cf65174f399df6b4c031ae3d9a.sock every 8 connection(s)
I20260923 14:34:26.377519 29112 rpc-test.cc:658] Connecting to unix:/tmp/dist-test-taskqgm8EH/test-tmp/rpc-test-72a759cf65174f399df6b4c031ae3d9a.sock
W20260923 14:34:26.432343 29329 connection.cc:196] Error closing socket: Network error: TlsSocket::Close: Broken pipe
W20260923 14:34:26.444823 29329 connection.cc:196] Error closing socket: Network error: TlsSocket::Close: Broken pipe
W20260923 14:34:26.456743 29329 connection.cc:196] Error closing socket: Network error: TlsSocket::Close: Broken pipe
W20260923 14:34:26.470075 29329 connection.cc:196] Error closing socket: Network error: TlsSocket::Close: Broken pipe
W20260923 14:34:26.482111 29329 connection.cc:196] Error closing socket: Network error: TlsSocket::Close: Broken pipe
W20260923 14:34:26.493829 29329 connection.cc:196] Error closing socket: Network error: TlsSocket::Close: Broken pipe
W20260923 14:34:26.505160 29329 connection.cc:196] Error closing socket: Network error: TlsSocket::Close: Broken pipe
W20260923 14:34:26.518895 29329 connection.cc:196] Error closing socket: Network error: TlsSocket::Close: Broken pipe
W20260923 14:34:26.529675 29329 connection.cc:196] Error closing socket: Network error: TlsSocket::Close: Broken pipe
W20260923 14:34:26.541399 29329 connection.cc:196] Error closing socket: Network error: TlsSocket::Close: Broken pipe
W20260923 14:34:26.553038 29329 connection.cc:196] Error closing socket: Network error: TlsSocket::Close: Broken pipe
W20260923 14:34:26.566810 29329 connection.cc:196] Error closing socket: Network error: TlsSocket::Close: Broken pipe
W20260923 14:34:26.579509 29329 connection.cc:196] Error closing socket: Network error: TlsSocket::Close: Broken pipe
W20260923 14:34:26.591497 29329 connection.cc:196] Error closing socket: Network error: TlsSocket::Close: Broken pipe
W20260923 14:34:26.591722 29330 acceptor_pool.cc:285] unable to collect diagnostics on RPC socket unix:/tmp/dist-test-taskqgm8EH/test-tmp/rpc-test-72a759cf65174f399df6b4c031ae3d9a.sock: Not implemented: netlink diagnostics is currently supported only on IPv4 TCP sockets
W20260923 14:34:26.602675 29329 connection.cc:196] Error closing socket: Network error: TlsSocket::Close: Broken pipe
W20260923 14:34:26.612705 29329 connection.cc:196] Error closing socket: Network error: TlsSocket::Close: Broken pipe
W20260923 14:34:26.622530 29329 connection.cc:196] Error closing socket: Network error: TlsSocket::Close: Broken pipe
W20260923 14:34:26.631916 29329 connection.cc:196] Error closing socket: Network error: TlsSocket::Close: Broken pipe
W20260923 14:34:26.641671 29329 connection.cc:196] Error closing socket: Network error: TlsSocket::Close: Broken pipe
W20260923 14:34:26.651234 29329 connection.cc:196] Error closing socket: Network error: TlsSocket::Close: Broken pipe
W20260923 14:34:26.661880 29329 connection.cc:196] Error closing socket: Network error: TlsSocket::Close: Broken pipe
W20260923 14:34:26.671595 29329 connection.cc:196] Error closing socket: Network error: TlsSocket::Close: Broken pipe
W20260923 14:34:26.681176 29329 connection.cc:196] Error closing socket: Network error: TlsSocket::Close: Broken pipe
W20260923 14:34:26.691727 29329 connection.cc:196] Error closing socket: Network error: TlsSocket::Close: Broken pipe
W20260923 14:34:26.701037 29329 connection.cc:196] Error closing socket: Network error: TlsSocket::Close: Broken pipe
W20260923 14:34:26.712208 29329 connection.cc:196] Error closing socket: Network error: TlsSocket::Close: Broken pipe
W20260923 14:34:26.722939 29329 connection.cc:196] Error closing socket: Network error: TlsSocket::Close: Broken pipe
W20260923 14:34:26.733161 29329 connection.cc:196] Error closing socket: Network error: TlsSocket::Close: Broken pipe
W20260923 14:34:26.743829 29329 connection.cc:196] Error closing socket: Network error: TlsSocket::Close: Broken pipe
W20260923 14:34:26.754535 29329 connection.cc:196] Error closing socket: Network error: TlsSocket::Close: Broken pipe
W20260923 14:34:26.764789 29329 connection.cc:196] Error closing socket: Network error: TlsSocket::Close: Broken pipe
W20260923 14:34:26.782897 29329 connection.cc:196] Error closing socket: Network error: TlsSocket::Close: Broken pipe
[ OK ] Parameters/TestRpc.TestReopenOutboundConnections/SSL_UnixSocket (460 ms)
[ RUN ] Parameters/TestRpc.TestConnectionNetworkPlane/SSL_UnixSocket
I20260923 14:34:26.812052 29353 acceptor_pool.cc:254] collecting diagnostics on the listening RPC socket unix:/tmp/dist-test-taskqgm8EH/test-tmp/rpc-test-04fd085435da4091adae83065f075cdf.sock every 8 connection(s)
I20260923 14:34:26.812916 29354 acceptor_pool.cc:254] collecting diagnostics on the listening RPC socket unix:/tmp/dist-test-taskqgm8EH/test-tmp/rpc-test-04fd085435da4091adae83065f075cdf.sock every 8 connection(s)
I20260923 14:34:26.816498 29112 rpc-test.cc:772] Connecting to unix:/tmp/dist-test-taskqgm8EH/test-tmp/rpc-test-04fd085435da4091adae83065f075cdf.sock
[ OK ] Parameters/TestRpc.TestConnectionNetworkPlane/SSL_UnixSocket (96 ms)
[ RUN ] Parameters/TestRpc.TestTCPKeepalive/SSL_UnixSocket
I20260923 14:34:26.911302 29378 acceptor_pool.cc:254] collecting diagnostics on the listening RPC socket unix:/tmp/dist-test-taskqgm8EH/test-tmp/rpc-test-39e1c7db5cb241f4b910752207b4ab82.sock every 8 connection(s)
I20260923 14:34:26.912150 29379 acceptor_pool.cc:254] collecting diagnostics on the listening RPC socket unix:/tmp/dist-test-taskqgm8EH/test-tmp/rpc-test-39e1c7db5cb241f4b910752207b4ab82.sock every 8 connection(s)
I20260923 14:34:26.943007 29382 rpc-test-base.h:222] got call: sleep_micros: 8000000 deferred: true
I20260923 14:34:34.947639 29382 rpcz_store.cc:275] Call kudu.rpc.GenericCalculatorService.Sleep from unix:<unnamed> (request call id 0) took 8004 ms. Trace:
I20260923 14:34:34.948158 29382 rpcz_store.cc:276] 0923 14:34:26.942824 (+ 0us) service_pool.cc:170] Inserting onto call queue
0923 14:34:26.942932 (+ 108us) service_pool.cc:227] Handling call
0923 14:34:34.947386 (+8004454us) inbound_call.cc:173] Queueing success response
Metrics: {}
W20260923 14:34:34.955937 29375 connection.cc:196] Error closing socket: Network error: TlsSocket::Close: Broken pipe
[ OK ] Parameters/TestRpc.TestTCPKeepalive/SSL_UnixSocket (8080 ms)
[ RUN ] Parameters/TestRpc.TestMaxSmallSidecars/SSL_UnixSocket
I20260923 14:34:34.984489 29404 acceptor_pool.cc:254] collecting diagnostics on the listening RPC socket unix:/tmp/dist-test-taskqgm8EH/test-tmp/rpc-test-1d8f5e683f7e47149c7da43ef36f95af.sock every 8 connection(s)
I20260923 14:34:34.985503 29405 acceptor_pool.cc:254] collecting diagnostics on the listening RPC socket unix:/tmp/dist-test-taskqgm8EH/test-tmp/rpc-test-1d8f5e683f7e47149c7da43ef36f95af.sock every 8 connection(s)
W20260923 14:34:35.173048 29401 connection.cc:196] Error closing socket: Network error: TlsSocket::Close: Broken pipe
[ OK ] Parameters/TestRpc.TestMaxSmallSidecars/SSL_UnixSocket (213 ms)
[ RUN ] Parameters/TestRpc.TestCallTimeout/SSL_UnixSocket
I20260923 14:34:35.211930 29430 acceptor_pool.cc:254] collecting diagnostics on the listening RPC socket unix:/tmp/dist-test-taskqgm8EH/test-tmp/rpc-test-e7fb24d4318e4e4bb7fe14977311b81c.sock every 8 connection(s)
I20260923 14:34:35.212773 29431 acceptor_pool.cc:254] collecting diagnostics on the listening RPC socket unix:/tmp/dist-test-taskqgm8EH/test-tmp/rpc-test-e7fb24d4318e4e4bb7fe14977311b81c.sock every 8 connection(s)
I20260923 14:34:35.231890 29112 rpc-test-base.h:595] status: Timed out: connection negotiation to unix:/tmp/dist-test-taskqgm8EH/test-tmp/rpc-test-e7fb24d4318e4e4bb7fe14977311b81c.sock for RPC Sleep timed out after 0.000s (ON_OUTBOUND_QUEUE), seconds elapsed: 0.00307456
I20260923 14:34:35.239123 29434 rpc-test-base.h:222] got call: sleep_micros: 700000
I20260923 14:34:35.433028 29112 rpc-test-base.h:595] status: Timed out: Sleep RPC to unix:/tmp/dist-test-taskqgm8EH/test-tmp/rpc-test-e7fb24d4318e4e4bb7fe14977311b81c.sock timed out after 0.200s (SENT), seconds elapsed: 0.200681
I20260923 14:34:35.434638 29433 rpc-test-base.h:222] got call: sleep_micros: 2000000
W20260923 14:34:35.939882 29434 rpcz_store.cc:267] Call kudu.rpc.GenericCalculatorService.Sleep from unix:<unnamed> (request call id 1) took 700 ms (client timeout 200 ms). Trace:
W20260923 14:34:35.940313 29434 rpcz_store.cc:269] 0923 14:34:35.238960 (+ 0us) service_pool.cc:170] Inserting onto call queue
0923 14:34:35.239068 (+ 108us) service_pool.cc:227] Handling call
0923 14:34:35.939795 (+700727us) inbound_call.cc:173] Queueing success response
Metrics: {}
I20260923 14:34:36.935600 29112 rpc-test-base.h:595] status: Timed out: Sleep RPC to unix:/tmp/dist-test-taskqgm8EH/test-tmp/rpc-test-e7fb24d4318e4e4bb7fe14977311b81c.sock timed out after 1.500s (SENT), seconds elapsed: 1.50216
W20260923 14:34:37.435356 29433 rpcz_store.cc:267] Call kudu.rpc.GenericCalculatorService.Sleep from unix:<unnamed> (request call id 2) took 2001 ms (client timeout 1500 ms). Trace:
W20260923 14:34:37.435801 29433 rpcz_store.cc:269] 0923 14:34:35.434425 (+ 0us) service_pool.cc:170] Inserting onto call queue
0923 14:34:35.434563 (+ 138us) service_pool.cc:227] Handling call
0923 14:34:37.435276 (+2000713us) inbound_call.cc:173] Queueing success response
Metrics: {}
W20260923 14:34:37.436599 29427 connection.cc:441] server connection from unix:<unnamed> torn down before Call kudu.rpc.GenericCalculatorService.Sleep from unix:<unnamed> (request call id 2) could send its response
[ OK ] Parameters/TestRpc.TestCallTimeout/SSL_UnixSocket (2264 ms)
[ RUN ] Parameters/TestRpc.TestServerShutsDown/SSL_UnixSocket
I20260923 14:34:37.444739 29112 rpc-test.cc:1125] Connecting to 0.0.0.0:45119
W20260923 14:34:37.455930 29447 negotiation.cc:337] Failed RPC negotiation. Trace:
0923 14:34:37.454295 (+ 0us) reactor.cc:625] Submitting negotiation task for client connection to 0.0.0.0:45119 (local address 127.0.0.1:35824)
0923 14:34:37.454799 (+ 504us) negotiation.cc:107] Waiting for socket to connect
0923 14:34:37.454832 (+ 33us) client_negotiation.cc:174] Beginning negotiation
0923 14:34:37.455079 (+ 247us) client_negotiation.cc:252] Sending NEGOTIATE NegotiatePB request
0923 14:34:37.455308 (+ 229us) negotiation.cc:327] Negotiation complete: Network error: Client connection negotiation failed: client connection to 0.0.0.0:45119: BlockingWrite error: write error: Broken pipe (error 32)
Metrics: {"client-negotiator.queue_time_us":124}
[ OK ] Parameters/TestRpc.TestServerShutsDown/SSL_UnixSocket (16 ms)
[ RUN ] Parameters/TestRpc.TimedOutOnResponseMetric/SSL_UnixSocket
I20260923 14:34:37.479398 29464 acceptor_pool.cc:254] collecting diagnostics on the listening RPC socket unix:/tmp/dist-test-taskqgm8EH/test-tmp/rpc-test-bb395a8edfc548179dbf85129a279acb.sock every 8 connection(s)
I20260923 14:34:37.480264 29465 acceptor_pool.cc:254] collecting diagnostics on the listening RPC socket unix:/tmp/dist-test-taskqgm8EH/test-tmp/rpc-test-bb395a8edfc548179dbf85129a279acb.sock every 8 connection(s)
W20260923 14:34:37.732126 29468 rpcz_store.cc:267] Call kudu.rpc_test.CalculatorService.Sleep from unix:<unnamed> (request call id 3) took 50 ms (client timeout 25 ms). Trace:
W20260923 14:34:37.732489 29468 rpcz_store.cc:269] 0923 14:34:37.681424 (+ 0us) service_pool.cc:170] Inserting onto call queue
0923 14:34:37.681590 (+ 166us) service_pool.cc:227] Handling call
0923 14:34:37.732025 (+ 50435us) inbound_call.cc:173] Queueing success response
Related trace 'test_child':
Metrics: {"test_sleep_us":50000,"child_traces":[["test_child",{"related_trace_metric":1}]]}
W20260923 14:34:37.792049 29468 rpcz_store.cc:267] Call kudu.rpc_test.CalculatorService.Sleep from unix:<unnamed> (request call id 4) took 50 ms (client timeout 50 ms). Trace:
W20260923 14:34:37.792937 29468 rpcz_store.cc:269] 0923 14:34:37.741363 (+ 0us) service_pool.cc:170] Inserting onto call queue
0923 14:34:37.741509 (+ 146us) service_pool.cc:227] Handling call
0923 14:34:37.791926 (+ 50417us) inbound_call.cc:173] Queueing success response
Related trace 'test_child':
Metrics: {"test_sleep_us":50000,"child_traces":[["test_child",{"related_trace_metric":1}]]}
[ OK ] Parameters/TestRpc.TimedOutOnResponseMetric/SSL_UnixSocket (343 ms)
[ RUN ] Parameters/TestRpc.AcceptorDispatchingTimesMetric/SSL_UnixSocket
I20260923 14:34:37.816969 29489 acceptor_pool.cc:254] collecting diagnostics on the listening RPC socket 0.0.0.0:41003 every 8 connection(s)
I20260923 14:34:37.817883 29490 acceptor_pool.cc:254] collecting diagnostics on the listening RPC socket 0.0.0.0:41003 every 8 connection(s)
W20260923 14:34:37.824041 29485 negotiation.cc:337] Failed RPC negotiation. Trace:
0923 14:34:37.822375 (+ 0us) reactor.cc:625] Submitting negotiation task for server connection from 127.0.0.1:36060 (local address 127.0.0.1:41003)
0923 14:34:37.822849 (+ 474us) server_negotiation.cc:206] Beginning negotiation
0923 14:34:37.822869 (+ 20us) server_negotiation.cc:399] Waiting for connection header
0923 14:34:37.823156 (+ 287us) negotiation.cc:327] Negotiation complete: Network error: Server connection negotiation failed: server connection from 127.0.0.1:36060: BlockingRecv error: recv got EOF from 127.0.0.1:36060 (error 108)
Metrics: {"server-negotiator.queue_time_us":131}
[ OK ] Parameters/TestRpc.AcceptorDispatchingTimesMetric/SSL_UnixSocket (26 ms)
[ RUN ] Parameters/TestRpc.TestRpcCallbackDestroysMessenger/SSL_UnixSocket
[ OK ] Parameters/TestRpc.TestRpcCallbackDestroysMessenger/SSL_UnixSocket (38 ms)
[ RUN ] Parameters/TestRpc.TestApplicationFeatureFlag/SSL_UnixSocket
I20260923 14:34:37.896652 29514 acceptor_pool.cc:254] collecting diagnostics on the listening RPC socket unix:/tmp/dist-test-taskqgm8EH/test-tmp/rpc-test-1441dfe1c824495497cdc921a369c27b.sock every 8 connection(s)
I20260923 14:34:37.897470 29515 acceptor_pool.cc:254] collecting diagnostics on the listening RPC socket unix:/tmp/dist-test-taskqgm8EH/test-tmp/rpc-test-1441dfe1c824495497cdc921a369c27b.sock every 8 connection(s)
W20260923 14:34:37.930516 29511 messenger.cc:357] Unable to handle RPC call: Not implemented: call requires unsupported application feature flags: 99
[ OK ] Parameters/TestRpc.TestApplicationFeatureFlag/SSL_UnixSocket (70 ms)
[ RUN ] Parameters/TestRpc.TestCancellation/SSL_UnixSocket
I20260923 14:34:37.969568 29539 acceptor_pool.cc:254] collecting diagnostics on the listening RPC socket unix:/tmp/dist-test-taskqgm8EH/test-tmp/rpc-test-d2fe2ed359fe453eb98e4cbdf78436a5.sock every 8 connection(s)
I20260923 14:34:37.970372 29540 acceptor_pool.cc:254] collecting diagnostics on the listening RPC socket unix:/tmp/dist-test-taskqgm8EH/test-tmp/rpc-test-d2fe2ed359fe453eb98e4cbdf78436a5.sock every 8 connection(s)
I20260923 14:34:37.973882 29112 rpc-test.cc:1648] Connecting to unix:/tmp/dist-test-taskqgm8EH/test-tmp/rpc-test-d2fe2ed359fe453eb98e4cbdf78436a5.sock
I20260923 14:34:38.104697 29112 rpc-test-base.h:595] status: Aborted: Sleep RPC to unix:/tmp/dist-test-taskqgm8EH/test-tmp/rpc-test-d2fe2ed359fe453eb98e4cbdf78436a5.sock is cancelled in state READY, seconds elapsed: 0.000404415
I20260923 14:34:38.296006 29112 rpc-test-base.h:595] status: Aborted: Sleep RPC to unix:/tmp/dist-test-taskqgm8EH/test-tmp/rpc-test-d2fe2ed359fe453eb98e4cbdf78436a5.sock is cancelled in state SENT, seconds elapsed: 0.00093033
I20260923 14:34:38.296423 29542 rpc-test-base.h:222] got call: sleep_micros: 510000
I20260923 14:34:38.504463 29112 rpc-test-base.h:595] status: Aborted: Sleep RPC to unix:/tmp/dist-test-taskqgm8EH/test-tmp/rpc-test-d2fe2ed359fe453eb98e4cbdf78436a5.sock is cancelled in state SENT, seconds elapsed: 0.00101367
I20260923 14:34:38.504688 29541 rpc-test-base.h:222] got call: sleep_micros: 510000
I20260923 14:34:38.691542 29112 rpc-test-base.h:595] status: Aborted: Sleep RPC to unix:/tmp/dist-test-taskqgm8EH/test-tmp/rpc-test-d2fe2ed359fe453eb98e4cbdf78436a5.sock is cancelled in state SENT, seconds elapsed: 0.00103673
W20260923 14:34:38.704141 29543 rpcz_store.cc:267] Call kudu.rpc.GenericCalculatorService.Sleep from unix:<unnamed> (request call id 11) took 12 ms (client timeout 10 ms). Trace:
W20260923 14:34:38.704516 29543 rpcz_store.cc:269] 0923 14:34:38.691501 (+ 0us) service_pool.cc:170] Inserting onto call queue
0923 14:34:38.703792 (+ 12291us) service_pool.cc:214] Skipping call since client already timed out
0923 14:34:38.703933 (+ 141us) inbound_call.cc:173] Queueing failure response
Metrics: {}
I20260923 14:34:38.705163 29543 rpc-test-base.h:222] got call: sleep_micros: 1500000
W20260923 14:34:38.807215 29542 rpcz_store.cc:267] Call kudu.rpc.GenericCalculatorService.Sleep from unix:<unnamed> (request call id 3) took 511 ms (client timeout 10 ms). Trace:
W20260923 14:34:38.807739 29542 rpcz_store.cc:269] 0923 14:34:38.296192 (+ 0us) service_pool.cc:170] Inserting onto call queue
0923 14:34:38.296359 (+ 167us) service_pool.cc:227] Handling call
0923 14:34:38.807137 (+510778us) inbound_call.cc:173] Queueing success response
Metrics: {}
W20260923 14:34:39.015414 29541 rpcz_store.cc:267] Call kudu.rpc.GenericCalculatorService.Sleep from unix:<unnamed> (request call id 7) took 511 ms (client timeout 10 ms). Trace:
W20260923 14:34:39.015836 29541 rpcz_store.cc:269] 0923 14:34:38.504474 (+ 0us) service_pool.cc:170] Inserting onto call queue
0923 14:34:38.504623 (+ 149us) service_pool.cc:227] Handling call
0923 14:34:39.015330 (+510707us) inbound_call.cc:173] Queueing success response
Metrics: {}
I20260923 14:34:39.694696 29112 rpc-test-base.h:595] status: Timed out: Sleep RPC to unix:/tmp/dist-test-taskqgm8EH/test-tmp/rpc-test-d2fe2ed359fe453eb98e4cbdf78436a5.sock timed out after 1.000s (SENT), seconds elapsed: 1.00256
I20260923 14:34:39.697310 29541 rpc-test-base.h:222] got call: sleep_micros: 1500000
W20260923 14:34:40.206099 29543 rpcz_store.cc:267] Call kudu.rpc.GenericCalculatorService.Sleep from unix:<unnamed> (request call id 12) took 1513 ms (client timeout 1000 ms). Trace:
W20260923 14:34:40.206542 29543 rpcz_store.cc:269] 0923 14:34:38.692927 (+ 0us) service_pool.cc:170] Inserting onto call queue
0923 14:34:38.705124 (+ 12197us) service_pool.cc:227] Handling call
0923 14:34:40.205909 (+1500785us) inbound_call.cc:173] Queueing success response
Metrics: {}
I20260923 14:34:40.697634 29112 rpc-test-base.h:595] status: Timed out: Sleep RPC to unix:/tmp/dist-test-taskqgm8EH/test-tmp/rpc-test-d2fe2ed359fe453eb98e4cbdf78436a5.sock timed out after 1.000s (SENT), seconds elapsed: 1.00224
W20260923 14:34:40.699502 29536 messenger.cc:357] Unable to handle RPC call: Not implemented: call requires unsupported application feature flags: 99, 1
W20260923 14:34:40.701014 29536 messenger.cc:357] Unable to handle RPC call: Not implemented: call requires unsupported application feature flags: 99, 1
W20260923 14:34:40.944067 29536 connection.cc:196] Error closing socket: Network error: TlsSocket::Close: Broken pipe
W20260923 14:34:41.198159 29541 rpcz_store.cc:267] Call kudu.rpc.GenericCalculatorService.Sleep from unix:<unnamed> (request call id 13) took 1501 ms (client timeout 1000 ms). Trace:
W20260923 14:34:41.198582 29541 rpcz_store.cc:269] 0923 14:34:39.696902 (+ 0us) service_pool.cc:170] Inserting onto call queue
0923 14:34:39.697163 (+ 261us) service_pool.cc:227] Handling call
0923 14:34:41.198075 (+1500912us) inbound_call.cc:173] Queueing success response
Metrics: {}
W20260923 14:34:41.199226 29536 connection.cc:441] server connection from unix:<unnamed> torn down before Call kudu.rpc.GenericCalculatorService.Sleep from unix:<unnamed> (request call id 13) could send its response
[ OK ] Parameters/TestRpc.TestCancellation/SSL_UnixSocket (3269 ms)
[ RUN ] Parameters/TestRpc.TestCancellationMultiThreads/SSL_UnixSocket
I20260923 14:34:41.252804 29565 acceptor_pool.cc:254] collecting diagnostics on the listening RPC socket unix:/tmp/dist-test-taskqgm8EH/test-tmp/rpc-test-3190ea7d8dea4404afddbe2a2dcdbecb.sock every 8 connection(s)
I20260923 14:34:41.253796 29566 acceptor_pool.cc:254] collecting diagnostics on the listening RPC socket unix:/tmp/dist-test-taskqgm8EH/test-tmp/rpc-test-3190ea7d8dea4404afddbe2a2dcdbecb.sock every 8 connection(s)
I20260923 14:34:41.257324 29112 rpc-test.cc:1808] Connecting to unix:/tmp/dist-test-taskqgm8EH/test-tmp/rpc-test-3190ea7d8dea4404afddbe2a2dcdbecb.sock
I20260923 14:34:41.421749 29579 test_util.cc:268] Using random seed: 1647677746
I20260923 14:34:41.423089 29580 test_util.cc:268] Using random seed: 1647679183
I20260923 14:34:41.424928 29581 test_util.cc:268] Using random seed: 1647680896
I20260923 14:34:41.426530 29582 test_util.cc:268] Using random seed: 1647682607
I20260923 14:34:41.428544 29583 test_util.cc:268] Using random seed: 1647684434
I20260923 14:34:41.430840 29584 test_util.cc:268] Using random seed: 1647686761
I20260923 14:34:41.432705 29585 test_util.cc:268] Using random seed: 1647688652
I20260923 14:34:41.436013 29586 test_util.cc:268] Using random seed: 1647691355
I20260923 14:34:41.437794 29587 test_util.cc:268] Using random seed: 1647693771
I20260923 14:34:41.440807 29588 test_util.cc:268] Using random seed: 1647696429
I20260923 14:34:41.443117 29589 test_util.cc:268] Using random seed: 1647698973
I20260923 14:34:41.444715 29590 test_util.cc:268] Using random seed: 1647700623
I20260923 14:34:41.446758 29591 test_util.cc:268] Using random seed: 1647702646
I20260923 14:34:41.448738 29592 test_util.cc:268] Using random seed: 1647704611
I20260923 14:34:41.451649 29593 test_util.cc:268] Using random seed: 1647707503
I20260923 14:34:41.453624 29594 test_util.cc:268] Using random seed: 1647709470
I20260923 14:34:41.456068 29595 test_util.cc:268] Using random seed: 1647711942
I20260923 14:34:41.458009 29596 test_util.cc:268] Using random seed: 1647713892
I20260923 14:34:41.459841 29597 test_util.cc:268] Using random seed: 1647715786
I20260923 14:34:41.462348 29598 test_util.cc:268] Using random seed: 1647718278
I20260923 14:34:41.464463 29599 test_util.cc:268] Using random seed: 1647720353
I20260923 14:34:41.466399 29600 test_util.cc:268] Using random seed: 1647722355
I20260923 14:34:41.468541 29601 test_util.cc:268] Using random seed: 1647724468
I20260923 14:34:41.470901 29602 test_util.cc:268] Using random seed: 1647726820
I20260923 14:34:41.473096 29603 test_util.cc:268] Using random seed: 1647728952
I20260923 14:34:41.475008 29604 test_util.cc:268] Using random seed: 1647730913
I20260923 14:34:41.476928 29605 test_util.cc:268] Using random seed: 1647732776
I20260923 14:34:41.480427 29606 test_util.cc:268] Using random seed: 1647736327
I20260923 14:34:41.484822 29607 test_util.cc:268] Using random seed: 1647740704
I20260923 14:34:41.487336 29608 test_util.cc:268] Using random seed: 1647743228
W20260923 14:35:02.735001 29562 connection.cc:196] Error closing socket: Network error: TlsSocket::Close: Broken pipe
[ OK ] Parameters/TestRpc.TestCancellationMultiThreads/SSL_UnixSocket (21545 ms)
[ RUN ] Parameters/TestRpc.TestCallId/SSL_UnixSocket
I20260923 14:35:02.785593 29622 acceptor_pool.cc:254] collecting diagnostics on the listening RPC socket unix:/tmp/dist-test-taskqgm8EH/test-tmp/rpc-test-000e192dc92a419da0862d396ff0b17c.sock every 8 connection(s)
I20260923 14:35:02.786540 29623 acceptor_pool.cc:254] collecting diagnostics on the listening RPC socket unix:/tmp/dist-test-taskqgm8EH/test-tmp/rpc-test-000e192dc92a419da0862d396ff0b17c.sock every 8 connection(s)
[ OK ] Parameters/TestRpc.TestCallId/SSL_UnixSocket (98 ms)
[----------] 20 tests from Parameters/TestRpc (40327 ms total)
[----------] Global test environment tear-down
[==========] 21 tests from 2 test suites ran. (43424 ms total)
[ PASSED ] 20 tests.
[ FAILED ] 1 test, listed below:
[ FAILED ] Parameters/TestRpc.TestCallWithChainCertAndRootCA/SSL_UnixSocket, where GetParam() = (true, true)
1 FAILED TEST
I20260923 14:35:02.873061 29112 logging.cc:424] LogThrottler /data0/somelongdirectorytoavoidrpathissues/src/kudu/src/kudu/rpc/acceptor_pool.cc:285: suppressed but not reported on 3 messages since previous log ~36 seconds ago