Diagnosed failure

Parameters/TestRpc.TestCallWithChainCertAndChainCA/SSL_TCP: /data0/somelongdirectorytoavoidrpathissues/src/kudu/src/kudu/rpc/rpc-test.cc:270: Failure
Failed
Bad status: Runtime error: could not verify certificate chain (error with cert: subject=CN = localhost, ST = sadfjas, C = AS, emailAddress = sdflkdsajf, O = lskdfjlsad, OU = sldfkja, issuer=C = AS, ST = ASDfkjdhf, L = lskdjf, O = saldfja, OU = skdjf, CN = localhost, emailAddress = sadjflkadsj): : certificate has expired
Google Test trace:
/data0/somelongdirectorytoavoidrpathissues/src/kudu/src/kudu/rpc/rpc-test.cc:267: Connecting to 0.0.0.0:40599
I20260925 17:52:20.209188   379 test_util.cc:175] -----------------------------------------------
I20260925 17:52:20.209256   379 test_util.cc:176] Had fatal failures, leaving test files at /tmp/dist-test-task8Cayon/test-tmp/rpc-test.5.Parameters_TestRpc.TestCallWithChainCertAndChainCA_SSL_TCP.1790358740113702-379-0

Full log

Note: This is test shard 6 of 8.
[==========] Running 21 tests from 2 test suites.
[----------] Global test environment set-up.
[----------] 20 tests from Parameters/TestRpc
[ RUN      ] Parameters/TestRpc.TestMessengerCreateDestroy/SSL_TCP
WARNING: Logging before InitGoogleLogging() is written to STDERR
I20260925 17:52:20.151820   379 rpc-test.cc:169] started messenger TestCreateDestroy
[       OK ] Parameters/TestRpc.TestMessengerCreateDestroy/SSL_TCP (22 ms)
[ RUN      ] Parameters/TestRpc.TestNegotiationDeadlock/SSL_TCP
I20260925 17:52:20.170475   399 acceptor_pool.cc:254] collecting diagnostics on the listening RPC socket 0.0.0.0:35543 every 8 connection(s)
I20260925 17:52:20.170786   400 acceptor_pool.cc:254] collecting diagnostics on the listening RPC socket 0.0.0.0:35543 every 8 connection(s)
[       OK ] Parameters/TestRpc.TestNegotiationDeadlock/SSL_TCP (34 ms)
[ RUN      ] Parameters/TestRpc.TestCallWithChainCertAndChainCA/SSL_TCP
I20260925 17:52:20.198431   415 acceptor_pool.cc:254] collecting diagnostics on the listening RPC socket 0.0.0.0:40599 every 8 connection(s)
I20260925 17:52:20.198737   416 acceptor_pool.cc:254] collecting diagnostics on the listening RPC socket 0.0.0.0:40599 every 8 connection(s)
/data0/somelongdirectorytoavoidrpathissues/src/kudu/src/kudu/rpc/rpc-test.cc:270: Failure
Failed
Bad status: Runtime error: could not verify certificate chain (error with cert: subject=CN = localhost, ST = sadfjas, C = AS, emailAddress = sdflkdsajf, O = lskdfjlsad, OU = sldfkja, issuer=C = AS, ST = ASDfkjdhf, L = lskdjf, O = saldfja, OU = skdjf, CN = localhost, emailAddress = sadjflkadsj): : certificate has expired
Google Test trace:
/data0/somelongdirectorytoavoidrpathissues/src/kudu/src/kudu/rpc/rpc-test.cc:267: Connecting to 0.0.0.0:40599
I20260925 17:52:20.209188   379 test_util.cc:175] -----------------------------------------------
I20260925 17:52:20.209256   379 test_util.cc:176] Had fatal failures, leaving test files at /tmp/dist-test-task8Cayon/test-tmp/rpc-test.5.Parameters_TestRpc.TestCallWithChainCertAndChainCA_SSL_TCP.1790358740113702-379-0
[  FAILED  ] Parameters/TestRpc.TestCallWithChainCertAndChainCA/SSL_TCP, where GetParam() = (true, false) (20 ms)
[ RUN      ] Parameters/TestRpc.TestCallWithPasswordProtectedKey/SSL_TCP
I20260925 17:52:20.228670   440 acceptor_pool.cc:254] collecting diagnostics on the listening RPC socket 0.0.0.0:36117 every 8 connection(s)
I20260925 17:52:20.228900   441 acceptor_pool.cc:254] collecting diagnostics on the listening RPC socket 0.0.0.0:36117 every 8 connection(s)
[       OK ] Parameters/TestRpc.TestCallWithPasswordProtectedKey/SSL_TCP (53 ms)
[ RUN      ] Parameters/TestRpc.TestCallToBadServer/SSL_TCP
I20260925 17:52:20.271775   379 rpc-test.cc:394] Status: Network error: Client connection negotiation failed: client connection to 0.0.0.0:0: connect: Connection refused (error 111)
I20260925 17:52:20.272432   379 rpc-test.cc:394] Status: Network error: Client connection negotiation failed: client connection to 0.0.0.0:0: connect: Connection refused (error 111)
I20260925 17:52:20.273000   379 rpc-test.cc:394] Status: Network error: Client connection negotiation failed: client connection to 0.0.0.0:0: connect: Connection refused (error 111)
I20260925 17:52:20.273499   379 rpc-test.cc:394] Status: Network error: Client connection negotiation failed: client connection to 0.0.0.0:0: connect: Connection refused (error 111)
I20260925 17:52:20.274068   379 rpc-test.cc:394] Status: Network error: Client connection negotiation failed: client connection to 0.0.0.0:0: connect: Connection refused (error 111)
[       OK ] Parameters/TestRpc.TestCallToBadServer/SSL_TCP (13 ms)
[ RUN      ] Parameters/TestRpc.TestWrongService/SSL_TCP
I20260925 17:52:20.287395   475 acceptor_pool.cc:254] collecting diagnostics on the listening RPC socket 0.0.0.0:36993 every 8 connection(s)
I20260925 17:52:20.287679   476 acceptor_pool.cc:254] collecting diagnostics on the listening RPC socket 0.0.0.0:36993 every 8 connection(s)
I20260925 17:52:20.310408   472 messenger.cc:345] service WrongServiceName not registered on TestServer
[       OK ] Parameters/TestRpc.TestWrongService/SSL_TCP (39 ms)
[ RUN      ] Parameters/TestRpc.TestConnectionKeepalive/SSL_TCP
I20260925 17:52:20.356367   498 acceptor_pool.cc:254] collecting diagnostics on the listening RPC socket 0.0.0.0:42549 every 8 connection(s)
I20260925 17:52:20.356593   499 acceptor_pool.cc:254] collecting diagnostics on the listening RPC socket 0.0.0.0:42549 every 8 connection(s)
I20260925 17:52:20.357481   379 rpc-test.cc:488] Connecting to 0.0.0.0:42549
[       OK ] Parameters/TestRpc.TestConnectionKeepalive/SSL_TCP (1069 ms)
[ RUN      ] Parameters/TestRpc.TestClientConnectionMetrics/SSL_TCP
I20260925 17:52:21.405158   523 acceptor_pool.cc:254] collecting diagnostics on the listening RPC socket 0.0.0.0:33403 every 8 connection(s)
I20260925 17:52:21.405424   524 acceptor_pool.cc:254] collecting diagnostics on the listening RPC socket 0.0.0.0:33403 every 8 connection(s)
I20260925 17:52:21.406353   379 rpc-test.cc:569] Connecting to 0.0.0.0:33403
[       OK ] Parameters/TestRpc.TestClientConnectionMetrics/SSL_TCP (19035 ms)
[ RUN      ] Parameters/TestRpc.TestCredentialsPolicy/SSL_TCP
I20260925 17:52:40.443686   546 acceptor_pool.cc:254] collecting diagnostics on the listening RPC socket 0.0.0.0:46753 every 8 connection(s)
I20260925 17:52:40.443933   547 acceptor_pool.cc:254] collecting diagnostics on the listening RPC socket 0.0.0.0:46753 every 8 connection(s)
I20260925 17:52:40.444949   379 rpc-test.cc:700] Connecting to 0.0.0.0:46753
[       OK ] Parameters/TestRpc.TestCredentialsPolicy/SSL_TCP (56 ms)
[ RUN      ] Parameters/TestRpc.TestCallLongerThanKeepalive/SSL_TCP
I20260925 17:52:40.486366   571 acceptor_pool.cc:254] collecting diagnostics on the listening RPC socket 0.0.0.0:42969 every 8 connection(s)
I20260925 17:52:40.486630   572 acceptor_pool.cc:254] collecting diagnostics on the listening RPC socket 0.0.0.0:42969 every 8 connection(s)
I20260925 17:52:40.514397   575 rpc-test-base.h:222] got call: sleep_micros: 3000000 deferred: true
I20260925 17:52:43.516052   575 rpcz_store.cc:275] Call kudu.rpc.GenericCalculatorService.Sleep from 127.0.0.1:33078 (request call id 0) took 3001 ms. Trace:
I20260925 17:52:43.516227   575 rpcz_store.cc:276] 0925 17:52:40.514314 (+     0us) service_pool.cc:170] Inserting onto call queue
0925 17:52:40.514365 (+    51us) service_pool.cc:227] Handling call
0925 17:52:43.516004 (+3001639us) inbound_call.cc:173] Queueing success response
Metrics: {}
[       OK ] Parameters/TestRpc.TestCallLongerThanKeepalive/SSL_TCP (3045 ms)
[ RUN      ] Parameters/TestRpc.TestRpcSidecar/SSL_TCP
I20260925 17:52:43.539708   596 acceptor_pool.cc:254] collecting diagnostics on the listening RPC socket 0.0.0.0:33247 every 8 connection(s)
I20260925 17:52:43.539966   597 acceptor_pool.cc:254] collecting diagnostics on the listening RPC socket 0.0.0.0:33247 every 8 connection(s)
[       OK ] Parameters/TestRpc.TestRpcSidecar/SSL_TCP (126 ms)
[ RUN      ] Parameters/TestRpc.TestRpcSidecarLimits/SSL_TCP
I20260925 17:52:45.716104   621 acceptor_pool.cc:254] collecting diagnostics on the listening RPC socket 0.0.0.0:45665 every 8 connection(s)
I20260925 17:52:45.716390   622 acceptor_pool.cc:254] collecting diagnostics on the listening RPC socket 0.0.0.0:45665 every 8 connection(s)
W20260925 17:52:45.738555   379 serialization.cc:72] Serialized kudu.rpc_test.PushStringsRequestPB (2147483654 bytes) is larger than the maximum configured RPC message size (52428800 bytes). Sending anyway, but peer may reject the data.
W20260925 17:52:45.744567   618 connection.cc:535] server connection from 127.0.0.1:55810 recv error: Network error: RPC frame had a length of 2147483714, but we only support messages up to 52428800 bytes long.
W20260925 17:52:45.744683   618 connection.cc:158] shutting down server connection from 127.0.0.1:55810 with pending inbound data: 4/2147483714 bytes received; last active 0 ns ago: status Network error: RPC frame had a length of 2147483714, but we only support messages up to 52428800 bytes long.
W20260925 17:52:45.745169   634 connection.cc:196] Error closing socket: Network error: TlsSocket::Close: Connection reset by peer
I20260925 17:52:45.770524   646 acceptor_pool.cc:254] collecting diagnostics on the listening RPC socket 0.0.0.0:41403 every 8 connection(s)
I20260925 17:52:45.770659   647 acceptor_pool.cc:254] collecting diagnostics on the listening RPC socket 0.0.0.0:41403 every 8 connection(s)
W20260925 17:52:50.823729   645 connection.cc:577] server connection from 127.0.0.1:35714: received bad data: 'Corruption: Invalid packet: message had a length of 2147483710, but we only support messages up to 2147483647 bytes
'
[       OK ] Parameters/TestRpc.TestRpcSidecarLimits/SSL_TCP (7634 ms)
[ RUN      ] Parameters/TestRpc.TestCallTimeoutDoesntAffectNegotiation/SSL_TCP
I20260925 17:52:51.302212   671 acceptor_pool.cc:254] collecting diagnostics on the listening RPC socket 0.0.0.0:40355 every 8 connection(s)
I20260925 17:52:51.302472   672 acceptor_pool.cc:254] collecting diagnostics on the listening RPC socket 0.0.0.0:40355 every 8 connection(s)
W20260925 17:52:51.335191   667 negotiation.cc:266] Injecting 500ms delay in negotiation
I20260925 17:52:51.385610   379 rpc-test-base.h:595] status: Timed out: connection negotiation to 0.0.0.0:40355 for RPC Sleep timed out after 0.050s (ON_OUTBOUND_QUEUE), seconds elapsed: 0.0509725
[       OK ] Parameters/TestRpc.TestCallTimeoutDoesntAffectNegotiation/SSL_TCP (561 ms)
[ RUN      ] Parameters/TestRpc.TestRpcHandlerLatencyMetric/SSL_TCP
I20260925 17:52:51.856851   696 acceptor_pool.cc:254] collecting diagnostics on the listening RPC socket 0.0.0.0:45153 every 8 connection(s)
I20260925 17:52:51.857079   697 acceptor_pool.cc:254] collecting diagnostics on the listening RPC socket 0.0.0.0:45153 every 8 connection(s)
I20260925 17:52:51.901971   379 rpc-test.cc:1236] Sleep() min lat: 20614
I20260925 17:52:51.902067   379 rpc-test.cc:1237] Sleep() mean lat: 20614
I20260925 17:52:51.902122   379 rpc-test.cc:1238] Sleep() max lat: 20614
I20260925 17:52:51.902215   379 rpc-test.cc:1239] Sleep() #calls: 1
[       OK ] Parameters/TestRpc.TestRpcHandlerLatencyMetric/SSL_TCP (61 ms)
[ RUN      ] Parameters/TestRpc.TimedOutOnResponseMetricServiceQueue/SSL_TCP
I20260925 17:52:51.924592   722 acceptor_pool.cc:254] collecting diagnostics on the listening RPC socket 0.0.0.0:40577 every 8 connection(s)
I20260925 17:52:51.924805   723 acceptor_pool.cc:254] collecting diagnostics on the listening RPC socket 0.0.0.0:40577 every 8 connection(s)
W20260925 17:52:51.999544   724 rpcz_store.cc:267] Call kudu.rpc_test.CalculatorService.Sleep from 127.0.0.1:40988 (request call id 2) took 20 ms (client timeout 20 ms). Trace:
W20260925 17:52:51.999719   724 rpcz_store.cc:269] 0925 17:52:51.979149 (+     0us) service_pool.cc:170] Inserting onto call queue
0925 17:52:51.999422 (+ 20273us) service_pool.cc:214] Skipping call since client already timed out
0925 17:52:51.999490 (+    68us) inbound_call.cc:173] Queueing failure response
Metrics: {}
[       OK ] Parameters/TestRpc.TimedOutOnResponseMetricServiceQueue/SSL_TCP (97 ms)
[ RUN      ] Parameters/TestRpc.RpcPendingConnectionsMetric/SSL_TCP
I20260925 17:52:52.008733   745 acceptor_pool.cc:254] collecting diagnostics on the listening RPC socket 0.0.0.0:38295 every 8 connection(s)
I20260925 17:52:52.008955   746 acceptor_pool.cc:254] collecting diagnostics on the listening RPC socket 0.0.0.0:38295 every 8 connection(s)
W20260925 17:52:52.018667   741 negotiation.cc:337] Failed RPC negotiation. Trace:
0925 17:52:52.017868 (+     0us) reactor.cc:625] Submitting negotiation task for server connection from 127.0.0.1:53876 (local address 127.0.0.1:38295)
0925 17:52:52.018065 (+   197us) server_negotiation.cc:206] Beginning negotiation
0925 17:52:52.018072 (+     7us) server_negotiation.cc:399] Waiting for connection header
0925 17:52:52.018247 (+   175us) negotiation.cc:327] Negotiation complete: Network error: Server connection negotiation failed: server connection from 127.0.0.1:53876: BlockingRecv error: recv got EOF from 127.0.0.1:53876 (error 108)
Metrics: {"server-negotiator.queue_time_us":50}
[       OK ] Parameters/TestRpc.RpcPendingConnectionsMetric/SSL_TCP (26 ms)
[ RUN      ] Parameters/TestRpc.TestRpcContextClientDeadline/SSL_TCP
I20260925 17:52:52.038487   761 acceptor_pool.cc:254] collecting diagnostics on the listening RPC socket 0.0.0.0:33697 every 8 connection(s)
I20260925 17:52:52.038699   762 acceptor_pool.cc:254] collecting diagnostics on the listening RPC socket 0.0.0.0:33697 every 8 connection(s)
[       OK ] Parameters/TestRpc.TestRpcContextClientDeadline/SSL_TCP (71 ms)
[ RUN      ] Parameters/TestRpc.TestApplicationFeatureFlagUnsupportedServer/SSL_TCP
I20260925 17:52:52.110303   786 acceptor_pool.cc:254] collecting diagnostics on the listening RPC socket 0.0.0.0:36761 every 8 connection(s)
I20260925 17:52:52.110545   787 acceptor_pool.cc:254] collecting diagnostics on the listening RPC socket 0.0.0.0:36761 every 8 connection(s)
[       OK ] Parameters/TestRpc.TestApplicationFeatureFlagUnsupportedServer/SSL_TCP (37 ms)
[ RUN      ] Parameters/TestRpc.TestCancellationAsync/SSL_TCP
I20260925 17:52:52.148762   811 acceptor_pool.cc:254] collecting diagnostics on the listening RPC socket 0.0.0.0:44773 every 8 connection(s)
I20260925 17:52:52.149019   812 acceptor_pool.cc:254] collecting diagnostics on the listening RPC socket 0.0.0.0:44773 every 8 connection(s)
I20260925 17:52:52.149811   379 rpc-test.cc:1716] Connecting to 0.0.0.0:44773
I20260925 17:52:52.170307   379 test_util.cc:268] Using random seed: 1654832683
I20260925 17:52:52.203326   815 rpc-test-base.h:240] got call: sleep_micros: 500 pattern: 4294967295 num_repetitions: 2097152 sidecar_idx: 0
I20260925 17:52:52.222213   814 rpc-test-base.h:240] got call: sleep_micros: 500 pattern: 4294967295 num_repetitions: 2097152 sidecar_idx: 0
I20260925 17:52:52.247588   813 rpc-test-base.h:240] got call: sleep_micros: 500 pattern: 4294967295 num_repetitions: 2097152 sidecar_idx: 0
I20260925 17:52:52.279345   815 rpc-test-base.h:240] got call: sleep_micros: 500 pattern: 4294967295 num_repetitions: 2097152 sidecar_idx: 0
I20260925 17:52:52.297191   814 rpc-test-base.h:240] got call: sleep_micros: 500 pattern: 4294967295 num_repetitions: 2097152 sidecar_idx: 0
W20260925 17:52:52.321239   808 connection.cc:196] Error closing socket: Network error: TlsSocket::Close: Broken pipe
W20260925 17:52:52.324688   808 connection.cc:441] server connection from 127.0.0.1:33236 torn down before Call kudu.rpc.GenericCalculatorService.SleepWithSidecar from 127.0.0.1:33236 (request call id 6) could send its response
W20260925 17:52:52.341094   808 connection.cc:441] server connection from 127.0.0.1:33236 torn down before Call kudu.rpc.GenericCalculatorService.SleepWithSidecar from 127.0.0.1:33236 (request call id 7) could send its response
W20260925 17:52:52.352819   808 connection.cc:441] server connection from 127.0.0.1:33236 torn down before Call kudu.rpc.GenericCalculatorService.SleepWithSidecar from 127.0.0.1:33236 (request call id 8) could send its response
[       OK ] Parameters/TestRpc.TestCancellationAsync/SSL_TCP (216 ms)
[ RUN      ] Parameters/TestRpc.TestPerformanceBySocketType/SSL_TCP
I20260925 17:52:52.383826   836 acceptor_pool.cc:254] collecting diagnostics on the listening RPC socket 0.0.0.0:37235 every 8 connection(s)
I20260925 17:52:52.384111   837 acceptor_pool.cc:254] collecting diagnostics on the listening RPC socket 0.0.0.0:37235 every 8 connection(s)
I20260925 17:52:52.384948   379 rpc-test.cc:1846] Connecting to 0.0.0.0:37235
I20260925 17:52:55.086921   379 rpc-test.cc:1859] Sending 1024MB via ssl-enabled tcp socket: real 2.679s	user 2.570s	sys 1.889s
I20260925 17:52:57.836792   379 rpc-test.cc:1859] Sending 1024MB via ssl-enabled tcp socket: real 2.750s	user 2.599s	sys 1.986s
I20260925 17:53:00.591678   379 rpc-test.cc:1859] Sending 1024MB via ssl-enabled tcp socket: real 2.755s	user 2.543s	sys 2.041s
I20260925 17:53:03.324348   379 rpc-test.cc:1859] Sending 1024MB via ssl-enabled tcp socket: real 2.733s	user 2.429s	sys 2.115s
I20260925 17:53:06.053592   379 rpc-test.cc:1859] Sending 1024MB via ssl-enabled tcp socket: real 2.729s	user 2.575s	sys 1.988s
[       OK ] Parameters/TestRpc.TestPerformanceBySocketType/SSL_TCP (13704 ms)
[----------] 20 tests from Parameters/TestRpc (45928 ms total)

[----------] 1 test from Parameters/TestRpcSocketTxRxQueue
[ RUN      ] Parameters/TestRpcSocketTxRxQueue.OverCapacity/0
W20260925 17:53:06.360944   862 negotiation.cc:337] Failed RPC negotiation. Trace:
0925 17:53:06.072443 (+     0us) reactor.cc:625] Submitting negotiation task for client connection to 0.0.0.0:41989 (local address 127.0.0.1:42934)
0925 17:53:06.072590 (+   147us) negotiation.cc:107] Waiting for socket to connect
0925 17:53:06.072605 (+    15us) client_negotiation.cc:174] Beginning negotiation
0925 17:53:06.072702 (+    97us) client_negotiation.cc:252] Sending NEGOTIATE NegotiatePB request
0925 17:53:06.360570 (+287868us) negotiation.cc:327] Negotiation complete: Network error: Client connection negotiation failed: client connection to 0.0.0.0:41989: BlockingRecv error: recv error from unknown peer: Transport endpoint is not connected (error 107)
Metrics: {"client-negotiator.queue_time_us":30}
W20260925 17:53:06.360973   853 negotiation.cc:337] Failed RPC negotiation. Trace:
0925 17:53:06.069998 (+     0us) reactor.cc:625] Submitting negotiation task for client connection to 0.0.0.0:41989 (local address 127.0.0.1:42926)
0925 17:53:06.070178 (+   180us) negotiation.cc:107] Waiting for socket to connect
0925 17:53:06.070194 (+    16us) client_negotiation.cc:174] Beginning negotiation
0925 17:53:06.070290 (+    96us) client_negotiation.cc:252] Sending NEGOTIATE NegotiatePB request
0925 17:53:06.360624 (+290334us) negotiation.cc:327] Negotiation complete: Network error: Client connection negotiation failed: client connection to 0.0.0.0:41989: BlockingRecv error: recv error from unknown peer: Transport endpoint is not connected (error 107)
Metrics: {"client-negotiator.queue_time_us":56}
W20260925 17:53:06.360986   880 negotiation.cc:337] Failed RPC negotiation. Trace:
0925 17:53:06.077424 (+     0us) reactor.cc:625] Submitting negotiation task for client connection to 0.0.0.0:41989 (local address 127.0.0.1:42964)
0925 17:53:06.077644 (+   220us) negotiation.cc:107] Waiting for socket to connect
0925 17:53:06.077661 (+    17us) client_negotiation.cc:174] Beginning negotiation
0925 17:53:06.077772 (+   111us) client_negotiation.cc:252] Sending NEGOTIATE NegotiatePB request
0925 17:53:06.360770 (+282998us) negotiation.cc:327] Negotiation complete: Network error: Client connection negotiation failed: client connection to 0.0.0.0:41989: BlockingRecv error: recv error from unknown peer: Transport endpoint is not connected (error 107)
Metrics: {"client-negotiator.queue_time_us":85}
W20260925 17:53:06.361979   898 negotiation.cc:337] Failed RPC negotiation. Trace:
0925 17:53:06.082696 (+     0us) reactor.cc:625] Submitting negotiation task for client connection to 0.0.0.0:41989 (local address 127.0.0.1:42982)
0925 17:53:06.082846 (+   150us) negotiation.cc:107] Waiting for socket to connect
0925 17:53:06.082862 (+    16us) client_negotiation.cc:174] Beginning negotiation
0925 17:53:06.082953 (+    91us) client_negotiation.cc:252] Sending NEGOTIATE NegotiatePB request
0925 17:53:06.360570 (+277617us) negotiation.cc:327] Negotiation complete: Network error: Client connection negotiation failed: client connection to 0.0.0.0:41989: BlockingRecv error: recv error from unknown peer: Transport endpoint is not connected (error 107)
Metrics: {"client-negotiator.queue_time_us":29}
W20260925 17:53:06.364127   871 negotiation.cc:337] Failed RPC negotiation. Trace:
0925 17:53:06.074694 (+     0us) reactor.cc:625] Submitting negotiation task for client connection to 0.0.0.0:41989 (local address 127.0.0.1:42950)
0925 17:53:06.074844 (+   150us) negotiation.cc:107] Waiting for socket to connect
0925 17:53:06.074864 (+    20us) client_negotiation.cc:174] Beginning negotiation
0925 17:53:06.074984 (+   120us) client_negotiation.cc:252] Sending NEGOTIATE NegotiatePB request
0925 17:53:06.360570 (+285586us) negotiation.cc:327] Negotiation complete: Network error: Client connection negotiation failed: client connection to 0.0.0.0:41989: BlockingRecv error: recv error from unknown peer: Transport endpoint is not connected (error 107)
Metrics: {"client-negotiator.queue_time_us":30}
W20260925 17:53:06.364876   889 negotiation.cc:337] Failed RPC negotiation. Trace:
0925 17:53:06.079996 (+     0us) reactor.cc:625] Submitting negotiation task for client connection to 0.0.0.0:41989 (local address 127.0.0.1:42974)
0925 17:53:06.080191 (+   195us) negotiation.cc:107] Waiting for socket to connect
0925 17:53:06.080207 (+    16us) client_negotiation.cc:174] Beginning negotiation
0925 17:53:06.080341 (+   134us) client_negotiation.cc:252] Sending NEGOTIATE NegotiatePB request
0925 17:53:06.362708 (+282367us) negotiation.cc:327] Negotiation complete: Network error: Client connection negotiation failed: client connection to 0.0.0.0:41989: BlockingRecv error: recv error from unknown peer: Transport endpoint is not connected (error 107)
Metrics: {"client-negotiator.queue_time_us":64}
[       OK ] Parameters/TestRpcSocketTxRxQueue.OverCapacity/0 (1066 ms)
[----------] 1 test from Parameters/TestRpcSocketTxRxQueue (1066 ms total)

[----------] Global test environment tear-down
[==========] 21 tests from 2 test suites ran. (46994 ms total)
[  PASSED  ] 20 tests.
[  FAILED  ] 1 test, listed below:
[  FAILED  ] Parameters/TestRpc.TestCallWithChainCertAndChainCA/SSL_TCP, where GetParam() = (true, false)

 1 FAILED TEST