Diagnosed failure
Parameters/TestRpc.TestCallWithChainCertAndChainCA/SSL_UnixSocket: /data0/somelongdirectorytoavoidrpathissues/src/kudu/src/kudu/rpc/rpc-test.cc:270: Failure
Failed
Bad status: Runtime error: could not verify certificate chain (error with cert: subject=CN = localhost, ST = sadfjas, C = AS, emailAddress = sdflkdsajf, O = lskdfjlsad, OU = sldfkja, issuer=C = AS, ST = ASDfkjdhf, L = lskdjf, O = saldfja, OU = skdjf, CN = localhost, emailAddress = sadjflkadsj): : certificate has expired
Google Test trace:
/data0/somelongdirectorytoavoidrpathissues/src/kudu/src/kudu/rpc/rpc-test.cc:267: Connecting to unix:/tmp/dist-test-task5ZPkl8/test-tmp/rpc-test-6a5d90618aac4ec296b1c18ba687ae3d.sock
I20260926 17:58:40.125814 5618 test_util.cc:175] -----------------------------------------------
I20260926 17:58:40.125855 5618 test_util.cc:176] Had fatal failures, leaving test files at /tmp/dist-test-task5ZPkl8/test-tmp/rpc-test.6.Parameters_TestRpc.TestCallWithChainCertAndChainCA_SSL_UnixSocket.1790445520069484-5618-0
Full log
Note: This is test shard 7 of 8.
[==========] Running 21 tests from 2 test suites.
[----------] Global test environment set-up.
[----------] 20 tests from Parameters/TestRpc
[ RUN ] Parameters/TestRpc.TestMessengerCreateDestroy/SSL_UnixSocket
WARNING: Logging before InitGoogleLogging() is written to STDERR
I20260926 17:58:40.088967 5618 rpc-test.cc:169] started messenger TestCreateDestroy
[ OK ] Parameters/TestRpc.TestMessengerCreateDestroy/SSL_UnixSocket (17 ms)
[ RUN ] Parameters/TestRpc.TestNegotiationDeadlock/SSL_UnixSocket
I20260926 17:58:40.102249 5638 acceptor_pool.cc:254] collecting diagnostics on the listening RPC socket unix:/tmp/dist-test-task5ZPkl8/test-tmp/rpc-test-810516628baf445b8c0bb8c62a119da4.sock every 8 connection(s)
I20260926 17:58:40.102262 5639 acceptor_pool.cc:254] collecting diagnostics on the listening RPC socket unix:/tmp/dist-test-task5ZPkl8/test-tmp/rpc-test-810516628baf445b8c0bb8c62a119da4.sock every 8 connection(s)
[ OK ] Parameters/TestRpc.TestNegotiationDeadlock/SSL_UnixSocket (18 ms)
[ RUN ] Parameters/TestRpc.TestCallWithChainCertAndChainCA/SSL_UnixSocket
I20260926 17:58:40.122442 5654 acceptor_pool.cc:254] collecting diagnostics on the listening RPC socket unix:/tmp/dist-test-task5ZPkl8/test-tmp/rpc-test-6a5d90618aac4ec296b1c18ba687ae3d.sock every 8 connection(s)
I20260926 17:58:40.122462 5655 acceptor_pool.cc:254] collecting diagnostics on the listening RPC socket unix:/tmp/dist-test-task5ZPkl8/test-tmp/rpc-test-6a5d90618aac4ec296b1c18ba687ae3d.sock every 8 connection(s)
/data0/somelongdirectorytoavoidrpathissues/src/kudu/src/kudu/rpc/rpc-test.cc:270: Failure
Failed
Bad status: Runtime error: could not verify certificate chain (error with cert: subject=CN = localhost, ST = sadfjas, C = AS, emailAddress = sdflkdsajf, O = lskdfjlsad, OU = sldfkja, issuer=C = AS, ST = ASDfkjdhf, L = lskdjf, O = saldfja, OU = skdjf, CN = localhost, emailAddress = sadjflkadsj): : certificate has expired
Google Test trace:
/data0/somelongdirectorytoavoidrpathissues/src/kudu/src/kudu/rpc/rpc-test.cc:267: Connecting to unix:/tmp/dist-test-task5ZPkl8/test-tmp/rpc-test-6a5d90618aac4ec296b1c18ba687ae3d.sock
I20260926 17:58:40.125814 5618 test_util.cc:175] -----------------------------------------------
I20260926 17:58:40.125855 5618 test_util.cc:176] Had fatal failures, leaving test files at /tmp/dist-test-task5ZPkl8/test-tmp/rpc-test.6.Parameters_TestRpc.TestCallWithChainCertAndChainCA_SSL_UnixSocket.1790445520069484-5618-0
[ FAILED ] Parameters/TestRpc.TestCallWithChainCertAndChainCA/SSL_UnixSocket, where GetParam() = (true, true) (17 ms)
[ RUN ] Parameters/TestRpc.TestCallWithPasswordProtectedKey/SSL_UnixSocket
I20260926 17:58:40.137527 5679 acceptor_pool.cc:254] collecting diagnostics on the listening RPC socket unix:/tmp/dist-test-task5ZPkl8/test-tmp/rpc-test-2c4ff16e6ac342f5b8028d90ae165eaa.sock every 8 connection(s)
I20260926 17:58:40.137560 5680 acceptor_pool.cc:254] collecting diagnostics on the listening RPC socket unix:/tmp/dist-test-task5ZPkl8/test-tmp/rpc-test-2c4ff16e6ac342f5b8028d90ae165eaa.sock every 8 connection(s)
W20260926 17:58:40.147684 5676 connection.cc:196] Error closing socket: Network error: TlsSocket::Close: Broken pipe
[ OK ] Parameters/TestRpc.TestCallWithPasswordProtectedKey/SSL_UnixSocket (23 ms)
[ RUN ] Parameters/TestRpc.TestCallToBadServer/SSL_UnixSocket
I20260926 17:58:40.176548 5618 rpc-test.cc:394] Status: Network error: Client connection negotiation failed: client connection to 0.0.0.0:0: connect: Connection refused (error 111)
I20260926 17:58:40.176855 5618 rpc-test.cc:394] Status: Network error: Client connection negotiation failed: client connection to 0.0.0.0:0: connect: Connection refused (error 111)
I20260926 17:58:40.177078 5618 rpc-test.cc:394] Status: Network error: Client connection negotiation failed: client connection to 0.0.0.0:0: connect: Connection refused (error 111)
I20260926 17:58:40.177259 5618 rpc-test.cc:394] Status: Network error: Client connection negotiation failed: client connection to 0.0.0.0:0: connect: Connection refused (error 111)
I20260926 17:58:40.177453 5618 rpc-test.cc:394] Status: Network error: Client connection negotiation failed: client connection to 0.0.0.0:0: connect: Connection refused (error 111)
[ OK ] Parameters/TestRpc.TestCallToBadServer/SSL_UnixSocket (29 ms)
[ RUN ] Parameters/TestRpc.TestWrongService/SSL_UnixSocket
I20260926 17:58:40.188609 5714 acceptor_pool.cc:254] collecting diagnostics on the listening RPC socket unix:/tmp/dist-test-task5ZPkl8/test-tmp/rpc-test-abfd1596951f468cbadc6c72ae08a881.sock every 8 connection(s)
I20260926 17:58:40.188652 5715 acceptor_pool.cc:254] collecting diagnostics on the listening RPC socket unix:/tmp/dist-test-task5ZPkl8/test-tmp/rpc-test-abfd1596951f468cbadc6c72ae08a881.sock every 8 connection(s)
I20260926 17:58:40.220568 5711 messenger.cc:345] service WrongServiceName not registered on TestServer
W20260926 17:58:40.221110 5711 connection.cc:196] Error closing socket: Network error: TlsSocket::Close: Broken pipe
[ OK ] Parameters/TestRpc.TestWrongService/SSL_UnixSocket (44 ms)
[ RUN ] Parameters/TestRpc.TestConnectionKeepalive/SSL_UnixSocket
I20260926 17:58:40.231264 5737 acceptor_pool.cc:254] collecting diagnostics on the listening RPC socket unix:/tmp/dist-test-task5ZPkl8/test-tmp/rpc-test-2fb4e91d81e84c82ac4ec7721c23ed43.sock every 8 connection(s)
I20260926 17:58:40.231316 5738 acceptor_pool.cc:254] collecting diagnostics on the listening RPC socket unix:/tmp/dist-test-task5ZPkl8/test-tmp/rpc-test-2fb4e91d81e84c82ac4ec7721c23ed43.sock every 8 connection(s)
I20260926 17:58:40.231455 5618 rpc-test.cc:488] Connecting to unix:/tmp/dist-test-task5ZPkl8/test-tmp/rpc-test-2fb4e91d81e84c82ac4ec7721c23ed43.sock
W20260926 17:58:40.723174 5750 connection.cc:196] Error closing socket: Network error: TlsSocket::Close: Broken pipe
[ OK ] Parameters/TestRpc.TestConnectionKeepalive/SSL_UnixSocket (1038 ms)
[ RUN ] Parameters/TestRpc.TestClientConnectionMetrics/SSL_UnixSocket
I20260926 17:58:41.273743 5762 acceptor_pool.cc:254] collecting diagnostics on the listening RPC socket unix:/tmp/dist-test-task5ZPkl8/test-tmp/rpc-test-b45d76fef49241d5b93087380416d043.sock every 8 connection(s)
I20260926 17:58:41.273872 5763 acceptor_pool.cc:254] collecting diagnostics on the listening RPC socket unix:/tmp/dist-test-task5ZPkl8/test-tmp/rpc-test-b45d76fef49241d5b93087380416d043.sock every 8 connection(s)
I20260926 17:58:41.273999 5618 rpc-test.cc:569] Connecting to unix:/tmp/dist-test-task5ZPkl8/test-tmp/rpc-test-b45d76fef49241d5b93087380416d043.sock
W20260926 17:58:49.432315 5759 connection.cc:196] Error closing socket: Network error: TlsSocket::Close: Broken pipe
[ OK ] Parameters/TestRpc.TestClientConnectionMetrics/SSL_UnixSocket (8172 ms)
[ RUN ] Parameters/TestRpc.TestCredentialsPolicy/SSL_UnixSocket
I20260926 17:58:49.443838 5785 acceptor_pool.cc:254] collecting diagnostics on the listening RPC socket unix:/tmp/dist-test-task5ZPkl8/test-tmp/rpc-test-4cd5da3fd407494da5facd0c0f6dc6f4.sock every 8 connection(s)
I20260926 17:58:49.443918 5786 acceptor_pool.cc:254] collecting diagnostics on the listening RPC socket unix:/tmp/dist-test-task5ZPkl8/test-tmp/rpc-test-4cd5da3fd407494da5facd0c0f6dc6f4.sock every 8 connection(s)
I20260926 17:58:49.444037 5618 rpc-test.cc:700] Connecting to unix:/tmp/dist-test-task5ZPkl8/test-tmp/rpc-test-4cd5da3fd407494da5facd0c0f6dc6f4.sock
W20260926 17:58:49.467880 5784 connection.cc:196] Error closing socket: Network error: TlsSocket::Close: Broken pipe
[ OK ] Parameters/TestRpc.TestCredentialsPolicy/SSL_UnixSocket (38 ms)
[ RUN ] Parameters/TestRpc.TestCallLongerThanKeepalive/SSL_UnixSocket
I20260926 17:58:49.497279 5810 acceptor_pool.cc:254] collecting diagnostics on the listening RPC socket unix:/tmp/dist-test-task5ZPkl8/test-tmp/rpc-test-3815115784a7468dbd3ce4122326f511.sock every 8 connection(s)
I20260926 17:58:49.497349 5811 acceptor_pool.cc:254] collecting diagnostics on the listening RPC socket unix:/tmp/dist-test-task5ZPkl8/test-tmp/rpc-test-3815115784a7468dbd3ce4122326f511.sock every 8 connection(s)
I20260926 17:58:49.514350 5814 rpc-test-base.h:222] got call: sleep_micros: 3000000 deferred: true
I20260926 17:58:52.515009 5814 rpcz_store.cc:275] Call kudu.rpc.GenericCalculatorService.Sleep from unix:<unnamed> (request call id 0) took 3000 ms. Trace:
I20260926 17:58:52.515115 5814 rpcz_store.cc:276] 0926 17:58:49.514305 (+ 0us) service_pool.cc:170] Inserting onto call queue
0926 17:58:49.514334 (+ 29us) service_pool.cc:227] Handling call
0926 17:58:52.514993 (+3000659us) inbound_call.cc:173] Queueing success response
Metrics: {}
[ OK ] Parameters/TestRpc.TestCallLongerThanKeepalive/SSL_UnixSocket (3045 ms)
[ RUN ] Parameters/TestRpc.TestRpcSidecar/SSL_UnixSocket
I20260926 17:58:52.537896 5835 acceptor_pool.cc:254] collecting diagnostics on the listening RPC socket unix:/tmp/dist-test-task5ZPkl8/test-tmp/rpc-test-17aa174a25d940ad9ad222d2ff3eef25.sock every 8 connection(s)
I20260926 17:58:52.537952 5836 acceptor_pool.cc:254] collecting diagnostics on the listening RPC socket unix:/tmp/dist-test-task5ZPkl8/test-tmp/rpc-test-17aa174a25d940ad9ad222d2ff3eef25.sock every 8 connection(s)
W20260926 17:58:52.580106 5832 connection.cc:196] Error closing socket: Network error: TlsSocket::Close: Broken pipe
[ OK ] Parameters/TestRpc.TestRpcSidecar/SSL_UnixSocket (64 ms)
[ RUN ] Parameters/TestRpc.TestRpcSidecarLimits/SSL_UnixSocket
I20260926 17:58:54.212827 5861 acceptor_pool.cc:254] collecting diagnostics on the listening RPC socket unix:/tmp/dist-test-task5ZPkl8/test-tmp/rpc-test-610a254a789c4b25888984f23b7cb311.sock every 8 connection(s)
I20260926 17:58:54.212831 5860 acceptor_pool.cc:254] collecting diagnostics on the listening RPC socket unix:/tmp/dist-test-task5ZPkl8/test-tmp/rpc-test-610a254a789c4b25888984f23b7cb311.sock every 8 connection(s)
W20260926 17:58:54.222966 5618 serialization.cc:72] Serialized kudu.rpc_test.PushStringsRequestPB (2147483654 bytes) is larger than the maximum configured RPC message size (52428800 bytes). Sending anyway, but peer may reject the data.
W20260926 17:58:54.225761 5857 connection.cc:535] server connection from unix:<unnamed> recv error: Network error: RPC frame had a length of 2147483714, but we only support messages up to 52428800 bytes long.
W20260926 17:58:54.225816 5857 connection.cc:158] shutting down server connection from unix:<unnamed> with pending inbound data: 4/2147483714 bytes received; last active 0 ns ago: status Network error: RPC frame had a length of 2147483714, but we only support messages up to 52428800 bytes long.
W20260926 17:58:54.226025 5873 connection.cc:698] client connection to unix:/tmp/dist-test-task5ZPkl8/test-tmp/rpc-test-610a254a789c4b25888984f23b7cb311.sock send error: Network error: failed to write to TLS socket: Broken pipe
W20260926 17:58:54.226136 5873 connection.cc:196] Error closing socket: Network error: TlsSocket::Close: Success
I20260926 17:58:54.245363 5886 acceptor_pool.cc:254] collecting diagnostics on the listening RPC socket unix:/tmp/dist-test-task5ZPkl8/test-tmp/rpc-test-610a254a789c4b25888984f23b7cb311.sock every 8 connection(s)
I20260926 17:58:54.245401 5885 acceptor_pool.cc:254] collecting diagnostics on the listening RPC socket unix:/tmp/dist-test-task5ZPkl8/test-tmp/rpc-test-610a254a789c4b25888984f23b7cb311.sock every 8 connection(s)
W20260926 17:58:58.294152 5882 connection.cc:577] server connection from unix:<unnamed>: received bad data: 'Corruption: Invalid packet: message had a length of 2147483710, but we only support messages up to 2147483647 bytes
'
W20260926 17:58:58.294449 5898 connection.cc:196] Error closing socket: Network error: TlsSocket::Close: Broken pipe
[ OK ] Parameters/TestRpc.TestRpcSidecarLimits/SSL_UnixSocket (5714 ms)
[ RUN ] Parameters/TestRpc.TestCallTimeoutDoesntAffectNegotiation/SSL_UnixSocket
I20260926 17:58:58.302096 5910 acceptor_pool.cc:254] collecting diagnostics on the listening RPC socket unix:/tmp/dist-test-task5ZPkl8/test-tmp/rpc-test-7bb93add95a54a3f9d510658fe462574.sock every 8 connection(s)
I20260926 17:58:58.302142 5911 acceptor_pool.cc:254] collecting diagnostics on the listening RPC socket unix:/tmp/dist-test-task5ZPkl8/test-tmp/rpc-test-7bb93add95a54a3f9d510658fe462574.sock every 8 connection(s)
W20260926 17:58:58.322196 5906 negotiation.cc:266] Injecting 500ms delay in negotiation
I20260926 17:58:58.372401 5618 rpc-test-base.h:595] status: Timed out: connection negotiation to unix:/tmp/dist-test-task5ZPkl8/test-tmp/rpc-test-7bb93add95a54a3f9d510658fe462574.sock for RPC Sleep timed out after 0.050s (ON_OUTBOUND_QUEUE), seconds elapsed: 0.0504364
[ OK ] Parameters/TestRpc.TestCallTimeoutDoesntAffectNegotiation/SSL_UnixSocket (530 ms)
[ RUN ] Parameters/TestRpc.TestRpcHandlerLatencyMetric/SSL_UnixSocket
I20260926 17:58:58.835649 5935 acceptor_pool.cc:254] collecting diagnostics on the listening RPC socket unix:/tmp/dist-test-task5ZPkl8/test-tmp/rpc-test-9998c599f13a44efbe9c917b49e38124.sock every 8 connection(s)
I20260926 17:58:58.835686 5936 acceptor_pool.cc:254] collecting diagnostics on the listening RPC socket unix:/tmp/dist-test-task5ZPkl8/test-tmp/rpc-test-9998c599f13a44efbe9c917b49e38124.sock every 8 connection(s)
I20260926 17:58:58.867499 5618 rpc-test.cc:1236] Sleep() min lat: 20249
I20260926 17:58:58.867565 5618 rpc-test.cc:1237] Sleep() mean lat: 20249
I20260926 17:58:58.867596 5618 rpc-test.cc:1238] Sleep() max lat: 20249
I20260926 17:58:58.867610 5618 rpc-test.cc:1239] Sleep() #calls: 1
[ OK ] Parameters/TestRpc.TestRpcHandlerLatencyMetric/SSL_UnixSocket (42 ms)
[ RUN ] Parameters/TestRpc.TimedOutOnResponseMetricServiceQueue/SSL_UnixSocket
I20260926 17:58:58.880722 5961 acceptor_pool.cc:254] collecting diagnostics on the listening RPC socket unix:/tmp/dist-test-task5ZPkl8/test-tmp/rpc-test-91a27a66e575487b9fddbcea75f7f855.sock every 8 connection(s)
I20260926 17:58:58.880800 5962 acceptor_pool.cc:254] collecting diagnostics on the listening RPC socket unix:/tmp/dist-test-task5ZPkl8/test-tmp/rpc-test-91a27a66e575487b9fddbcea75f7f855.sock every 8 connection(s)
W20260926 17:58:58.948539 5963 rpcz_store.cc:267] Call kudu.rpc_test.CalculatorService.Sleep from unix:<unnamed> (request call id 2) took 20 ms (client timeout 20 ms). Trace:
W20260926 17:58:58.948625 5963 rpcz_store.cc:269] 0926 17:58:58.928307 (+ 0us) service_pool.cc:170] Inserting onto call queue
0926 17:58:58.948496 (+ 20189us) service_pool.cc:214] Skipping call since client already timed out
0926 17:58:58.948506 (+ 10us) inbound_call.cc:173] Queueing failure response
Metrics: {}
[ OK ] Parameters/TestRpc.TimedOutOnResponseMetricServiceQueue/SSL_UnixSocket (80 ms)
[ RUN ] Parameters/TestRpc.RpcPendingConnectionsMetric/SSL_UnixSocket
I20260926 17:58:58.951494 5984 acceptor_pool.cc:254] collecting diagnostics on the listening RPC socket 0.0.0.0:34077 every 8 connection(s)
I20260926 17:58:58.951546 5985 acceptor_pool.cc:254] collecting diagnostics on the listening RPC socket 0.0.0.0:34077 every 8 connection(s)
W20260926 17:58:58.959879 5980 negotiation.cc:337] Failed RPC negotiation. Trace:
0926 17:58:58.959665 (+ 0us) reactor.cc:625] Submitting negotiation task for server connection from 127.0.0.1:51308 (local address 127.0.0.1:34077)
0926 17:58:58.959710 (+ 45us) server_negotiation.cc:206] Beginning negotiation
0926 17:58:58.959712 (+ 2us) server_negotiation.cc:399] Waiting for connection header
0926 17:58:58.959783 (+ 71us) negotiation.cc:327] Negotiation complete: Network error: Server connection negotiation failed: server connection from 127.0.0.1:51308: BlockingRecv error: recv got EOF from 127.0.0.1:51308 (error 108)
Metrics: {"server-negotiator.queue_time_us":15}
[ OK ] Parameters/TestRpc.RpcPendingConnectionsMetric/SSL_UnixSocket (20 ms)
[ RUN ] Parameters/TestRpc.TestRpcContextClientDeadline/SSL_UnixSocket
I20260926 17:58:58.980176 6000 acceptor_pool.cc:254] collecting diagnostics on the listening RPC socket unix:/tmp/dist-test-task5ZPkl8/test-tmp/rpc-test-0429c35390454ba5bd9bd49b420b1bd4.sock every 8 connection(s)
I20260926 17:58:58.980212 6001 acceptor_pool.cc:254] collecting diagnostics on the listening RPC socket unix:/tmp/dist-test-task5ZPkl8/test-tmp/rpc-test-0429c35390454ba5bd9bd49b420b1bd4.sock every 8 connection(s)
[ OK ] Parameters/TestRpc.TestRpcContextClientDeadline/SSL_UnixSocket (51 ms)
[ RUN ] Parameters/TestRpc.TestApplicationFeatureFlagUnsupportedServer/SSL_UnixSocket
I20260926 17:58:59.037853 6025 acceptor_pool.cc:254] collecting diagnostics on the listening RPC socket unix:/tmp/dist-test-task5ZPkl8/test-tmp/rpc-test-9572cf4b46da4315871df606384fba2d.sock every 8 connection(s)
I20260926 17:58:59.037874 6026 acceptor_pool.cc:254] collecting diagnostics on the listening RPC socket unix:/tmp/dist-test-task5ZPkl8/test-tmp/rpc-test-9572cf4b46da4315871df606384fba2d.sock every 8 connection(s)
[ OK ] Parameters/TestRpc.TestApplicationFeatureFlagUnsupportedServer/SSL_UnixSocket (28 ms)
[ RUN ] Parameters/TestRpc.TestCancellationAsync/SSL_UnixSocket
I20260926 17:58:59.059356 6050 acceptor_pool.cc:254] collecting diagnostics on the listening RPC socket unix:/tmp/dist-test-task5ZPkl8/test-tmp/rpc-test-ebf0cacc8f1e41a0937a98aa7f47f564.sock every 8 connection(s)
I20260926 17:58:59.059394 6051 acceptor_pool.cc:254] collecting diagnostics on the listening RPC socket unix:/tmp/dist-test-task5ZPkl8/test-tmp/rpc-test-ebf0cacc8f1e41a0937a98aa7f47f564.sock every 8 connection(s)
I20260926 17:58:59.059509 5618 rpc-test.cc:1716] Connecting to unix:/tmp/dist-test-task5ZPkl8/test-tmp/rpc-test-ebf0cacc8f1e41a0937a98aa7f47f564.sock
I20260926 17:58:59.077948 5618 test_util.cc:268] Using random seed: -1772572872
I20260926 17:58:59.090905 6054 rpc-test-base.h:240] got call: sleep_micros: 500 pattern: 4294967295 num_repetitions: 2097152 sidecar_idx: 0
I20260926 17:58:59.100778 6054 rpc-test-base.h:240] got call: sleep_micros: 500 pattern: 4294967295 num_repetitions: 2097152 sidecar_idx: 0
I20260926 17:58:59.112994 6054 rpc-test-base.h:240] got call: sleep_micros: 500 pattern: 4294967295 num_repetitions: 2097152 sidecar_idx: 0
I20260926 17:58:59.125406 6054 rpc-test-base.h:240] got call: sleep_micros: 500 pattern: 4294967295 num_repetitions: 2097152 sidecar_idx: 0
I20260926 17:58:59.138171 6054 rpc-test-base.h:240] got call: sleep_micros: 500 pattern: 4294967295 num_repetitions: 2097152 sidecar_idx: 0
I20260926 17:58:59.150956 6054 rpc-test-base.h:240] got call: sleep_micros: 500 pattern: 4294967295 num_repetitions: 2097152 sidecar_idx: 0
I20260926 17:58:59.163904 6054 rpc-test-base.h:240] got call: sleep_micros: 500 pattern: 4294967295 num_repetitions: 2097152 sidecar_idx: 0
I20260926 17:58:59.176584 6054 rpc-test-base.h:240] got call: sleep_micros: 500 pattern: 4294967295 num_repetitions: 2097152 sidecar_idx: 0
W20260926 17:58:59.177768 6047 connection.cc:196] Error closing socket: Network error: TlsSocket::Close: Broken pipe
W20260926 17:58:59.179526 6047 connection.cc:441] server connection from unix:<unnamed> torn down before Call kudu.rpc.GenericCalculatorService.SleepWithSidecar from unix:<unnamed> (request call id 9) could send its response
[ OK ] Parameters/TestRpc.TestCancellationAsync/SSL_UnixSocket (130 ms)
[ RUN ] Parameters/TestRpc.TestPerformanceBySocketType/SSL_UnixSocket
I20260926 17:58:59.197088 6075 acceptor_pool.cc:254] collecting diagnostics on the listening RPC socket unix:/tmp/dist-test-task5ZPkl8/test-tmp/rpc-test-3d8624e338ad49a3bfbde8db2be23601.sock every 8 connection(s)
I20260926 17:58:59.197132 6076 acceptor_pool.cc:254] collecting diagnostics on the listening RPC socket unix:/tmp/dist-test-task5ZPkl8/test-tmp/rpc-test-3d8624e338ad49a3bfbde8db2be23601.sock every 8 connection(s)
I20260926 17:58:59.197253 5618 rpc-test.cc:1846] Connecting to unix:/tmp/dist-test-task5ZPkl8/test-tmp/rpc-test-3d8624e338ad49a3bfbde8db2be23601.sock
I20260926 17:59:00.367805 5618 rpc-test.cc:1859] Sending 1024MB via ssl-enabled unix socket: real 1.163s user 1.192s sys 0.904s
I20260926 17:59:01.542878 5618 rpc-test.cc:1859] Sending 1024MB via ssl-enabled unix socket: real 1.175s user 1.276s sys 0.853s
I20260926 17:59:02.661087 5618 rpc-test.cc:1859] Sending 1024MB via ssl-enabled unix socket: real 1.118s user 1.216s sys 0.814s
I20260926 17:59:03.846804 5618 rpc-test.cc:1859] Sending 1024MB via ssl-enabled unix socket: real 1.186s user 1.316s sys 0.833s
I20260926 17:59:05.004153 5618 rpc-test.cc:1859] Sending 1024MB via ssl-enabled unix socket: real 1.157s user 1.245s sys 0.850s
W20260926 17:59:05.004935 6072 connection.cc:196] Error closing socket: Network error: TlsSocket::Close: Broken pipe
[ OK ] Parameters/TestRpc.TestPerformanceBySocketType/SSL_UnixSocket (5825 ms)
[----------] 20 tests from Parameters/TestRpc (24933 ms total)
[----------] 1 test from Parameters/TestRpcSocketTxRxQueue
[ RUN ] Parameters/TestRpcSocketTxRxQueue.AcceptorRxQueueSizeMetric/0
I20260926 17:59:05.007304 6100 acceptor_pool.cc:254] collecting diagnostics on the listening RPC socket 0.0.0.0:38619 every 1 connection(s)
I20260926 17:59:05.007376 6101 acceptor_pool.cc:254] collecting diagnostics on the listening RPC socket 0.0.0.0:38619 every 1 connection(s)
W20260926 17:59:05.007882 6096 negotiation.cc:337] Failed RPC negotiation. Trace:
0926 17:59:05.007722 (+ 0us) reactor.cc:625] Submitting negotiation task for server connection from 127.0.0.1:50622 (local address 127.0.0.1:38619)
0926 17:59:05.007772 (+ 50us) server_negotiation.cc:206] Beginning negotiation
0926 17:59:05.007774 (+ 2us) server_negotiation.cc:399] Waiting for connection header
0926 17:59:05.007827 (+ 53us) negotiation.cc:327] Negotiation complete: Network error: Server connection negotiation failed: server connection from 127.0.0.1:50622: BlockingRecv error: recv got EOF from 127.0.0.1:50622 (error 108)
Metrics: {"server-negotiator.queue_time_us":17}
[ OK ] Parameters/TestRpcSocketTxRxQueue.AcceptorRxQueueSizeMetric/0 (3 ms)
[----------] 1 test from Parameters/TestRpcSocketTxRxQueue (3 ms total)
[----------] Global test environment tear-down
[==========] 21 tests from 2 test suites ran. (24938 ms total)
[ PASSED ] 20 tests.
[ FAILED ] 1 test, listed below:
[ FAILED ] Parameters/TestRpc.TestCallWithChainCertAndChainCA/SSL_UnixSocket, where GetParam() = (true, true)
1 FAILED TEST