Parameters/TestRpc.TestCallWithChainCertAndRootCA/SSL_UnixSocket: /data0/somelongdirectorytoavoidrpathissues/src/kudu/src/kudu/rpc/rpc-test.cc:303: Failure
Failed
Bad status: Runtime error: could not verify certificate chain (error with cert: subject=CN = localhost, ST = sadfjas, C = AS, emailAddress = sdflkdsajf, O = lskdfjlsad, OU = sldfkja, issuer=C = AS, ST = ASDfkjdhf, L = lskdjf, O = saldfja, OU = skdjf, CN = localhost, emailAddress = sadjflkadsj): : certificate has expired
Google Test trace:
/data0/somelongdirectorytoavoidrpathissues/src/kudu/src/kudu/rpc/rpc-test.cc:300: Connecting to unix:/tmp/dist-test-taskdjFNNy/test-tmp/rpc-test-1244c1af0faf45e0825d4f5ba6e810ee.sock
I20260927 19:37:24.494280 3217 test_util.cc:175] -----------------------------------------------
I20260927 19:37:24.494472 3217 test_util.cc:176] Had fatal failures, leaving test files at /tmp/dist-test-taskdjFNNy/test-tmp/rpc-test.2.Parameters_TestRpc.TestCallWithChainCertAndRootCA_SSL_UnixSocket.1790537840959905-3217-0
Note: This is test shard 3 of 8.
[==========] Running 21 tests from 2 test suites.
[----------] Global test environment set-up.
[----------] 1 test from TestRpc
[ RUN ] TestRpc.TestNegotiationTimeout
WARNING: Logging before InitGoogleLogging() is written to STDERR
I20260927 19:37:21.159696 3217 rpc-test-base.h:595] status: Timed out: connection negotiation to 0.0.0.0:36731 for RPC Sleep timed out after 0.100s (ON_OUTBOUND_QUEUE), seconds elapsed: 0.101056
W20260927 19:37:24.132663 3227 negotiation.cc:337] Failed RPC negotiation. Trace:
0927 19:37:21.059780 (+ 0us) reactor.cc:625] Submitting negotiation task for client connection to 0.0.0.0:36731 (local address 127.0.0.1:51568)
0927 19:37:21.060473 (+ 693us) negotiation.cc:107] Waiting for socket to connect
0927 19:37:21.060523 (+ 50us) client_negotiation.cc:174] Beginning negotiation
0927 19:37:21.073143 (+ 12620us) client_negotiation.cc:252] Sending NEGOTIATE NegotiatePB request
0927 19:37:24.131435 (+3058292us) negotiation.cc:327] Negotiation complete: Timed out: Client connection negotiation failed: client connection to 0.0.0.0:36731: received 0 of 4 requested bytes
Metrics: {"client-negotiator.queue_time_us":224}
[ OK ] TestRpc.TestNegotiationTimeout (3118 ms)
[----------] 1 test from TestRpc (3118 ms total)
[----------] 20 tests from Parameters/TestRpc
[ RUN ] Parameters/TestRpc.TestAcceptorPoolStartStop/SSL_UnixSocket
I20260927 19:37:24.172272 3243 acceptor_pool.cc:254] collecting diagnostics on the listening RPC socket unix:/tmp/dist-test-taskdjFNNy/test-tmp/rpc-test-04edd60a5c07434a8e76eda14cf39848.sock every 8 connection(s)
I20260927 19:37:24.174034 3244 acceptor_pool.cc:254] collecting diagnostics on the listening RPC socket unix:/tmp/dist-test-taskdjFNNy/test-tmp/rpc-test-04edd60a5c07434a8e76eda14cf39848.sock every 8 connection(s)
I20260927 19:37:24.220300 3254 acceptor_pool.cc:254] collecting diagnostics on the listening RPC socket unix:/tmp/dist-test-taskdjFNNy/test-tmp/rpc-test-04edd60a5c07434a8e76eda14cf39848.sock every 8 connection(s)
I20260927 19:37:24.221745 3255 acceptor_pool.cc:254] collecting diagnostics on the listening RPC socket unix:/tmp/dist-test-taskdjFNNy/test-tmp/rpc-test-04edd60a5c07434a8e76eda14cf39848.sock every 8 connection(s)
I20260927 19:37:24.239862 3265 acceptor_pool.cc:254] collecting diagnostics on the listening RPC socket unix:/tmp/dist-test-taskdjFNNy/test-tmp/rpc-test-04edd60a5c07434a8e76eda14cf39848.sock every 8 connection(s)
I20260927 19:37:24.240710 3266 acceptor_pool.cc:254] collecting diagnostics on the listening RPC socket unix:/tmp/dist-test-taskdjFNNy/test-tmp/rpc-test-04edd60a5c07434a8e76eda14cf39848.sock every 8 connection(s)
I20260927 19:37:24.293341 3276 acceptor_pool.cc:254] collecting diagnostics on the listening RPC socket unix:/tmp/dist-test-taskdjFNNy/test-tmp/rpc-test-04edd60a5c07434a8e76eda14cf39848.sock every 8 connection(s)
I20260927 19:37:24.294380 3277 acceptor_pool.cc:254] collecting diagnostics on the listening RPC socket unix:/tmp/dist-test-taskdjFNNy/test-tmp/rpc-test-04edd60a5c07434a8e76eda14cf39848.sock every 8 connection(s)
I20260927 19:37:24.325731 3287 acceptor_pool.cc:254] collecting diagnostics on the listening RPC socket unix:/tmp/dist-test-taskdjFNNy/test-tmp/rpc-test-04edd60a5c07434a8e76eda14cf39848.sock every 8 connection(s)
I20260927 19:37:24.326526 3288 acceptor_pool.cc:254] collecting diagnostics on the listening RPC socket unix:/tmp/dist-test-taskdjFNNy/test-tmp/rpc-test-04edd60a5c07434a8e76eda14cf39848.sock every 8 connection(s)
[ OK ] Parameters/TestRpc.TestAcceptorPoolStartStop/SSL_UnixSocket (193 ms)
[ RUN ] Parameters/TestRpc.TestCall/SSL_UnixSocket
I20260927 19:37:24.350232 3300 acceptor_pool.cc:254] collecting diagnostics on the listening RPC socket unix:/tmp/dist-test-taskdjFNNy/test-tmp/rpc-test-432c2554651b40b1b75a2b5a62f2b3ae.sock every 8 connection(s)
I20260927 19:37:24.352407 3301 acceptor_pool.cc:254] collecting diagnostics on the listening RPC socket unix:/tmp/dist-test-taskdjFNNy/test-tmp/rpc-test-432c2554651b40b1b75a2b5a62f2b3ae.sock every 8 connection(s)
I20260927 19:37:24.357609 3217 rpc-test.cc:234] Connecting to unix:/tmp/dist-test-taskdjFNNy/test-tmp/rpc-test-432c2554651b40b1b75a2b5a62f2b3ae.sock
[ OK ] Parameters/TestRpc.TestCall/SSL_UnixSocket (105 ms)
[ RUN ] Parameters/TestRpc.TestCallWithChainCertAndRootCA/SSL_UnixSocket
I20260927 19:37:24.469802 3325 acceptor_pool.cc:254] collecting diagnostics on the listening RPC socket unix:/tmp/dist-test-taskdjFNNy/test-tmp/rpc-test-1244c1af0faf45e0825d4f5ba6e810ee.sock every 8 connection(s)
I20260927 19:37:24.470647 3326 acceptor_pool.cc:254] collecting diagnostics on the listening RPC socket unix:/tmp/dist-test-taskdjFNNy/test-tmp/rpc-test-1244c1af0faf45e0825d4f5ba6e810ee.sock every 8 connection(s)
/data0/somelongdirectorytoavoidrpathissues/src/kudu/src/kudu/rpc/rpc-test.cc:303: Failure
Failed
Bad status: Runtime error: could not verify certificate chain (error with cert: subject=CN = localhost, ST = sadfjas, C = AS, emailAddress = sdflkdsajf, O = lskdfjlsad, OU = sldfkja, issuer=C = AS, ST = ASDfkjdhf, L = lskdjf, O = saldfja, OU = skdjf, CN = localhost, emailAddress = sadjflkadsj): : certificate has expired
Google Test trace:
/data0/somelongdirectorytoavoidrpathissues/src/kudu/src/kudu/rpc/rpc-test.cc:300: Connecting to unix:/tmp/dist-test-taskdjFNNy/test-tmp/rpc-test-1244c1af0faf45e0825d4f5ba6e810ee.sock
I20260927 19:37:24.494280 3217 test_util.cc:175] -----------------------------------------------
I20260927 19:37:24.494472 3217 test_util.cc:176] Had fatal failures, leaving test files at /tmp/dist-test-taskdjFNNy/test-tmp/rpc-test.2.Parameters_TestRpc.TestCallWithChainCertAndRootCA_SSL_UnixSocket.1790537840959905-3217-0
[ FAILED ] Parameters/TestRpc.TestCallWithChainCertAndRootCA/SSL_UnixSocket, where GetParam() = (true, true) (58 ms)
[ RUN ] Parameters/TestRpc.TestCallWithBadPasswordProtectedKey/SSL_UnixSocket
[ OK ] Parameters/TestRpc.TestCallWithBadPasswordProtectedKey/SSL_UnixSocket (33 ms)
[ RUN ] Parameters/TestRpc.TestInvalidMethodCall/SSL_UnixSocket
I20260927 19:37:24.553561 3362 acceptor_pool.cc:254] collecting diagnostics on the listening RPC socket unix:/tmp/dist-test-taskdjFNNy/test-tmp/rpc-test-7b8ead643562425081856ab602ecc508.sock every 8 connection(s)
I20260927 19:37:24.554579 3363 acceptor_pool.cc:254] collecting diagnostics on the listening RPC socket unix:/tmp/dist-test-taskdjFNNy/test-tmp/rpc-test-7b8ead643562425081856ab602ecc508.sock every 8 connection(s)
I20260927 19:37:24.558416 3217 rpc-test.cc:406] Connecting to unix:/tmp/dist-test-taskdjFNNy/test-tmp/rpc-test-7b8ead643562425081856ab602ecc508.sock
[ OK ] Parameters/TestRpc.TestInvalidMethodCall/SSL_UnixSocket (84 ms)
[ RUN ] Parameters/TestRpc.TestHighFDs/SSL_UnixSocket
I20260927 19:37:24.838675 3387 acceptor_pool.cc:254] collecting diagnostics on the listening RPC socket unix:/tmp/dist-test-taskdjFNNy/test-tmp/rpc-test-2f3c3241ad3f43f492280bcd0a4b91c0.sock every 8 connection(s)
I20260927 19:37:24.839571 3388 acceptor_pool.cc:254] collecting diagnostics on the listening RPC socket unix:/tmp/dist-test-taskdjFNNy/test-tmp/rpc-test-2f3c3241ad3f43f492280bcd0a4b91c0.sock every 8 connection(s)
[ OK ] Parameters/TestRpc.TestHighFDs/SSL_UnixSocket (298 ms)
[ RUN ] Parameters/TestRpc.TestConnectionAlwaysKeepalive/SSL_UnixSocket
I20260927 19:37:24.942317 3410 acceptor_pool.cc:254] collecting diagnostics on the listening RPC socket unix:/tmp/dist-test-taskdjFNNy/test-tmp/rpc-test-045cbc4712a8467f9ad108d52c58331f.sock every 8 connection(s)
I20260927 19:37:24.943049 3411 acceptor_pool.cc:254] collecting diagnostics on the listening RPC socket unix:/tmp/dist-test-taskdjFNNy/test-tmp/rpc-test-045cbc4712a8467f9ad108d52c58331f.sock every 8 connection(s)
I20260927 19:37:24.946564 3217 rpc-test.cc:532] Connecting to unix:/tmp/dist-test-taskdjFNNy/test-tmp/rpc-test-045cbc4712a8467f9ad108d52c58331f.sock
[ OK ] Parameters/TestRpc.TestConnectionAlwaysKeepalive/SSL_UnixSocket (3070 ms)
[ RUN ] Parameters/TestRpc.TestReopenOutboundConnections/SSL_UnixSocket
I20260927 19:37:28.024825 3433 acceptor_pool.cc:254] collecting diagnostics on the listening RPC socket unix:/tmp/dist-test-taskdjFNNy/test-tmp/rpc-test-05d152887a9e4c7c91bcf84121d23495.sock every 8 connection(s)
I20260927 19:37:28.025511 3434 acceptor_pool.cc:254] collecting diagnostics on the listening RPC socket unix:/tmp/dist-test-taskdjFNNy/test-tmp/rpc-test-05d152887a9e4c7c91bcf84121d23495.sock every 8 connection(s)
I20260927 19:37:28.028949 3217 rpc-test.cc:658] Connecting to unix:/tmp/dist-test-taskdjFNNy/test-tmp/rpc-test-05d152887a9e4c7c91bcf84121d23495.sock
W20260927 19:37:28.062350 3432 connection.cc:196] Error closing socket: Network error: TlsSocket::Close: Broken pipe
W20260927 19:37:28.073412 3432 connection.cc:196] Error closing socket: Network error: TlsSocket::Close: Broken pipe
W20260927 19:37:28.084611 3432 connection.cc:196] Error closing socket: Network error: TlsSocket::Close: Broken pipe
W20260927 19:37:28.094926 3432 connection.cc:196] Error closing socket: Network error: TlsSocket::Close: Broken pipe
W20260927 19:37:28.105684 3432 connection.cc:196] Error closing socket: Network error: TlsSocket::Close: Broken pipe
W20260927 19:37:28.117549 3432 connection.cc:196] Error closing socket: Network error: TlsSocket::Close: Broken pipe
W20260927 19:37:28.130465 3432 connection.cc:196] Error closing socket: Network error: TlsSocket::Close: Broken pipe
W20260927 19:37:28.142120 3432 connection.cc:196] Error closing socket: Network error: TlsSocket::Close: Broken pipe
W20260927 19:37:28.166332 3432 connection.cc:196] Error closing socket: Network error: TlsSocket::Close: Broken pipe
W20260927 19:37:28.177922 3432 connection.cc:196] Error closing socket: Network error: TlsSocket::Close: Broken pipe
W20260927 19:37:28.190145 3432 connection.cc:196] Error closing socket: Network error: TlsSocket::Close: Broken pipe
W20260927 19:37:28.202114 3432 connection.cc:196] Error closing socket: Network error: TlsSocket::Close: Broken pipe
W20260927 19:37:28.214696 3433 acceptor_pool.cc:285] unable to collect diagnostics on RPC socket unix:/tmp/dist-test-taskdjFNNy/test-tmp/rpc-test-05d152887a9e4c7c91bcf84121d23495.sock: Not implemented: netlink diagnostics is currently supported only on IPv4 TCP sockets
W20260927 19:37:28.227065 3432 connection.cc:196] Error closing socket: Network error: TlsSocket::Close: Broken pipe
W20260927 19:37:28.251138 3432 connection.cc:196] Error closing socket: Network error: TlsSocket::Close: Broken pipe
W20260927 19:37:28.263504 3432 connection.cc:196] Error closing socket: Network error: TlsSocket::Close: Broken pipe
W20260927 19:37:28.276428 3432 connection.cc:196] Error closing socket: Network error: TlsSocket::Close: Broken pipe
W20260927 19:37:28.288269 3432 connection.cc:196] Error closing socket: Network error: TlsSocket::Close: Broken pipe
W20260927 19:37:28.299458 3432 connection.cc:196] Error closing socket: Network error: TlsSocket::Close: Broken pipe
W20260927 19:37:28.310535 3432 connection.cc:196] Error closing socket: Network error: TlsSocket::Close: Broken pipe
W20260927 19:37:28.321496 3432 connection.cc:196] Error closing socket: Network error: TlsSocket::Close: Broken pipe
W20260927 19:37:28.332360 3432 connection.cc:196] Error closing socket: Network error: TlsSocket::Close: Broken pipe
W20260927 19:37:28.342594 3432 connection.cc:196] Error closing socket: Network error: TlsSocket::Close: Broken pipe
W20260927 19:37:28.353974 3432 connection.cc:196] Error closing socket: Network error: TlsSocket::Close: Broken pipe
W20260927 19:37:28.366235 3432 connection.cc:196] Error closing socket: Network error: TlsSocket::Close: Broken pipe
W20260927 19:37:28.377692 3432 connection.cc:196] Error closing socket: Network error: TlsSocket::Close: Broken pipe
W20260927 19:37:28.388810 3432 connection.cc:196] Error closing socket: Network error: TlsSocket::Close: Broken pipe
W20260927 19:37:28.400344 3432 connection.cc:196] Error closing socket: Network error: TlsSocket::Close: Broken pipe
W20260927 19:37:28.411196 3432 connection.cc:196] Error closing socket: Network error: TlsSocket::Close: Broken pipe
[ OK ] Parameters/TestRpc.TestReopenOutboundConnections/SSL_UnixSocket (449 ms)
[ RUN ] Parameters/TestRpc.TestConnectionNetworkPlane/SSL_UnixSocket
I20260927 19:37:28.468077 3456 acceptor_pool.cc:254] collecting diagnostics on the listening RPC socket unix:/tmp/dist-test-taskdjFNNy/test-tmp/rpc-test-9f4cd819687849eca3293d80af506c9a.sock every 8 connection(s)
I20260927 19:37:28.468911 3457 acceptor_pool.cc:254] collecting diagnostics on the listening RPC socket unix:/tmp/dist-test-taskdjFNNy/test-tmp/rpc-test-9f4cd819687849eca3293d80af506c9a.sock every 8 connection(s)
I20260927 19:37:28.472574 3217 rpc-test.cc:772] Connecting to unix:/tmp/dist-test-taskdjFNNy/test-tmp/rpc-test-9f4cd819687849eca3293d80af506c9a.sock
W20260927 19:37:28.527981 3455 connection.cc:196] Error closing socket: Network error: TlsSocket::Close: Broken pipe
W20260927 19:37:28.528853 3455 connection.cc:196] Error closing socket: Network error: TlsSocket::Close: Broken pipe
[ OK ] Parameters/TestRpc.TestConnectionNetworkPlane/SSL_UnixSocket (103 ms)
[ RUN ] Parameters/TestRpc.TestTCPKeepalive/SSL_UnixSocket
I20260927 19:37:28.551354 3481 acceptor_pool.cc:254] collecting diagnostics on the listening RPC socket unix:/tmp/dist-test-taskdjFNNy/test-tmp/rpc-test-decd0f223348444d936ff02c538cd12e.sock every 8 connection(s)
I20260927 19:37:28.552119 3482 acceptor_pool.cc:254] collecting diagnostics on the listening RPC socket unix:/tmp/dist-test-taskdjFNNy/test-tmp/rpc-test-decd0f223348444d936ff02c538cd12e.sock every 8 connection(s)
I20260927 19:37:28.585001 3485 rpc-test-base.h:222] got call: sleep_micros: 8000000 deferred: true
I20260927 19:37:36.589699 3485 rpcz_store.cc:275] Call kudu.rpc.GenericCalculatorService.Sleep from unix:<unnamed> (request call id 0) took 8004 ms. Trace:
I20260927 19:37:36.590116 3485 rpcz_store.cc:276] 0927 19:37:28.584776 (+ 0us) service_pool.cc:170] Inserting onto call queue
0927 19:37:28.584940 (+ 164us) service_pool.cc:227] Handling call
0927 19:37:36.589541 (+8004601us) inbound_call.cc:173] Queueing success response
Metrics: {}
W20260927 19:37:36.596910 3478 connection.cc:196] Error closing socket: Network error: TlsSocket::Close: Broken pipe
[ OK ] Parameters/TestRpc.TestTCPKeepalive/SSL_UnixSocket (8071 ms)
[ RUN ] Parameters/TestRpc.TestMaxSmallSidecars/SSL_UnixSocket
I20260927 19:37:36.638394 3507 acceptor_pool.cc:254] collecting diagnostics on the listening RPC socket unix:/tmp/dist-test-taskdjFNNy/test-tmp/rpc-test-7bad46e144874ba38655a1143db4778b.sock every 8 connection(s)
I20260927 19:37:36.639302 3508 acceptor_pool.cc:254] collecting diagnostics on the listening RPC socket unix:/tmp/dist-test-taskdjFNNy/test-tmp/rpc-test-7bad46e144874ba38655a1143db4778b.sock every 8 connection(s)
W20260927 19:37:36.838646 3504 connection.cc:196] Error closing socket: Network error: TlsSocket::Close: Broken pipe
[ OK ] Parameters/TestRpc.TestMaxSmallSidecars/SSL_UnixSocket (238 ms)
[ RUN ] Parameters/TestRpc.TestCallTimeout/SSL_UnixSocket
I20260927 19:37:36.878925 3532 acceptor_pool.cc:254] collecting diagnostics on the listening RPC socket unix:/tmp/dist-test-taskdjFNNy/test-tmp/rpc-test-e25d1fae151e4fa9ac9dd6774fd79c2b.sock every 8 connection(s)
I20260927 19:37:36.879899 3533 acceptor_pool.cc:254] collecting diagnostics on the listening RPC socket unix:/tmp/dist-test-taskdjFNNy/test-tmp/rpc-test-e25d1fae151e4fa9ac9dd6774fd79c2b.sock every 8 connection(s)
I20260927 19:37:36.900406 3217 rpc-test-base.h:595] status: Timed out: connection negotiation to unix:/tmp/dist-test-taskdjFNNy/test-tmp/rpc-test-e25d1fae151e4fa9ac9dd6774fd79c2b.sock for RPC Sleep timed out after 0.000s (ON_OUTBOUND_QUEUE), seconds elapsed: 0.00260632
I20260927 19:37:36.908661 3536 rpc-test-base.h:222] got call: sleep_micros: 700000
I20260927 19:37:37.101672 3217 rpc-test-base.h:595] status: Timed out: Sleep RPC to unix:/tmp/dist-test-taskdjFNNy/test-tmp/rpc-test-e25d1fae151e4fa9ac9dd6774fd79c2b.sock timed out after 0.200s (SENT), seconds elapsed: 0.200831
I20260927 19:37:37.103439 3535 rpc-test-base.h:222] got call: sleep_micros: 2000000
W20260927 19:37:37.609349 3536 rpcz_store.cc:267] Call kudu.rpc.GenericCalculatorService.Sleep from unix:<unnamed> (request call id 1) took 700 ms (client timeout 200 ms). Trace:
W20260927 19:37:37.609678 3536 rpcz_store.cc:269] 0927 19:37:36.908459 (+ 0us) service_pool.cc:170] Inserting onto call queue
0927 19:37:36.908604 (+ 145us) service_pool.cc:227] Handling call
0927 19:37:37.609287 (+700683us) inbound_call.cc:173] Queueing success response
Metrics: {}
I20260927 19:37:38.603665 3217 rpc-test-base.h:595] status: Timed out: Sleep RPC to unix:/tmp/dist-test-taskdjFNNy/test-tmp/rpc-test-e25d1fae151e4fa9ac9dd6774fd79c2b.sock timed out after 1.500s (SENT), seconds elapsed: 1.5016
W20260927 19:37:39.103991 3535 rpcz_store.cc:267] Call kudu.rpc.GenericCalculatorService.Sleep from unix:<unnamed> (request call id 2) took 2001 ms (client timeout 1500 ms). Trace:
W20260927 19:37:39.104408 3535 rpcz_store.cc:269] 0927 19:37:37.103015 (+ 0us) service_pool.cc:170] Inserting onto call queue
0927 19:37:37.103269 (+ 254us) service_pool.cc:227] Handling call
0927 19:37:39.103936 (+2000667us) inbound_call.cc:173] Queueing success response
Metrics: {}
W20260927 19:37:39.105115 3529 connection.cc:441] server connection from unix:<unnamed> torn down before Call kudu.rpc.GenericCalculatorService.Sleep from unix:<unnamed> (request call id 2) could send its response
[ OK ] Parameters/TestRpc.TestCallTimeout/SSL_UnixSocket (2266 ms)
[ RUN ] Parameters/TestRpc.TestServerShutsDown/SSL_UnixSocket
I20260927 19:37:39.112639 3217 rpc-test.cc:1125] Connecting to 0.0.0.0:46263
W20260927 19:37:39.129793 3549 negotiation.cc:337] Failed RPC negotiation. Trace:
0927 19:37:39.128133 (+ 0us) reactor.cc:625] Submitting negotiation task for client connection to 0.0.0.0:46263 (local address 127.0.0.1:60536)
0927 19:37:39.128638 (+ 505us) negotiation.cc:107] Waiting for socket to connect
0927 19:37:39.128680 (+ 42us) client_negotiation.cc:174] Beginning negotiation
0927 19:37:39.128924 (+ 244us) client_negotiation.cc:252] Sending NEGOTIATE NegotiatePB request
0927 19:37:39.129157 (+ 233us) negotiation.cc:327] Negotiation complete: Network error: Client connection negotiation failed: client connection to 0.0.0.0:46263: BlockingWrite error: write error: Broken pipe (error 32)
Metrics: {"client-negotiator.queue_time_us":154}
[ OK ] Parameters/TestRpc.TestServerShutsDown/SSL_UnixSocket (22 ms)
[ RUN ] Parameters/TestRpc.TimedOutOnResponseMetric/SSL_UnixSocket
I20260927 19:37:39.149405 3566 acceptor_pool.cc:254] collecting diagnostics on the listening RPC socket unix:/tmp/dist-test-taskdjFNNy/test-tmp/rpc-test-0d120df5958f48c8b24b2bc24ee052d2.sock every 8 connection(s)
I20260927 19:37:39.150144 3567 acceptor_pool.cc:254] collecting diagnostics on the listening RPC socket unix:/tmp/dist-test-taskdjFNNy/test-tmp/rpc-test-0d120df5958f48c8b24b2bc24ee052d2.sock every 8 connection(s)
W20260927 19:37:39.393608 3570 rpcz_store.cc:267] Call kudu.rpc_test.CalculatorService.Sleep from unix:<unnamed> (request call id 3) took 50 ms (client timeout 25 ms). Trace:
W20260927 19:37:39.393904 3570 rpcz_store.cc:269] 0927 19:37:39.342955 (+ 0us) service_pool.cc:170] Inserting onto call queue
0927 19:37:39.343087 (+ 132us) service_pool.cc:227] Handling call
0927 19:37:39.393532 (+ 50445us) inbound_call.cc:173] Queueing success response
Related trace 'test_child':
Metrics: {"test_sleep_us":50000,"child_traces":[["test_child",{"related_trace_metric":1}]]}
W20260927 19:37:39.453845 3570 rpcz_store.cc:267] Call kudu.rpc_test.CalculatorService.Sleep from unix:<unnamed> (request call id 4) took 50 ms (client timeout 50 ms). Trace:
W20260927 19:37:39.454118 3570 rpcz_store.cc:269] 0927 19:37:39.403078 (+ 0us) service_pool.cc:170] Inserting onto call queue
0927 19:37:39.403338 (+ 260us) service_pool.cc:227] Handling call
0927 19:37:39.453778 (+ 50440us) inbound_call.cc:173] Queueing success response
Related trace 'test_child':
Metrics: {"test_sleep_us":50000,"child_traces":[["test_child",{"related_trace_metric":1}]]}
W20260927 19:37:39.457309 3563 connection.cc:196] Error closing socket: Network error: TlsSocket::Close: Broken pipe
[ OK ] Parameters/TestRpc.TimedOutOnResponseMetric/SSL_UnixSocket (329 ms)
[ RUN ] Parameters/TestRpc.AcceptorDispatchingTimesMetric/SSL_UnixSocket
I20260927 19:37:39.475528 3591 acceptor_pool.cc:254] collecting diagnostics on the listening RPC socket 0.0.0.0:43937 every 8 connection(s)
I20260927 19:37:39.476274 3592 acceptor_pool.cc:254] collecting diagnostics on the listening RPC socket 0.0.0.0:43937 every 8 connection(s)
W20260927 19:37:39.481421 3587 negotiation.cc:337] Failed RPC negotiation. Trace:
0927 19:37:39.480268 (+ 0us) reactor.cc:625] Submitting negotiation task for server connection from 127.0.0.1:48126 (local address 127.0.0.1:43937)
0927 19:37:39.480689 (+ 421us) server_negotiation.cc:206] Beginning negotiation
0927 19:37:39.480708 (+ 19us) server_negotiation.cc:399] Waiting for connection header
0927 19:37:39.480952 (+ 244us) negotiation.cc:327] Negotiation complete: Network error: Server connection negotiation failed: server connection from 127.0.0.1:48126: BlockingRecv error: recv got EOF from 127.0.0.1:48126 (error 108)
Metrics: {"server-negotiator.queue_time_us":110}
[ OK ] Parameters/TestRpc.AcceptorDispatchingTimesMetric/SSL_UnixSocket (24 ms)
[ RUN ] Parameters/TestRpc.TestRpcCallbackDestroysMessenger/SSL_UnixSocket
[ OK ] Parameters/TestRpc.TestRpcCallbackDestroysMessenger/SSL_UnixSocket (28 ms)
[ RUN ] Parameters/TestRpc.TestApplicationFeatureFlag/SSL_UnixSocket
I20260927 19:37:39.549309 3616 acceptor_pool.cc:254] collecting diagnostics on the listening RPC socket unix:/tmp/dist-test-taskdjFNNy/test-tmp/rpc-test-df61d543f9e84496ac7ba75256764452.sock every 8 connection(s)
I20260927 19:37:39.550089 3617 acceptor_pool.cc:254] collecting diagnostics on the listening RPC socket unix:/tmp/dist-test-taskdjFNNy/test-tmp/rpc-test-df61d543f9e84496ac7ba75256764452.sock every 8 connection(s)
W20260927 19:37:39.581562 3613 messenger.cc:357] Unable to handle RPC call: Not implemented: call requires unsupported application feature flags: 99
W20260927 19:37:39.585376 3613 connection.cc:196] Error closing socket: Network error: TlsSocket::Close: Broken pipe
[ OK ] Parameters/TestRpc.TestApplicationFeatureFlag/SSL_UnixSocket (74 ms)
[ RUN ] Parameters/TestRpc.TestCancellation/SSL_UnixSocket
I20260927 19:37:39.622426 3641 acceptor_pool.cc:254] collecting diagnostics on the listening RPC socket unix:/tmp/dist-test-taskdjFNNy/test-tmp/rpc-test-b542186c5fa34285a5db568ae000a1cb.sock every 8 connection(s)
I20260927 19:37:39.623169 3642 acceptor_pool.cc:254] collecting diagnostics on the listening RPC socket unix:/tmp/dist-test-taskdjFNNy/test-tmp/rpc-test-b542186c5fa34285a5db568ae000a1cb.sock every 8 connection(s)
I20260927 19:37:39.626427 3217 rpc-test.cc:1648] Connecting to unix:/tmp/dist-test-taskdjFNNy/test-tmp/rpc-test-b542186c5fa34285a5db568ae000a1cb.sock
I20260927 19:37:39.755630 3217 rpc-test-base.h:595] status: Aborted: Sleep RPC to unix:/tmp/dist-test-taskdjFNNy/test-tmp/rpc-test-b542186c5fa34285a5db568ae000a1cb.sock is cancelled in state READY, seconds elapsed: 0.000542568
I20260927 19:37:39.962815 3217 rpc-test-base.h:595] status: Aborted: Sleep RPC to unix:/tmp/dist-test-taskdjFNNy/test-tmp/rpc-test-b542186c5fa34285a5db568ae000a1cb.sock is cancelled in state SENT, seconds elapsed: 0.00104188
I20260927 19:37:39.963078 3644 rpc-test-base.h:222] got call: sleep_micros: 510000
I20260927 19:37:40.189761 3217 rpc-test-base.h:595] status: Aborted: Sleep RPC to unix:/tmp/dist-test-taskdjFNNy/test-tmp/rpc-test-b542186c5fa34285a5db568ae000a1cb.sock is cancelled in state SENT, seconds elapsed: 0.00098645
I20260927 19:37:40.190125 3643 rpc-test-base.h:222] got call: sleep_micros: 510000
I20260927 19:37:40.384864 3217 rpc-test-base.h:595] status: Aborted: Sleep RPC to unix:/tmp/dist-test-taskdjFNNy/test-tmp/rpc-test-b542186c5fa34285a5db568ae000a1cb.sock is cancelled in state SENT, seconds elapsed: 0.00105046
W20260927 19:37:40.396369 3645 rpcz_store.cc:267] Call kudu.rpc.GenericCalculatorService.Sleep from unix:<unnamed> (request call id 11) took 11 ms (client timeout 10 ms). Trace:
W20260927 19:37:40.396793 3645 rpcz_store.cc:269] 0927 19:37:40.384880 (+ 0us) service_pool.cc:170] Inserting onto call queue
0927 19:37:40.396126 (+ 11246us) service_pool.cc:214] Skipping call since client already timed out
0927 19:37:40.396209 (+ 83us) inbound_call.cc:173] Queueing failure response
Metrics: {}
I20260927 19:37:40.397353 3645 rpc-test-base.h:222] got call: sleep_micros: 1500000
W20260927 19:37:40.473752 3644 rpcz_store.cc:267] Call kudu.rpc.GenericCalculatorService.Sleep from unix:<unnamed> (request call id 3) took 511 ms (client timeout 10 ms). Trace:
W20260927 19:37:40.474086 3644 rpcz_store.cc:269] 0927 19:37:39.962852 (+ 0us) service_pool.cc:170] Inserting onto call queue
0927 19:37:39.963018 (+ 166us) service_pool.cc:227] Handling call
0927 19:37:40.473685 (+510667us) inbound_call.cc:173] Queueing success response
Metrics: {}
W20260927 19:37:40.700838 3643 rpcz_store.cc:267] Call kudu.rpc.GenericCalculatorService.Sleep from unix:<unnamed> (request call id 7) took 511 ms (client timeout 10 ms). Trace:
W20260927 19:37:40.701220 3643 rpcz_store.cc:269] 0927 19:37:40.189917 (+ 0us) service_pool.cc:170] Inserting onto call queue
0927 19:37:40.190069 (+ 152us) service_pool.cc:227] Handling call
0927 19:37:40.700774 (+510705us) inbound_call.cc:173] Queueing success response
Metrics: {}
I20260927 19:37:41.387408 3217 rpc-test-base.h:595] status: Timed out: Sleep RPC to unix:/tmp/dist-test-taskdjFNNy/test-tmp/rpc-test-b542186c5fa34285a5db568ae000a1cb.sock timed out after 1.000s (SENT), seconds elapsed: 1.00206
I20260927 19:37:41.389772 3643 rpc-test-base.h:222] got call: sleep_micros: 1500000
W20260927 19:37:41.898002 3645 rpcz_store.cc:267] Call kudu.rpc.GenericCalculatorService.Sleep from unix:<unnamed> (request call id 12) took 1511 ms (client timeout 1000 ms). Trace:
W20260927 19:37:41.898555 3645 rpcz_store.cc:269] 0927 19:37:40.386056 (+ 0us) service_pool.cc:170] Inserting onto call queue
0927 19:37:40.397323 (+ 11267us) service_pool.cc:227] Handling call
0927 19:37:41.897858 (+1500535us) inbound_call.cc:173] Queueing success response
Metrics: {}
I20260927 19:37:42.389992 3217 rpc-test-base.h:595] status: Timed out: Sleep RPC to unix:/tmp/dist-test-taskdjFNNy/test-tmp/rpc-test-b542186c5fa34285a5db568ae000a1cb.sock timed out after 1.000s (SENT), seconds elapsed: 1.00208
W20260927 19:37:42.391810 3638 messenger.cc:357] Unable to handle RPC call: Not implemented: call requires unsupported application feature flags: 99, 1
W20260927 19:37:42.393755 3638 messenger.cc:357] Unable to handle RPC call: Not implemented: call requires unsupported application feature flags: 99, 1
W20260927 19:37:42.631019 3638 connection.cc:196] Error closing socket: Network error: TlsSocket::Close: Broken pipe
W20260927 19:37:42.890522 3643 rpcz_store.cc:267] Call kudu.rpc.GenericCalculatorService.Sleep from unix:<unnamed> (request call id 13) took 1501 ms (client timeout 1000 ms). Trace:
W20260927 19:37:42.890930 3643 rpcz_store.cc:269] 0927 19:37:41.389357 (+ 0us) service_pool.cc:170] Inserting onto call queue
0927 19:37:41.389640 (+ 283us) service_pool.cc:227] Handling call
0927 19:37:42.890457 (+1500817us) inbound_call.cc:173] Queueing success response
Metrics: {}
W20260927 19:37:42.891744 3638 connection.cc:441] server connection from unix:<unnamed> torn down before Call kudu.rpc.GenericCalculatorService.Sleep from unix:<unnamed> (request call id 13) could send its response
[ OK ] Parameters/TestRpc.TestCancellation/SSL_UnixSocket (3310 ms)
[ RUN ] Parameters/TestRpc.TestCancellationMultiThreads/SSL_UnixSocket
I20260927 19:37:42.942163 3667 acceptor_pool.cc:254] collecting diagnostics on the listening RPC socket unix:/tmp/dist-test-taskdjFNNy/test-tmp/rpc-test-4c771525823a4714bdbfdde2abd30bd4.sock every 8 connection(s)
I20260927 19:37:42.943118 3668 acceptor_pool.cc:254] collecting diagnostics on the listening RPC socket unix:/tmp/dist-test-taskdjFNNy/test-tmp/rpc-test-4c771525823a4714bdbfdde2abd30bd4.sock every 8 connection(s)
I20260927 19:37:42.946342 3217 rpc-test.cc:1808] Connecting to unix:/tmp/dist-test-taskdjFNNy/test-tmp/rpc-test-4c771525823a4714bdbfdde2abd30bd4.sock
I20260927 19:37:43.113721 3681 test_util.cc:268] Using random seed: 357149463
I20260927 19:37:43.114775 3682 test_util.cc:268] Using random seed: 357150669
I20260927 19:37:43.116927 3683 test_util.cc:268] Using random seed: 357152865
I20260927 19:37:43.118494 3684 test_util.cc:268] Using random seed: 357154295
I20260927 19:37:43.119998 3685 test_util.cc:268] Using random seed: 357155793
I20260927 19:37:43.121433 3686 test_util.cc:268] Using random seed: 357157268
I20260927 19:37:43.123799 3687 test_util.cc:268] Using random seed: 357159568
I20260927 19:37:43.125362 3688 test_util.cc:268] Using random seed: 357161171
I20260927 19:37:43.127166 3689 test_util.cc:268] Using random seed: 357162959
I20260927 19:37:43.128566 3690 test_util.cc:268] Using random seed: 357164367
I20260927 19:37:43.130637 3691 test_util.cc:268] Using random seed: 357166363
I20260927 19:37:43.132469 3692 test_util.cc:268] Using random seed: 357168239
I20260927 19:37:43.135655 3694 test_util.cc:268] Using random seed: 357171424
I20260927 19:37:43.133996 3693 test_util.cc:268] Using random seed: 357169804
I20260927 19:37:43.137989 3695 test_util.cc:268] Using random seed: 357173447
I20260927 19:37:43.141851 3696 test_util.cc:268] Using random seed: 357177603
I20260927 19:37:43.143929 3697 test_util.cc:268] Using random seed: 357179610
I20260927 19:37:43.146108 3698 test_util.cc:268] Using random seed: 357181854
I20260927 19:37:43.148119 3699 test_util.cc:268] Using random seed: 357183862
I20260927 19:37:43.149755 3700 test_util.cc:268] Using random seed: 357185545
I20260927 19:37:43.151649 3701 test_util.cc:268] Using random seed: 357187338
I20260927 19:37:43.153764 3702 test_util.cc:268] Using random seed: 357189459
I20260927 19:37:43.156395 3703 test_util.cc:268] Using random seed: 357192165
I20260927 19:37:43.158813 3704 test_util.cc:268] Using random seed: 357194505
I20260927 19:37:43.160485 3705 test_util.cc:268] Using random seed: 357196154
I20260927 19:37:43.163133 3706 test_util.cc:268] Using random seed: 357198905
I20260927 19:37:43.165014 3707 test_util.cc:268] Using random seed: 357200786
I20260927 19:37:43.166687 3708 test_util.cc:268] Using random seed: 357202489
I20260927 19:37:43.168985 3709 test_util.cc:268] Using random seed: 357204781
I20260927 19:37:43.170655 3710 test_util.cc:268] Using random seed: 357206460
W20260927 19:38:04.905048 3664 connection.cc:196] Error closing socket: Network error: TlsSocket::Close: Broken pipe
[ OK ] Parameters/TestRpc.TestCancellationMultiThreads/SSL_UnixSocket (22024 ms)
[ RUN ] Parameters/TestRpc.TestCallId/SSL_UnixSocket
I20260927 19:38:04.961867 3724 acceptor_pool.cc:254] collecting diagnostics on the listening RPC socket unix:/tmp/dist-test-taskdjFNNy/test-tmp/rpc-test-247f89f552f14630be1c97bee1b7ff96.sock every 8 connection(s)
I20260927 19:38:04.962667 3725 acceptor_pool.cc:254] collecting diagnostics on the listening RPC socket unix:/tmp/dist-test-taskdjFNNy/test-tmp/rpc-test-247f89f552f14630be1c97bee1b7ff96.sock every 8 connection(s)
W20260927 19:38:05.026137 3721 connection.cc:196] Error closing socket: Network error: TlsSocket::Close: Broken pipe
[ OK ] Parameters/TestRpc.TestCallId/SSL_UnixSocket (107 ms)
[----------] 20 tests from Parameters/TestRpc (40897 ms total)
[----------] Global test environment tear-down
[==========] 21 tests from 2 test suites ran. (44016 ms total)
[ PASSED ] 20 tests.
[ FAILED ] 1 test, listed below:
[ FAILED ] Parameters/TestRpc.TestCallWithChainCertAndRootCA/SSL_UnixSocket, where GetParam() = (true, true)
1 FAILED TEST
I20260927 19:38:05.053839 3217 logging.cc:424] LogThrottler /data0/somelongdirectorytoavoidrpathissues/src/kudu/src/kudu/rpc/acceptor_pool.cc:285: suppressed but not reported on 3 messages since previous log ~36 seconds ago