Diagnosed failure
Parameters/TestRpc.TestCallWithChainCertAndChainCA/SSL_UnixSocket: /data0/somelongdirectorytoavoidrpathissues/src/kudu/src/kudu/rpc/rpc-test.cc:270: Failure
Failed
Bad status: Runtime error: could not verify certificate chain (error with cert: subject=CN = localhost, ST = sadfjas, C = AS, emailAddress = sdflkdsajf, O = lskdfjlsad, OU = sldfkja, issuer=C = AS, ST = ASDfkjdhf, L = lskdjf, O = saldfja, OU = skdjf, CN = localhost, emailAddress = sadjflkadsj): : certificate has expired
Google Test trace:
/data0/somelongdirectorytoavoidrpathissues/src/kudu/src/kudu/rpc/rpc-test.cc:267: Connecting to unix:/tmp/dist-test-taskI7GmtI/test-tmp/rpc-test-47ff916d37e548e5a3c93cb7d3aac6ea.sock
I20260926 12:10:32.430493 1948 test_util.cc:175] -----------------------------------------------
I20260926 12:10:32.430687 1948 test_util.cc:176] Had fatal failures, leaving test files at /tmp/dist-test-taskI7GmtI/test-tmp/rpc-test.6.Parameters_TestRpc.TestCallWithChainCertAndChainCA_SSL_UnixSocket.1790424630697228-1948-0
Full log
Note: This is test shard 7 of 8.
[==========] Running 21 tests from 2 test suites.
[----------] Global test environment set-up.
[----------] 20 tests from Parameters/TestRpc
[ RUN ] Parameters/TestRpc.TestMessengerCreateDestroy/SSL_UnixSocket
WARNING: Logging before InitGoogleLogging() is written to STDERR
I20260926 12:10:30.808360 1948 rpc-test.cc:169] started messenger TestCreateDestroy
[ OK ] Parameters/TestRpc.TestMessengerCreateDestroy/SSL_UnixSocket (1379 ms)
[ RUN ] Parameters/TestRpc.TestNegotiationDeadlock/SSL_UnixSocket
I20260926 12:10:32.198782 1970 acceptor_pool.cc:254] collecting diagnostics on the listening RPC socket unix:/tmp/dist-test-taskI7GmtI/test-tmp/rpc-test-980005d581f1475ea1eff37e3073bc5a.sock every 8 connection(s)
I20260926 12:10:32.202903 1971 acceptor_pool.cc:254] collecting diagnostics on the listening RPC socket unix:/tmp/dist-test-taskI7GmtI/test-tmp/rpc-test-980005d581f1475ea1eff37e3073bc5a.sock every 8 connection(s)
[ OK ] Parameters/TestRpc.TestNegotiationDeadlock/SSL_UnixSocket (163 ms)
[ RUN ] Parameters/TestRpc.TestCallWithChainCertAndChainCA/SSL_UnixSocket
I20260926 12:10:32.351825 1986 acceptor_pool.cc:254] collecting diagnostics on the listening RPC socket unix:/tmp/dist-test-taskI7GmtI/test-tmp/rpc-test-47ff916d37e548e5a3c93cb7d3aac6ea.sock every 8 connection(s)
I20260926 12:10:32.358958 1987 acceptor_pool.cc:254] collecting diagnostics on the listening RPC socket unix:/tmp/dist-test-taskI7GmtI/test-tmp/rpc-test-47ff916d37e548e5a3c93cb7d3aac6ea.sock every 8 connection(s)
/data0/somelongdirectorytoavoidrpathissues/src/kudu/src/kudu/rpc/rpc-test.cc:270: Failure
Failed
Bad status: Runtime error: could not verify certificate chain (error with cert: subject=CN = localhost, ST = sadfjas, C = AS, emailAddress = sdflkdsajf, O = lskdfjlsad, OU = sldfkja, issuer=C = AS, ST = ASDfkjdhf, L = lskdjf, O = saldfja, OU = skdjf, CN = localhost, emailAddress = sadjflkadsj): : certificate has expired
Google Test trace:
/data0/somelongdirectorytoavoidrpathissues/src/kudu/src/kudu/rpc/rpc-test.cc:267: Connecting to unix:/tmp/dist-test-taskI7GmtI/test-tmp/rpc-test-47ff916d37e548e5a3c93cb7d3aac6ea.sock
I20260926 12:10:32.430493 1948 test_util.cc:175] -----------------------------------------------
I20260926 12:10:32.430687 1948 test_util.cc:176] Had fatal failures, leaving test files at /tmp/dist-test-taskI7GmtI/test-tmp/rpc-test.6.Parameters_TestRpc.TestCallWithChainCertAndChainCA_SSL_UnixSocket.1790424630697228-1948-0
[ FAILED ] Parameters/TestRpc.TestCallWithChainCertAndChainCA/SSL_UnixSocket, where GetParam() = (true, true) (129 ms)
[ RUN ] Parameters/TestRpc.TestCallWithPasswordProtectedKey/SSL_UnixSocket
I20260926 12:10:32.451092 2011 acceptor_pool.cc:254] collecting diagnostics on the listening RPC socket unix:/tmp/dist-test-taskI7GmtI/test-tmp/rpc-test-66636e0066ee4a939132d2043e9076d5.sock every 8 connection(s)
I20260926 12:10:32.451941 2012 acceptor_pool.cc:254] collecting diagnostics on the listening RPC socket unix:/tmp/dist-test-taskI7GmtI/test-tmp/rpc-test-66636e0066ee4a939132d2043e9076d5.sock every 8 connection(s)
W20260926 12:10:32.508766 2008 connection.cc:196] Error closing socket: Network error: TlsSocket::Close: Broken pipe
[ OK ] Parameters/TestRpc.TestCallWithPasswordProtectedKey/SSL_UnixSocket (87 ms)
[ RUN ] Parameters/TestRpc.TestCallToBadServer/SSL_UnixSocket
I20260926 12:10:32.553752 1948 rpc-test.cc:394] Status: Network error: Client connection negotiation failed: client connection to 0.0.0.0:0: connect: Connection refused (error 111)
I20260926 12:10:32.555547 1948 rpc-test.cc:394] Status: Network error: Client connection negotiation failed: client connection to 0.0.0.0:0: connect: Connection refused (error 111)
I20260926 12:10:32.557922 1948 rpc-test.cc:394] Status: Network error: Client connection negotiation failed: client connection to 0.0.0.0:0: connect: Connection refused (error 111)
I20260926 12:10:32.560297 1948 rpc-test.cc:394] Status: Network error: Client connection negotiation failed: client connection to 0.0.0.0:0: connect: Connection refused (error 111)
I20260926 12:10:32.561745 1948 rpc-test.cc:394] Status: Network error: Client connection negotiation failed: client connection to 0.0.0.0:0: connect: Connection refused (error 111)
[ OK ] Parameters/TestRpc.TestCallToBadServer/SSL_UnixSocket (47 ms)
[ RUN ] Parameters/TestRpc.TestWrongService/SSL_UnixSocket
I20260926 12:10:32.600010 2046 acceptor_pool.cc:254] collecting diagnostics on the listening RPC socket unix:/tmp/dist-test-taskI7GmtI/test-tmp/rpc-test-696bb04f27c34770a606e5af99fa77ee.sock every 8 connection(s)
I20260926 12:10:32.601544 2047 acceptor_pool.cc:254] collecting diagnostics on the listening RPC socket unix:/tmp/dist-test-taskI7GmtI/test-tmp/rpc-test-696bb04f27c34770a606e5af99fa77ee.sock every 8 connection(s)
I20260926 12:10:32.655627 2043 messenger.cc:345] service WrongServiceName not registered on TestServer
W20260926 12:10:32.659789 2043 connection.cc:196] Error closing socket: Network error: TlsSocket::Close: Broken pipe
[ OK ] Parameters/TestRpc.TestWrongService/SSL_UnixSocket (101 ms)
[ RUN ] Parameters/TestRpc.TestConnectionKeepalive/SSL_UnixSocket
I20260926 12:10:32.692231 2069 acceptor_pool.cc:254] collecting diagnostics on the listening RPC socket unix:/tmp/dist-test-taskI7GmtI/test-tmp/rpc-test-e52ebe5978a244859f7adc965edacf46.sock every 8 connection(s)
I20260926 12:10:32.693053 2070 acceptor_pool.cc:254] collecting diagnostics on the listening RPC socket unix:/tmp/dist-test-taskI7GmtI/test-tmp/rpc-test-e52ebe5978a244859f7adc965edacf46.sock every 8 connection(s)
I20260926 12:10:32.696420 1948 rpc-test.cc:488] Connecting to unix:/tmp/dist-test-taskI7GmtI/test-tmp/rpc-test-e52ebe5978a244859f7adc965edacf46.sock
W20260926 12:10:33.171726 2082 connection.cc:196] Error closing socket: Network error: TlsSocket::Close: Broken pipe
[ OK ] Parameters/TestRpc.TestConnectionKeepalive/SSL_UnixSocket (1070 ms)
[ RUN ] Parameters/TestRpc.TestClientConnectionMetrics/SSL_UnixSocket
I20260926 12:10:33.797485 2094 acceptor_pool.cc:254] collecting diagnostics on the listening RPC socket unix:/tmp/dist-test-taskI7GmtI/test-tmp/rpc-test-97420e30b79b4b64b60be22b21e8a218.sock every 8 connection(s)
I20260926 12:10:33.798241 2095 acceptor_pool.cc:254] collecting diagnostics on the listening RPC socket unix:/tmp/dist-test-taskI7GmtI/test-tmp/rpc-test-97420e30b79b4b64b60be22b21e8a218.sock every 8 connection(s)
I20260926 12:10:33.801748 1948 rpc-test.cc:569] Connecting to unix:/tmp/dist-test-taskI7GmtI/test-tmp/rpc-test-97420e30b79b4b64b60be22b21e8a218.sock
W20260926 12:13:00.656021 2091 connection.cc:196] Error closing socket: Network error: TlsSocket::Close: Broken pipe
[ OK ] Parameters/TestRpc.TestClientConnectionMetrics/SSL_UnixSocket (146927 ms)
[ RUN ] Parameters/TestRpc.TestCredentialsPolicy/SSL_UnixSocket
I20260926 12:13:00.692680 2131 acceptor_pool.cc:254] collecting diagnostics on the listening RPC socket unix:/tmp/dist-test-taskI7GmtI/test-tmp/rpc-test-230164c908474a92ad8ef4bc63711c5a.sock every 8 connection(s)
I20260926 12:13:00.693670 2132 acceptor_pool.cc:254] collecting diagnostics on the listening RPC socket unix:/tmp/dist-test-taskI7GmtI/test-tmp/rpc-test-230164c908474a92ad8ef4bc63711c5a.sock every 8 connection(s)
I20260926 12:13:00.697285 1948 rpc-test.cc:700] Connecting to unix:/tmp/dist-test-taskI7GmtI/test-tmp/rpc-test-230164c908474a92ad8ef4bc63711c5a.sock
W20260926 12:13:00.759231 2130 connection.cc:196] Error closing socket: Network error: TlsSocket::Close: Broken pipe
[ OK ] Parameters/TestRpc.TestCredentialsPolicy/SSL_UnixSocket (115 ms)
[ RUN ] Parameters/TestRpc.TestCallLongerThanKeepalive/SSL_UnixSocket
I20260926 12:13:00.827379 2156 acceptor_pool.cc:254] collecting diagnostics on the listening RPC socket unix:/tmp/dist-test-taskI7GmtI/test-tmp/rpc-test-8af19e76f640426cbee1f9c9475abb4a.sock every 8 connection(s)
I20260926 12:13:00.828099 2157 acceptor_pool.cc:254] collecting diagnostics on the listening RPC socket unix:/tmp/dist-test-taskI7GmtI/test-tmp/rpc-test-8af19e76f640426cbee1f9c9475abb4a.sock every 8 connection(s)
I20260926 12:13:00.859380 2160 rpc-test-base.h:222] got call: sleep_micros: 3000000 deferred: true
I20260926 12:13:03.864238 2160 rpcz_store.cc:275] Call kudu.rpc.GenericCalculatorService.Sleep from unix:<unnamed> (request call id 0) took 3004 ms. Trace:
I20260926 12:13:03.864753 2160 rpcz_store.cc:276] 0926 12:13:00.859206 (+ 0us) service_pool.cc:170] Inserting onto call queue
0926 12:13:00.859326 (+ 120us) service_pool.cc:227] Handling call
0926 12:13:03.864006 (+3004680us) inbound_call.cc:173] Queueing success response
Metrics: {}
[ OK ] Parameters/TestRpc.TestCallLongerThanKeepalive/SSL_UnixSocket (3097 ms)
[ RUN ] Parameters/TestRpc.TestRpcSidecar/SSL_UnixSocket
I20260926 12:13:03.906940 2182 acceptor_pool.cc:254] collecting diagnostics on the listening RPC socket unix:/tmp/dist-test-taskI7GmtI/test-tmp/rpc-test-7aee7860904d4df4b40d2e4e74101f75.sock every 8 connection(s)
I20260926 12:13:03.908215 2183 acceptor_pool.cc:254] collecting diagnostics on the listening RPC socket unix:/tmp/dist-test-taskI7GmtI/test-tmp/rpc-test-7aee7860904d4df4b40d2e4e74101f75.sock every 8 connection(s)
W20260926 12:13:04.486410 2179 connection.cc:196] Error closing socket: Network error: TlsSocket::Close: Broken pipe
[ OK ] Parameters/TestRpc.TestRpcSidecar/SSL_UnixSocket (613 ms)
[ RUN ] Parameters/TestRpc.TestRpcSidecarLimits/SSL_UnixSocket
I20260926 12:13:32.981285 2210 acceptor_pool.cc:254] collecting diagnostics on the listening RPC socket unix:/tmp/dist-test-taskI7GmtI/test-tmp/rpc-test-232beb35531a4628a1034b4973b94c8b.sock every 8 connection(s)
I20260926 12:13:32.982162 2211 acceptor_pool.cc:254] collecting diagnostics on the listening RPC socket unix:/tmp/dist-test-taskI7GmtI/test-tmp/rpc-test-232beb35531a4628a1034b4973b94c8b.sock every 8 connection(s)
W20260926 12:13:33.027659 1948 serialization.cc:72] Serialized kudu.rpc_test.PushStringsRequestPB (2147483654 bytes) is larger than the maximum configured RPC message size (52428800 bytes). Sending anyway, but peer may reject the data.
W20260926 12:13:33.040445 2207 connection.cc:535] server connection from unix:<unnamed> recv error: Network error: RPC frame had a length of 2147483714, but we only support messages up to 52428800 bytes long.
W20260926 12:13:33.040776 2207 connection.cc:158] shutting down server connection from unix:<unnamed> with pending inbound data: 4/2147483714 bytes received; last active 0 ns ago: status Network error: RPC frame had a length of 2147483714, but we only support messages up to 52428800 bytes long.
W20260926 12:13:33.041786 2223 connection.cc:698] client connection to unix:/tmp/dist-test-taskI7GmtI/test-tmp/rpc-test-232beb35531a4628a1034b4973b94c8b.sock send error: Network error: failed to write to TLS socket: Broken pipe
W20260926 12:13:33.042510 2223 connection.cc:196] Error closing socket: Network error: TlsSocket::Close: Success
[ OK ] Parameters/TestRpc.TestRpcSidecarLimits/SSL_UnixSocket (29122 ms)
[ RUN ] Parameters/TestRpc.TestCallTimeoutDoesntAffectNegotiation/SSL_UnixSocket
I20260926 12:13:33.661034 2235 acceptor_pool.cc:254] collecting diagnostics on the listening RPC socket unix:/tmp/dist-test-taskI7GmtI/test-tmp/rpc-test-29fb16511e4b45ab9a263d009ad86376.sock every 8 connection(s)
I20260926 12:13:33.661865 2236 acceptor_pool.cc:254] collecting diagnostics on the listening RPC socket unix:/tmp/dist-test-taskI7GmtI/test-tmp/rpc-test-29fb16511e4b45ab9a263d009ad86376.sock every 8 connection(s)
W20260926 12:13:33.703896 2231 negotiation.cc:266] Injecting 500ms delay in negotiation
I20260926 12:13:33.753531 1948 rpc-test-base.h:595] status: Timed out: connection negotiation to unix:/tmp/dist-test-taskI7GmtI/test-tmp/rpc-test-29fb16511e4b45ab9a263d009ad86376.sock for RPC Sleep timed out after 0.050s (ON_OUTBOUND_QUEUE), seconds elapsed: 0.0507965
W20260926 12:13:34.218230 2232 connection.cc:196] Error closing socket: Network error: TlsSocket::Close: Broken pipe
[ OK ] Parameters/TestRpc.TestCallTimeoutDoesntAffectNegotiation/SSL_UnixSocket (608 ms)
[ RUN ] Parameters/TestRpc.TestRpcHandlerLatencyMetric/SSL_UnixSocket
I20260926 12:13:34.249447 2260 acceptor_pool.cc:254] collecting diagnostics on the listening RPC socket unix:/tmp/dist-test-taskI7GmtI/test-tmp/rpc-test-0a3276283dca4c24af340e6d217aac32.sock every 8 connection(s)
I20260926 12:13:34.250192 2261 acceptor_pool.cc:254] collecting diagnostics on the listening RPC socket unix:/tmp/dist-test-taskI7GmtI/test-tmp/rpc-test-0a3276283dca4c24af340e6d217aac32.sock every 8 connection(s)
I20260926 12:13:34.306499 1948 rpc-test.cc:1236] Sleep() min lat: 22310
I20260926 12:13:34.306737 1948 rpc-test.cc:1237] Sleep() mean lat: 22310
I20260926 12:13:34.306885 1948 rpc-test.cc:1238] Sleep() max lat: 22310
I20260926 12:13:34.307034 1948 rpc-test.cc:1239] Sleep() #calls: 1
[ OK ] Parameters/TestRpc.TestRpcHandlerLatencyMetric/SSL_UnixSocket (92 ms)
[ RUN ] Parameters/TestRpc.TimedOutOnResponseMetricServiceQueue/SSL_UnixSocket
I20260926 12:13:34.349882 2286 acceptor_pool.cc:254] collecting diagnostics on the listening RPC socket unix:/tmp/dist-test-taskI7GmtI/test-tmp/rpc-test-141af4d73a744260832d662de02765f4.sock every 8 connection(s)
I20260926 12:13:34.350768 2287 acceptor_pool.cc:254] collecting diagnostics on the listening RPC socket unix:/tmp/dist-test-taskI7GmtI/test-tmp/rpc-test-141af4d73a744260832d662de02765f4.sock every 8 connection(s)
W20260926 12:13:34.436240 2288 rpcz_store.cc:267] Call kudu.rpc_test.CalculatorService.Sleep from unix:<unnamed> (request call id 2) took 20 ms (client timeout 20 ms). Trace:
W20260926 12:13:34.436586 2288 rpcz_store.cc:269] 0926 12:13:34.415541 (+ 0us) service_pool.cc:170] Inserting onto call queue
0926 12:13:34.436078 (+ 20537us) service_pool.cc:214] Skipping call since client already timed out
0926 12:13:34.436176 (+ 98us) inbound_call.cc:173] Queueing failure response
Metrics: {}
W20260926 12:13:34.439798 2283 connection.cc:196] Error closing socket: Network error: TlsSocket::Close: Broken pipe
[ OK ] Parameters/TestRpc.TimedOutOnResponseMetricServiceQueue/SSL_UnixSocket (128 ms)
[ RUN ] Parameters/TestRpc.RpcPendingConnectionsMetric/SSL_UnixSocket
I20260926 12:13:34.457201 2309 acceptor_pool.cc:254] collecting diagnostics on the listening RPC socket 0.0.0.0:46059 every 8 connection(s)
I20260926 12:13:34.458022 2310 acceptor_pool.cc:254] collecting diagnostics on the listening RPC socket 0.0.0.0:46059 every 8 connection(s)
W20260926 12:13:34.477011 2305 negotiation.cc:337] Failed RPC negotiation. Trace:
0926 12:13:34.475237 (+ 0us) reactor.cc:625] Submitting negotiation task for server connection from 127.0.0.1:45170 (local address 127.0.0.1:46059)
0926 12:13:34.475837 (+ 600us) server_negotiation.cc:206] Beginning negotiation
0926 12:13:34.475863 (+ 26us) server_negotiation.cc:399] Waiting for connection header
0926 12:13:34.476209 (+ 346us) negotiation.cc:327] Negotiation complete: Network error: Server connection negotiation failed: server connection from 127.0.0.1:45170: BlockingRecv error: recv got EOF from 127.0.0.1:45170 (error 108)
Metrics: {"server-negotiator.queue_time_us":176}
[ OK ] Parameters/TestRpc.RpcPendingConnectionsMetric/SSL_UnixSocket (45 ms)
[ RUN ] Parameters/TestRpc.TestRpcContextClientDeadline/SSL_UnixSocket
I20260926 12:13:34.510885 2325 acceptor_pool.cc:254] collecting diagnostics on the listening RPC socket unix:/tmp/dist-test-taskI7GmtI/test-tmp/rpc-test-666b717ef6b44e4da2388cb8670c1e19.sock every 8 connection(s)
I20260926 12:13:34.511613 2326 acceptor_pool.cc:254] collecting diagnostics on the listening RPC socket unix:/tmp/dist-test-taskI7GmtI/test-tmp/rpc-test-666b717ef6b44e4da2388cb8670c1e19.sock every 8 connection(s)
W20260926 12:13:34.575626 2322 connection.cc:196] Error closing socket: Network error: TlsSocket::Close: Broken pipe
[ OK ] Parameters/TestRpc.TestRpcContextClientDeadline/SSL_UnixSocket (91 ms)
[ RUN ] Parameters/TestRpc.TestApplicationFeatureFlagUnsupportedServer/SSL_UnixSocket
I20260926 12:13:34.606129 2350 acceptor_pool.cc:254] collecting diagnostics on the listening RPC socket unix:/tmp/dist-test-taskI7GmtI/test-tmp/rpc-test-077ed242ebcb483f9e9749daa6f27522.sock every 8 connection(s)
I20260926 12:13:34.606940 2351 acceptor_pool.cc:254] collecting diagnostics on the listening RPC socket unix:/tmp/dist-test-taskI7GmtI/test-tmp/rpc-test-077ed242ebcb483f9e9749daa6f27522.sock every 8 connection(s)
W20260926 12:13:34.638782 2347 connection.cc:196] Error closing socket: Network error: TlsSocket::Close: Broken pipe
[ OK ] Parameters/TestRpc.TestApplicationFeatureFlagUnsupportedServer/SSL_UnixSocket (62 ms)
[ RUN ] Parameters/TestRpc.TestCancellationAsync/SSL_UnixSocket
I20260926 12:13:34.667884 2375 acceptor_pool.cc:254] collecting diagnostics on the listening RPC socket unix:/tmp/dist-test-taskI7GmtI/test-tmp/rpc-test-531277b1e4464169948cc15f2c4832d7.sock every 8 connection(s)
I20260926 12:13:34.668610 2376 acceptor_pool.cc:254] collecting diagnostics on the listening RPC socket unix:/tmp/dist-test-taskI7GmtI/test-tmp/rpc-test-531277b1e4464169948cc15f2c4832d7.sock every 8 connection(s)
I20260926 12:13:34.672246 1948 rpc-test.cc:1716] Connecting to unix:/tmp/dist-test-taskI7GmtI/test-tmp/rpc-test-531277b1e4464169948cc15f2c4832d7.sock
I20260926 12:13:34.726917 1948 test_util.cc:268] Using random seed: -1022087451
I20260926 12:13:34.989881 2379 rpc-test-base.h:240] got call: sleep_micros: 500 pattern: 4294967295 num_repetitions: 2097152 sidecar_idx: 0
I20260926 12:13:35.216569 2379 rpc-test-base.h:240] got call: sleep_micros: 500 pattern: 4294967295 num_repetitions: 2097152 sidecar_idx: 0
I20260926 12:13:35.419620 2379 rpc-test-base.h:240] got call: sleep_micros: 500 pattern: 4294967295 num_repetitions: 2097152 sidecar_idx: 0
I20260926 12:13:35.623818 2378 rpc-test-base.h:240] got call: sleep_micros: 500 pattern: 4294967295 num_repetitions: 2097152 sidecar_idx: 0
I20260926 12:13:35.842190 2378 rpc-test-base.h:240] got call: sleep_micros: 500 pattern: 4294967295 num_repetitions: 2097152 sidecar_idx: 0
I20260926 12:13:36.026330 2379 rpc-test-base.h:240] got call: sleep_micros: 500 pattern: 4294967295 num_repetitions: 2097152 sidecar_idx: 0
I20260926 12:13:36.266361 2378 rpc-test-base.h:240] got call: sleep_micros: 500 pattern: 4294967295 num_repetitions: 2097152 sidecar_idx: 0
I20260926 12:13:36.486052 2378 rpc-test-base.h:240] got call: sleep_micros: 500 pattern: 4294967295 num_repetitions: 2097152 sidecar_idx: 0
I20260926 12:13:36.692720 2379 rpc-test-base.h:240] got call: sleep_micros: 500 pattern: 4294967295 num_repetitions: 2097152 sidecar_idx: 0
W20260926 12:13:36.715718 2372 connection.cc:196] Error closing socket: Network error: TlsSocket::Close: Broken pipe
W20260926 12:13:36.832399 2372 connection.cc:441] server connection from unix:<unnamed> torn down before Call kudu.rpc.GenericCalculatorService.SleepWithSidecar from unix:<unnamed> (request call id 9) could send its response
[ OK ] Parameters/TestRpc.TestCancellationAsync/SSL_UnixSocket (2198 ms)
[ RUN ] Parameters/TestRpc.TestPerformanceBySocketType/SSL_UnixSocket
I20260926 12:13:36.940747 2400 acceptor_pool.cc:254] collecting diagnostics on the listening RPC socket unix:/tmp/dist-test-taskI7GmtI/test-tmp/rpc-test-271718b15822453981e6077a378a94b9.sock every 8 connection(s)
I20260926 12:13:36.941465 2401 acceptor_pool.cc:254] collecting diagnostics on the listening RPC socket unix:/tmp/dist-test-taskI7GmtI/test-tmp/rpc-test-271718b15822453981e6077a378a94b9.sock every 8 connection(s)
I20260926 12:13:36.945060 1948 rpc-test.cc:1846] Connecting to unix:/tmp/dist-test-taskI7GmtI/test-tmp/rpc-test-271718b15822453981e6077a378a94b9.sock
I20260926 12:14:01.693341 1948 rpc-test.cc:1859] Sending 1024MB via ssl-enabled unix socket: real 24.735s user 21.662s sys 16.605s
I20260926 12:14:22.944038 1948 rpc-test.cc:1859] Sending 1024MB via ssl-enabled unix socket: real 21.250s user 18.481s sys 13.644s
I20260926 12:14:44.368633 1948 rpc-test.cc:1859] Sending 1024MB via ssl-enabled unix socket: real 21.424s user 18.812s sys 13.725s
I20260926 12:15:05.727773 1948 rpc-test.cc:1859] Sending 1024MB via ssl-enabled unix socket: real 21.359s user 18.990s sys 13.435s
I20260926 12:15:27.200083 1948 rpc-test.cc:1859] Sending 1024MB via ssl-enabled unix socket: real 21.472s user 18.971s sys 13.661s
W20260926 12:15:27.205787 2397 connection.cc:196] Error closing socket: Network error: TlsSocket::Close: Broken pipe
[ OK ] Parameters/TestRpc.TestPerformanceBySocketType/SSL_UnixSocket (110374 ms)
[----------] 20 tests from Parameters/TestRpc (296461 ms total)
[----------] 1 test from Parameters/TestRpcSocketTxRxQueue
[ RUN ] Parameters/TestRpcSocketTxRxQueue.AcceptorRxQueueSizeMetric/0
I20260926 12:15:27.230314 2436 acceptor_pool.cc:254] collecting diagnostics on the listening RPC socket 0.0.0.0:34729 every 1 connection(s)
I20260926 12:15:27.231271 2437 acceptor_pool.cc:254] collecting diagnostics on the listening RPC socket 0.0.0.0:34729 every 1 connection(s)
W20260926 12:15:27.237399 2432 negotiation.cc:337] Failed RPC negotiation. Trace:
0926 12:15:27.235655 (+ 0us) reactor.cc:625] Submitting negotiation task for server connection from 127.0.0.1:59184 (local address 127.0.0.1:34729)
0926 12:15:27.236172 (+ 517us) server_negotiation.cc:206] Beginning negotiation
0926 12:15:27.236201 (+ 29us) server_negotiation.cc:399] Waiting for connection header
0926 12:15:27.236459 (+ 258us) negotiation.cc:327] Negotiation complete: Network error: Server connection negotiation failed: server connection from 127.0.0.1:59184: BlockingRecv error: recv got EOF from 127.0.0.1:59184 (error 108)
Metrics: {"server-negotiator.queue_time_us":125}
[ OK ] Parameters/TestRpcSocketTxRxQueue.AcceptorRxQueueSizeMetric/0 (25 ms)
[----------] 1 test from Parameters/TestRpcSocketTxRxQueue (25 ms total)
[----------] Global test environment tear-down
[==========] 21 tests from 2 test suites ran. (296487 ms total)
[ PASSED ] 20 tests.
[ FAILED ] 1 test, listed below:
[ FAILED ] Parameters/TestRpc.TestCallWithChainCertAndChainCA/SSL_UnixSocket, where GetParam() = (true, true)
1 FAILED TEST