Diagnosed failure

Parameters/TestRpc.TestCallWithChainCertAndRootCA/SSL_UnixSocket: /data0/somelongdirectorytoavoidrpathissues/src/kudu/src/kudu/rpc/rpc-test.cc:303: Failure
Failed
Bad status: Runtime error: could not verify certificate chain (error with cert: subject=CN = localhost, ST = sadfjas, C = AS, emailAddress = sdflkdsajf, O = lskdfjlsad, OU = sldfkja, issuer=C = AS, ST = ASDfkjdhf, L = lskdjf, O = saldfja, OU = skdjf, CN = localhost, emailAddress = sadjflkadsj): : certificate has expired
Google Test trace:
/data0/somelongdirectorytoavoidrpathissues/src/kudu/src/kudu/rpc/rpc-test.cc:300: Connecting to unix:/tmp/dist-test-taskA7Yeqp/test-tmp/rpc-test-a6602e38b5a4462d848bc7756f522043.sock
I20260928 11:43:48.103586   390 test_util.cc:175] -----------------------------------------------
I20260928 11:43:48.103857   390 test_util.cc:176] Had fatal failures, leaving test files at /tmp/dist-test-taskA7Yeqp/test-tmp/rpc-test.2.Parameters_TestRpc.TestCallWithChainCertAndRootCA_SSL_UnixSocket.1790595824542320-390-0

Full log

Note: This is test shard 3 of 8.
[==========] Running 21 tests from 2 test suites.
[----------] Global test environment set-up.
[----------] 1 test from TestRpc
[ RUN      ] TestRpc.TestNegotiationTimeout
WARNING: Logging before InitGoogleLogging() is written to STDERR
I20260928 11:43:44.741824   390 rpc-test-base.h:595] status: Timed out: connection negotiation to 0.0.0.0:41927 for RPC Sleep timed out after 0.100s (ON_OUTBOUND_QUEUE), seconds elapsed: 0.101861
W20260928 11:43:47.745255   400 negotiation.cc:337] Failed RPC negotiation. Trace:
0928 11:43:44.641005 (+     0us) reactor.cc:625] Submitting negotiation task for client connection to 0.0.0.0:41927 (local address 127.0.0.1:33000)
0928 11:43:44.641767 (+   762us) negotiation.cc:107] Waiting for socket to connect
0928 11:43:44.641819 (+    52us) client_negotiation.cc:174] Beginning negotiation
0928 11:43:44.655564 (+ 13745us) client_negotiation.cc:252] Sending NEGOTIATE NegotiatePB request
0928 11:43:47.744041 (+3088477us) negotiation.cc:327] Negotiation complete: Timed out: Client connection negotiation failed: client connection to 0.0.0.0:41927: received 0 of 4 requested bytes
Metrics: {"client-negotiator.queue_time_us":214}
[       OK ] TestRpc.TestNegotiationTimeout (3147 ms)
[----------] 1 test from TestRpc (3147 ms total)

[----------] 20 tests from Parameters/TestRpc
[ RUN      ] Parameters/TestRpc.TestAcceptorPoolStartStop/SSL_UnixSocket
I20260928 11:43:47.797847   416 acceptor_pool.cc:254] collecting diagnostics on the listening RPC socket unix:/tmp/dist-test-taskA7Yeqp/test-tmp/rpc-test-f4fc6eef64f84ad59e90c0be7f1c5b7e.sock every 8 connection(s)
I20260928 11:43:47.799794   417 acceptor_pool.cc:254] collecting diagnostics on the listening RPC socket unix:/tmp/dist-test-taskA7Yeqp/test-tmp/rpc-test-f4fc6eef64f84ad59e90c0be7f1c5b7e.sock every 8 connection(s)
I20260928 11:43:47.853386   427 acceptor_pool.cc:254] collecting diagnostics on the listening RPC socket unix:/tmp/dist-test-taskA7Yeqp/test-tmp/rpc-test-f4fc6eef64f84ad59e90c0be7f1c5b7e.sock every 8 connection(s)
I20260928 11:43:47.854848   428 acceptor_pool.cc:254] collecting diagnostics on the listening RPC socket unix:/tmp/dist-test-taskA7Yeqp/test-tmp/rpc-test-f4fc6eef64f84ad59e90c0be7f1c5b7e.sock every 8 connection(s)
I20260928 11:43:47.882088   438 acceptor_pool.cc:254] collecting diagnostics on the listening RPC socket unix:/tmp/dist-test-taskA7Yeqp/test-tmp/rpc-test-f4fc6eef64f84ad59e90c0be7f1c5b7e.sock every 8 connection(s)
I20260928 11:43:47.882793   439 acceptor_pool.cc:254] collecting diagnostics on the listening RPC socket unix:/tmp/dist-test-taskA7Yeqp/test-tmp/rpc-test-f4fc6eef64f84ad59e90c0be7f1c5b7e.sock every 8 connection(s)
I20260928 11:43:47.904902   449 acceptor_pool.cc:254] collecting diagnostics on the listening RPC socket unix:/tmp/dist-test-taskA7Yeqp/test-tmp/rpc-test-f4fc6eef64f84ad59e90c0be7f1c5b7e.sock every 8 connection(s)
I20260928 11:43:47.905612   450 acceptor_pool.cc:254] collecting diagnostics on the listening RPC socket unix:/tmp/dist-test-taskA7Yeqp/test-tmp/rpc-test-f4fc6eef64f84ad59e90c0be7f1c5b7e.sock every 8 connection(s)
I20260928 11:43:47.935389   460 acceptor_pool.cc:254] collecting diagnostics on the listening RPC socket unix:/tmp/dist-test-taskA7Yeqp/test-tmp/rpc-test-f4fc6eef64f84ad59e90c0be7f1c5b7e.sock every 8 connection(s)
I20260928 11:43:47.936151   461 acceptor_pool.cc:254] collecting diagnostics on the listening RPC socket unix:/tmp/dist-test-taskA7Yeqp/test-tmp/rpc-test-f4fc6eef64f84ad59e90c0be7f1c5b7e.sock every 8 connection(s)
[       OK ] Parameters/TestRpc.TestAcceptorPoolStartStop/SSL_UnixSocket (190 ms)
[ RUN      ] Parameters/TestRpc.TestCall/SSL_UnixSocket
I20260928 11:43:47.977674   473 acceptor_pool.cc:254] collecting diagnostics on the listening RPC socket unix:/tmp/dist-test-taskA7Yeqp/test-tmp/rpc-test-ed899ef981dc4046a11da42b53a62869.sock every 8 connection(s)
I20260928 11:43:47.980005   474 acceptor_pool.cc:254] collecting diagnostics on the listening RPC socket unix:/tmp/dist-test-taskA7Yeqp/test-tmp/rpc-test-ed899ef981dc4046a11da42b53a62869.sock every 8 connection(s)
I20260928 11:43:47.985903   390 rpc-test.cc:234] Connecting to unix:/tmp/dist-test-taskA7Yeqp/test-tmp/rpc-test-ed899ef981dc4046a11da42b53a62869.sock
W20260928 11:43:48.047070   470 connection.cc:196] Error closing socket: Network error: TlsSocket::Close: Broken pipe
[       OK ] Parameters/TestRpc.TestCall/SSL_UnixSocket (112 ms)
[ RUN      ] Parameters/TestRpc.TestCallWithChainCertAndRootCA/SSL_UnixSocket
I20260928 11:43:48.080140   498 acceptor_pool.cc:254] collecting diagnostics on the listening RPC socket unix:/tmp/dist-test-taskA7Yeqp/test-tmp/rpc-test-a6602e38b5a4462d848bc7756f522043.sock every 8 connection(s)
I20260928 11:43:48.080883   499 acceptor_pool.cc:254] collecting diagnostics on the listening RPC socket unix:/tmp/dist-test-taskA7Yeqp/test-tmp/rpc-test-a6602e38b5a4462d848bc7756f522043.sock every 8 connection(s)
/data0/somelongdirectorytoavoidrpathissues/src/kudu/src/kudu/rpc/rpc-test.cc:303: Failure
Failed
Bad status: Runtime error: could not verify certificate chain (error with cert: subject=CN = localhost, ST = sadfjas, C = AS, emailAddress = sdflkdsajf, O = lskdfjlsad, OU = sldfkja, issuer=C = AS, ST = ASDfkjdhf, L = lskdjf, O = saldfja, OU = skdjf, CN = localhost, emailAddress = sadjflkadsj): : certificate has expired
Google Test trace:
/data0/somelongdirectorytoavoidrpathissues/src/kudu/src/kudu/rpc/rpc-test.cc:300: Connecting to unix:/tmp/dist-test-taskA7Yeqp/test-tmp/rpc-test-a6602e38b5a4462d848bc7756f522043.sock
I20260928 11:43:48.103586   390 test_util.cc:175] -----------------------------------------------
I20260928 11:43:48.103857   390 test_util.cc:176] Had fatal failures, leaving test files at /tmp/dist-test-taskA7Yeqp/test-tmp/rpc-test.2.Parameters_TestRpc.TestCallWithChainCertAndRootCA_SSL_UnixSocket.1790595824542320-390-0
[  FAILED  ] Parameters/TestRpc.TestCallWithChainCertAndRootCA/SSL_UnixSocket, where GetParam() = (true, true) (50 ms)
[ RUN      ] Parameters/TestRpc.TestCallWithBadPasswordProtectedKey/SSL_UnixSocket
[       OK ] Parameters/TestRpc.TestCallWithBadPasswordProtectedKey/SSL_UnixSocket (32 ms)
[ RUN      ] Parameters/TestRpc.TestInvalidMethodCall/SSL_UnixSocket
I20260928 11:43:48.160573   535 acceptor_pool.cc:254] collecting diagnostics on the listening RPC socket unix:/tmp/dist-test-taskA7Yeqp/test-tmp/rpc-test-288aee57e82d41cea65c836268d4fccc.sock every 8 connection(s)
I20260928 11:43:48.161386   536 acceptor_pool.cc:254] collecting diagnostics on the listening RPC socket unix:/tmp/dist-test-taskA7Yeqp/test-tmp/rpc-test-288aee57e82d41cea65c836268d4fccc.sock every 8 connection(s)
I20260928 11:43:48.164906   390 rpc-test.cc:406] Connecting to unix:/tmp/dist-test-taskA7Yeqp/test-tmp/rpc-test-288aee57e82d41cea65c836268d4fccc.sock
W20260928 11:43:48.199136   532 connection.cc:196] Error closing socket: Network error: TlsSocket::Close: Broken pipe
[       OK ] Parameters/TestRpc.TestInvalidMethodCall/SSL_UnixSocket (68 ms)
[ RUN      ] Parameters/TestRpc.TestHighFDs/SSL_UnixSocket
I20260928 11:43:48.443126   560 acceptor_pool.cc:254] collecting diagnostics on the listening RPC socket unix:/tmp/dist-test-taskA7Yeqp/test-tmp/rpc-test-012ffd28b76d439c9b283bc230bab2bc.sock every 8 connection(s)
I20260928 11:43:48.443856   561 acceptor_pool.cc:254] collecting diagnostics on the listening RPC socket unix:/tmp/dist-test-taskA7Yeqp/test-tmp/rpc-test-012ffd28b76d439c9b283bc230bab2bc.sock every 8 connection(s)
[       OK ] Parameters/TestRpc.TestHighFDs/SSL_UnixSocket (280 ms)
[ RUN      ] Parameters/TestRpc.TestConnectionAlwaysKeepalive/SSL_UnixSocket
I20260928 11:43:48.504078   583 acceptor_pool.cc:254] collecting diagnostics on the listening RPC socket unix:/tmp/dist-test-taskA7Yeqp/test-tmp/rpc-test-bdfeb46657bb44b083d9d91ab49248fd.sock every 8 connection(s)
I20260928 11:43:48.504796   584 acceptor_pool.cc:254] collecting diagnostics on the listening RPC socket unix:/tmp/dist-test-taskA7Yeqp/test-tmp/rpc-test-bdfeb46657bb44b083d9d91ab49248fd.sock every 8 connection(s)
I20260928 11:43:48.507985   390 rpc-test.cc:532] Connecting to unix:/tmp/dist-test-taskA7Yeqp/test-tmp/rpc-test-bdfeb46657bb44b083d9d91ab49248fd.sock
W20260928 11:43:51.547399   582 connection.cc:196] Error closing socket: Network error: TlsSocket::Close: Broken pipe
[       OK ] Parameters/TestRpc.TestConnectionAlwaysKeepalive/SSL_UnixSocket (3068 ms)
[ RUN      ] Parameters/TestRpc.TestReopenOutboundConnections/SSL_UnixSocket
I20260928 11:43:51.584993   606 acceptor_pool.cc:254] collecting diagnostics on the listening RPC socket unix:/tmp/dist-test-taskA7Yeqp/test-tmp/rpc-test-adbcf6e5bf204fd0be2e2f8ebffb27e2.sock every 8 connection(s)
I20260928 11:43:51.585780   607 acceptor_pool.cc:254] collecting diagnostics on the listening RPC socket unix:/tmp/dist-test-taskA7Yeqp/test-tmp/rpc-test-adbcf6e5bf204fd0be2e2f8ebffb27e2.sock every 8 connection(s)
I20260928 11:43:51.589027   390 rpc-test.cc:658] Connecting to unix:/tmp/dist-test-taskA7Yeqp/test-tmp/rpc-test-adbcf6e5bf204fd0be2e2f8ebffb27e2.sock
W20260928 11:43:51.617681   605 connection.cc:196] Error closing socket: Network error: TlsSocket::Close: Broken pipe
W20260928 11:43:51.628149   605 connection.cc:196] Error closing socket: Network error: TlsSocket::Close: Broken pipe
W20260928 11:43:51.638396   605 connection.cc:196] Error closing socket: Network error: TlsSocket::Close: Broken pipe
W20260928 11:43:51.649109   605 connection.cc:196] Error closing socket: Network error: TlsSocket::Close: Broken pipe
W20260928 11:43:51.670852   605 connection.cc:196] Error closing socket: Network error: TlsSocket::Close: Broken pipe
W20260928 11:43:51.681406   605 connection.cc:196] Error closing socket: Network error: TlsSocket::Close: Broken pipe
W20260928 11:43:51.691680   605 connection.cc:196] Error closing socket: Network error: TlsSocket::Close: Broken pipe
W20260928 11:43:51.702109   605 connection.cc:196] Error closing socket: Network error: TlsSocket::Close: Broken pipe
W20260928 11:43:51.712170   605 connection.cc:196] Error closing socket: Network error: TlsSocket::Close: Broken pipe
W20260928 11:43:51.722702   605 connection.cc:196] Error closing socket: Network error: TlsSocket::Close: Broken pipe
W20260928 11:43:51.733110   605 connection.cc:196] Error closing socket: Network error: TlsSocket::Close: Broken pipe
W20260928 11:43:51.744228   605 connection.cc:196] Error closing socket: Network error: TlsSocket::Close: Broken pipe
W20260928 11:43:51.754698   605 connection.cc:196] Error closing socket: Network error: TlsSocket::Close: Broken pipe
W20260928 11:43:51.754769   606 acceptor_pool.cc:285] unable to collect diagnostics on RPC socket unix:/tmp/dist-test-taskA7Yeqp/test-tmp/rpc-test-adbcf6e5bf204fd0be2e2f8ebffb27e2.sock: Not implemented: netlink diagnostics is currently supported only on IPv4 TCP sockets
W20260928 11:43:51.765945   605 connection.cc:196] Error closing socket: Network error: TlsSocket::Close: Broken pipe
W20260928 11:43:51.776790   605 connection.cc:196] Error closing socket: Network error: TlsSocket::Close: Broken pipe
W20260928 11:43:51.786917   605 connection.cc:196] Error closing socket: Network error: TlsSocket::Close: Broken pipe
W20260928 11:43:51.797413   605 connection.cc:196] Error closing socket: Network error: TlsSocket::Close: Broken pipe
W20260928 11:43:51.808445   605 connection.cc:196] Error closing socket: Network error: TlsSocket::Close: Broken pipe
W20260928 11:43:51.819327   605 connection.cc:196] Error closing socket: Network error: TlsSocket::Close: Broken pipe
W20260928 11:43:51.830029   605 connection.cc:196] Error closing socket: Network error: TlsSocket::Close: Broken pipe
W20260928 11:43:51.840871   605 connection.cc:196] Error closing socket: Network error: TlsSocket::Close: Broken pipe
W20260928 11:43:51.851648   605 connection.cc:196] Error closing socket: Network error: TlsSocket::Close: Broken pipe
W20260928 11:43:51.862784   605 connection.cc:196] Error closing socket: Network error: TlsSocket::Close: Broken pipe
W20260928 11:43:51.874034   605 connection.cc:196] Error closing socket: Network error: TlsSocket::Close: Broken pipe
W20260928 11:43:51.883896   605 connection.cc:196] Error closing socket: Network error: TlsSocket::Close: Broken pipe
W20260928 11:43:51.894342   605 connection.cc:196] Error closing socket: Network error: TlsSocket::Close: Broken pipe
W20260928 11:43:51.904558   605 connection.cc:196] Error closing socket: Network error: TlsSocket::Close: Broken pipe
W20260928 11:43:51.913961   605 connection.cc:196] Error closing socket: Network error: TlsSocket::Close: Broken pipe
W20260928 11:43:51.923810   605 connection.cc:196] Error closing socket: Network error: TlsSocket::Close: Broken pipe
W20260928 11:43:51.933015   605 connection.cc:196] Error closing socket: Network error: TlsSocket::Close: Broken pipe
W20260928 11:43:51.943763   605 connection.cc:196] Error closing socket: Network error: TlsSocket::Close: Broken pipe
[       OK ] Parameters/TestRpc.TestReopenOutboundConnections/SSL_UnixSocket (394 ms)
[ RUN      ] Parameters/TestRpc.TestConnectionNetworkPlane/SSL_UnixSocket
I20260928 11:43:51.989719   629 acceptor_pool.cc:254] collecting diagnostics on the listening RPC socket unix:/tmp/dist-test-taskA7Yeqp/test-tmp/rpc-test-f0a06db5781543d1943e13bb1b65538a.sock every 8 connection(s)
I20260928 11:43:51.990572   630 acceptor_pool.cc:254] collecting diagnostics on the listening RPC socket unix:/tmp/dist-test-taskA7Yeqp/test-tmp/rpc-test-f0a06db5781543d1943e13bb1b65538a.sock every 8 connection(s)
I20260928 11:43:51.993669   390 rpc-test.cc:772] Connecting to unix:/tmp/dist-test-taskA7Yeqp/test-tmp/rpc-test-f0a06db5781543d1943e13bb1b65538a.sock
W20260928 11:43:52.061280   628 connection.cc:196] Error closing socket: Network error: TlsSocket::Close: Broken pipe
[       OK ] Parameters/TestRpc.TestConnectionNetworkPlane/SSL_UnixSocket (118 ms)
[ RUN      ] Parameters/TestRpc.TestTCPKeepalive/SSL_UnixSocket
I20260928 11:43:52.084213   654 acceptor_pool.cc:254] collecting diagnostics on the listening RPC socket unix:/tmp/dist-test-taskA7Yeqp/test-tmp/rpc-test-150ae78d8fdc4b70b72a0510bd19ca96.sock every 8 connection(s)
I20260928 11:43:52.084977   655 acceptor_pool.cc:254] collecting diagnostics on the listening RPC socket unix:/tmp/dist-test-taskA7Yeqp/test-tmp/rpc-test-150ae78d8fdc4b70b72a0510bd19ca96.sock every 8 connection(s)
I20260928 11:43:52.122043   658 rpc-test-base.h:222] got call: sleep_micros: 8000000 deferred: true
I20260928 11:44:00.126147   658 rpcz_store.cc:275] Call kudu.rpc.GenericCalculatorService.Sleep from unix:<unnamed> (request call id 0) took 8004 ms. Trace:
I20260928 11:44:00.126613   658 rpcz_store.cc:276] 0928 11:43:52.121857 (+     0us) service_pool.cc:170] Inserting onto call queue
0928 11:43:52.121978 (+   121us) service_pool.cc:227] Handling call
0928 11:44:00.125965 (+8003987us) inbound_call.cc:173] Queueing success response
Metrics: {}
W20260928 11:44:00.132829   651 connection.cc:196] Error closing socket: Network error: TlsSocket::Close: Broken pipe
[       OK ] Parameters/TestRpc.TestTCPKeepalive/SSL_UnixSocket (8073 ms)
[ RUN      ] Parameters/TestRpc.TestMaxSmallSidecars/SSL_UnixSocket
I20260928 11:44:00.177846   680 acceptor_pool.cc:254] collecting diagnostics on the listening RPC socket unix:/tmp/dist-test-taskA7Yeqp/test-tmp/rpc-test-27fb3ab7cd144f36aeb0e0c22fcd4bcc.sock every 8 connection(s)
I20260928 11:44:00.178902   681 acceptor_pool.cc:254] collecting diagnostics on the listening RPC socket unix:/tmp/dist-test-taskA7Yeqp/test-tmp/rpc-test-27fb3ab7cd144f36aeb0e0c22fcd4bcc.sock every 8 connection(s)
W20260928 11:44:00.362759   677 connection.cc:196] Error closing socket: Network error: TlsSocket::Close: Broken pipe
[       OK ] Parameters/TestRpc.TestMaxSmallSidecars/SSL_UnixSocket (227 ms)
[ RUN      ] Parameters/TestRpc.TestCallTimeout/SSL_UnixSocket
I20260928 11:44:00.385186   705 acceptor_pool.cc:254] collecting diagnostics on the listening RPC socket unix:/tmp/dist-test-taskA7Yeqp/test-tmp/rpc-test-07ff771ad27e42baa082dfad5b3ab47c.sock every 8 connection(s)
I20260928 11:44:00.385906   706 acceptor_pool.cc:254] collecting diagnostics on the listening RPC socket unix:/tmp/dist-test-taskA7Yeqp/test-tmp/rpc-test-07ff771ad27e42baa082dfad5b3ab47c.sock every 8 connection(s)
I20260928 11:44:00.416533   390 rpc-test-base.h:595] status: Timed out: connection negotiation to unix:/tmp/dist-test-taskA7Yeqp/test-tmp/rpc-test-07ff771ad27e42baa082dfad5b3ab47c.sock for RPC Sleep timed out after 0.000s (ON_OUTBOUND_QUEUE), seconds elapsed: 0.00309663
I20260928 11:44:00.424059   709 rpc-test-base.h:222] got call: sleep_micros: 700000
I20260928 11:44:00.617931   390 rpc-test-base.h:595] status: Timed out: Sleep RPC to unix:/tmp/dist-test-taskA7Yeqp/test-tmp/rpc-test-07ff771ad27e42baa082dfad5b3ab47c.sock timed out after 0.200s (SENT), seconds elapsed: 0.200977
I20260928 11:44:00.619424   708 rpc-test-base.h:222] got call: sleep_micros: 2000000
W20260928 11:44:01.124791   709 rpcz_store.cc:267] Call kudu.rpc.GenericCalculatorService.Sleep from unix:<unnamed> (request call id 1) took 700 ms (client timeout 200 ms). Trace:
W20260928 11:44:01.125164   709 rpcz_store.cc:269] 0928 11:44:00.423908 (+     0us) service_pool.cc:170] Inserting onto call queue
0928 11:44:00.424014 (+   106us) service_pool.cc:227] Handling call
0928 11:44:01.124710 (+700696us) inbound_call.cc:173] Queueing success response
Metrics: {}
I20260928 11:44:02.120884   390 rpc-test-base.h:595] status: Timed out: Sleep RPC to unix:/tmp/dist-test-taskA7Yeqp/test-tmp/rpc-test-07ff771ad27e42baa082dfad5b3ab47c.sock timed out after 1.500s (SENT), seconds elapsed: 1.50263
W20260928 11:44:02.619995   708 rpcz_store.cc:267] Call kudu.rpc.GenericCalculatorService.Sleep from unix:<unnamed> (request call id 2) took 2000 ms (client timeout 1500 ms). Trace:
W20260928 11:44:02.620411   708 rpcz_store.cc:269] 0928 11:44:00.619210 (+     0us) service_pool.cc:170] Inserting onto call queue
0928 11:44:00.619364 (+   154us) service_pool.cc:227] Handling call
0928 11:44:02.619944 (+2000580us) inbound_call.cc:173] Queueing success response
Metrics: {}
W20260928 11:44:02.620996   702 connection.cc:441] server connection from unix:<unnamed> torn down before Call kudu.rpc.GenericCalculatorService.Sleep from unix:<unnamed> (request call id 2) could send its response
[       OK ] Parameters/TestRpc.TestCallTimeout/SSL_UnixSocket (2258 ms)
[ RUN      ] Parameters/TestRpc.TestServerShutsDown/SSL_UnixSocket
I20260928 11:44:02.628271   390 rpc-test.cc:1125] Connecting to 0.0.0.0:34145
W20260928 11:44:02.638056   722 negotiation.cc:337] Failed RPC negotiation. Trace:
0928 11:44:02.636507 (+     0us) reactor.cc:625] Submitting negotiation task for client connection to 0.0.0.0:34145 (local address 127.0.0.1:56592)
0928 11:44:02.636992 (+   485us) negotiation.cc:107] Waiting for socket to connect
0928 11:44:02.637026 (+    34us) client_negotiation.cc:174] Beginning negotiation
0928 11:44:02.637314 (+   288us) client_negotiation.cc:252] Sending NEGOTIATE NegotiatePB request
0928 11:44:02.637539 (+   225us) negotiation.cc:327] Negotiation complete: Network error: Client connection negotiation failed: client connection to 0.0.0.0:34145: BlockingWrite error: write error: Broken pipe (error 32)
Metrics: {"client-negotiator.queue_time_us":128}
[       OK ] Parameters/TestRpc.TestServerShutsDown/SSL_UnixSocket (14 ms)
[ RUN      ] Parameters/TestRpc.TimedOutOnResponseMetric/SSL_UnixSocket
I20260928 11:44:02.658977   739 acceptor_pool.cc:254] collecting diagnostics on the listening RPC socket unix:/tmp/dist-test-taskA7Yeqp/test-tmp/rpc-test-243d9547474d4403b50e67cb8ce7ec30.sock every 8 connection(s)
I20260928 11:44:02.659727   740 acceptor_pool.cc:254] collecting diagnostics on the listening RPC socket unix:/tmp/dist-test-taskA7Yeqp/test-tmp/rpc-test-243d9547474d4403b50e67cb8ce7ec30.sock every 8 connection(s)
W20260928 11:44:02.893309   743 rpcz_store.cc:267] Call kudu.rpc_test.CalculatorService.Sleep from unix:<unnamed> (request call id 3) took 50 ms (client timeout 25 ms). Trace:
W20260928 11:44:02.893620   743 rpcz_store.cc:269] 0928 11:44:02.842692 (+     0us) service_pool.cc:170] Inserting onto call queue
0928 11:44:02.842832 (+   140us) service_pool.cc:227] Handling call
0928 11:44:02.893235 (+ 50403us) inbound_call.cc:173] Queueing success response
Related trace 'test_child':
Metrics: {"test_sleep_us":50000,"child_traces":[["test_child",{"related_trace_metric":1}]]}
W20260928 11:44:02.953130   743 rpcz_store.cc:267] Call kudu.rpc_test.CalculatorService.Sleep from unix:<unnamed> (request call id 4) took 50 ms (client timeout 50 ms). Trace:
W20260928 11:44:02.953400   743 rpcz_store.cc:269] 0928 11:44:02.902398 (+     0us) service_pool.cc:170] Inserting onto call queue
0928 11:44:02.902539 (+   141us) service_pool.cc:227] Handling call
0928 11:44:02.953074 (+ 50535us) inbound_call.cc:173] Queueing success response
Related trace 'test_child':
Metrics: {"test_sleep_us":50000,"child_traces":[["test_child",{"related_trace_metric":1}]]}
W20260928 11:44:02.957197   736 connection.cc:196] Error closing socket: Network error: TlsSocket::Close: Broken pipe
[       OK ] Parameters/TestRpc.TimedOutOnResponseMetric/SSL_UnixSocket (320 ms)
[ RUN      ] Parameters/TestRpc.AcceptorDispatchingTimesMetric/SSL_UnixSocket
I20260928 11:44:02.973994   764 acceptor_pool.cc:254] collecting diagnostics on the listening RPC socket 0.0.0.0:41297 every 8 connection(s)
I20260928 11:44:02.974713   765 acceptor_pool.cc:254] collecting diagnostics on the listening RPC socket 0.0.0.0:41297 every 8 connection(s)
W20260928 11:44:02.980551   760 negotiation.cc:337] Failed RPC negotiation. Trace:
0928 11:44:02.978628 (+     0us) reactor.cc:625] Submitting negotiation task for server connection from 127.0.0.1:57792 (local address 127.0.0.1:41297)
0928 11:44:02.979026 (+   398us) server_negotiation.cc:206] Beginning negotiation
0928 11:44:02.979044 (+    18us) server_negotiation.cc:399] Waiting for connection header
0928 11:44:02.979550 (+   506us) negotiation.cc:327] Negotiation complete: Network error: Server connection negotiation failed: server connection from 127.0.0.1:57792: BlockingRecv error: recv got EOF from 127.0.0.1:57792 (error 108)
Metrics: {"server-negotiator.queue_time_us":111}
[       OK ] Parameters/TestRpc.AcceptorDispatchingTimesMetric/SSL_UnixSocket (23 ms)
[ RUN      ] Parameters/TestRpc.TestRpcCallbackDestroysMessenger/SSL_UnixSocket
[       OK ] Parameters/TestRpc.TestRpcCallbackDestroysMessenger/SSL_UnixSocket (19 ms)
[ RUN      ] Parameters/TestRpc.TestApplicationFeatureFlag/SSL_UnixSocket
I20260928 11:44:03.047991   789 acceptor_pool.cc:254] collecting diagnostics on the listening RPC socket unix:/tmp/dist-test-taskA7Yeqp/test-tmp/rpc-test-c1e53677942d4027ae7191d025c647a2.sock every 8 connection(s)
I20260928 11:44:03.048697   790 acceptor_pool.cc:254] collecting diagnostics on the listening RPC socket unix:/tmp/dist-test-taskA7Yeqp/test-tmp/rpc-test-c1e53677942d4027ae7191d025c647a2.sock every 8 connection(s)
W20260928 11:44:03.093555   786 messenger.cc:357] Unable to handle RPC call: Not implemented: call requires unsupported application feature flags: 99
W20260928 11:44:03.096481   786 connection.cc:196] Error closing socket: Network error: TlsSocket::Close: Broken pipe
[       OK ] Parameters/TestRpc.TestApplicationFeatureFlag/SSL_UnixSocket (97 ms)
[ RUN      ] Parameters/TestRpc.TestCancellation/SSL_UnixSocket
I20260928 11:44:03.128719   814 acceptor_pool.cc:254] collecting diagnostics on the listening RPC socket unix:/tmp/dist-test-taskA7Yeqp/test-tmp/rpc-test-eb33b6c9a12c4b7aa5de242be3eba6ed.sock every 8 connection(s)
I20260928 11:44:03.129410   815 acceptor_pool.cc:254] collecting diagnostics on the listening RPC socket unix:/tmp/dist-test-taskA7Yeqp/test-tmp/rpc-test-eb33b6c9a12c4b7aa5de242be3eba6ed.sock every 8 connection(s)
I20260928 11:44:03.132606   390 rpc-test.cc:1648] Connecting to unix:/tmp/dist-test-taskA7Yeqp/test-tmp/rpc-test-eb33b6c9a12c4b7aa5de242be3eba6ed.sock
I20260928 11:44:03.242681   390 rpc-test-base.h:595] status: Aborted: Sleep RPC to unix:/tmp/dist-test-taskA7Yeqp/test-tmp/rpc-test-eb33b6c9a12c4b7aa5de242be3eba6ed.sock is cancelled in state READY, seconds elapsed: 0.00044173
I20260928 11:44:03.436833   390 rpc-test-base.h:595] status: Aborted: Sleep RPC to unix:/tmp/dist-test-taskA7Yeqp/test-tmp/rpc-test-eb33b6c9a12c4b7aa5de242be3eba6ed.sock is cancelled in state SENT, seconds elapsed: 0.000964449
I20260928 11:44:03.437024   817 rpc-test-base.h:222] got call: sleep_micros: 510000
I20260928 11:44:03.619791   390 rpc-test-base.h:595] status: Aborted: Sleep RPC to unix:/tmp/dist-test-taskA7Yeqp/test-tmp/rpc-test-eb33b6c9a12c4b7aa5de242be3eba6ed.sock is cancelled in state SENT, seconds elapsed: 0.00104643
I20260928 11:44:03.620069   816 rpc-test-base.h:222] got call: sleep_micros: 510000
I20260928 11:44:03.793128   390 rpc-test-base.h:595] status: Aborted: Sleep RPC to unix:/tmp/dist-test-taskA7Yeqp/test-tmp/rpc-test-eb33b6c9a12c4b7aa5de242be3eba6ed.sock is cancelled in state SENT, seconds elapsed: 0.000828794
W20260928 11:44:03.803901   818 rpcz_store.cc:267] Call kudu.rpc.GenericCalculatorService.Sleep from unix:<unnamed> (request call id 11) took 10 ms (client timeout 10 ms). Trace:
W20260928 11:44:03.804260   818 rpcz_store.cc:269] 0928 11:44:03.793225 (+     0us) service_pool.cc:170] Inserting onto call queue
0928 11:44:03.803610 (+ 10385us) service_pool.cc:214] Skipping call since client already timed out
0928 11:44:03.803728 (+   118us) inbound_call.cc:173] Queueing failure response
Metrics: {}
I20260928 11:44:03.804811   818 rpc-test-base.h:222] got call: sleep_micros: 1500000
W20260928 11:44:03.947705   817 rpcz_store.cc:267] Call kudu.rpc.GenericCalculatorService.Sleep from unix:<unnamed> (request call id 3) took 510 ms (client timeout 10 ms). Trace:
W20260928 11:44:03.948011   817 rpcz_store.cc:269] 0928 11:44:03.436853 (+     0us) service_pool.cc:170] Inserting onto call queue
0928 11:44:03.436978 (+   125us) service_pool.cc:227] Handling call
0928 11:44:03.947651 (+510673us) inbound_call.cc:173] Queueing success response
Metrics: {}
W20260928 11:44:04.130684   816 rpcz_store.cc:267] Call kudu.rpc.GenericCalculatorService.Sleep from unix:<unnamed> (request call id 7) took 510 ms (client timeout 10 ms). Trace:
W20260928 11:44:04.131014   816 rpcz_store.cc:269] 0928 11:44:03.619859 (+     0us) service_pool.cc:170] Inserting onto call queue
0928 11:44:03.620011 (+   152us) service_pool.cc:227] Handling call
0928 11:44:04.130620 (+510609us) inbound_call.cc:173] Queueing success response
Metrics: {}
I20260928 11:44:04.795310   390 rpc-test-base.h:595] status: Timed out: Sleep RPC to unix:/tmp/dist-test-taskA7Yeqp/test-tmp/rpc-test-eb33b6c9a12c4b7aa5de242be3eba6ed.sock timed out after 1.000s (SENT), seconds elapsed: 1.00171
I20260928 11:44:04.797467   816 rpc-test-base.h:222] got call: sleep_micros: 1500000
W20260928 11:44:05.305445   818 rpcz_store.cc:267] Call kudu.rpc.GenericCalculatorService.Sleep from unix:<unnamed> (request call id 12) took 1511 ms (client timeout 1000 ms). Trace:
W20260928 11:44:05.305776   818 rpcz_store.cc:269] 0928 11:44:03.794171 (+     0us) service_pool.cc:170] Inserting onto call queue
0928 11:44:03.804781 (+ 10610us) service_pool.cc:227] Handling call
0928 11:44:05.305312 (+1500531us) inbound_call.cc:173] Queueing success response
Metrics: {}
I20260928 11:44:05.797935   390 rpc-test-base.h:595] status: Timed out: Sleep RPC to unix:/tmp/dist-test-taskA7Yeqp/test-tmp/rpc-test-eb33b6c9a12c4b7aa5de242be3eba6ed.sock timed out after 1.000s (SENT), seconds elapsed: 1.00199
W20260928 11:44:05.799515   811 messenger.cc:357] Unable to handle RPC call: Not implemented: call requires unsupported application feature flags: 99, 1
W20260928 11:44:05.800920   811 messenger.cc:357] Unable to handle RPC call: Not implemented: call requires unsupported application feature flags: 99, 1
W20260928 11:44:06.298162   816 rpcz_store.cc:267] Call kudu.rpc.GenericCalculatorService.Sleep from unix:<unnamed> (request call id 13) took 1501 ms (client timeout 1000 ms). Trace:
W20260928 11:44:06.298799   816 rpcz_store.cc:269] 0928 11:44:04.797086 (+     0us) service_pool.cc:170] Inserting onto call queue
0928 11:44:04.797299 (+   213us) service_pool.cc:227] Handling call
0928 11:44:06.298102 (+1500803us) inbound_call.cc:173] Queueing success response
Metrics: {}
W20260928 11:44:06.299561   811 connection.cc:441] server connection from unix:<unnamed> torn down before Call kudu.rpc.GenericCalculatorService.Sleep from unix:<unnamed> (request call id 13) could send its response
[       OK ] Parameters/TestRpc.TestCancellation/SSL_UnixSocket (3205 ms)
[ RUN      ] Parameters/TestRpc.TestCancellationMultiThreads/SSL_UnixSocket
I20260928 11:44:06.340008   840 acceptor_pool.cc:254] collecting diagnostics on the listening RPC socket unix:/tmp/dist-test-taskA7Yeqp/test-tmp/rpc-test-11f0f8e60f504b0c95626bbc107fd869.sock every 8 connection(s)
I20260928 11:44:06.340833   841 acceptor_pool.cc:254] collecting diagnostics on the listening RPC socket unix:/tmp/dist-test-taskA7Yeqp/test-tmp/rpc-test-11f0f8e60f504b0c95626bbc107fd869.sock every 8 connection(s)
I20260928 11:44:06.344178   390 rpc-test.cc:1808] Connecting to unix:/tmp/dist-test-taskA7Yeqp/test-tmp/rpc-test-11f0f8e60f504b0c95626bbc107fd869.sock
I20260928 11:44:06.502684   854 test_util.cc:268] Using random seed: -1789003595
I20260928 11:44:06.503857   855 test_util.cc:268] Using random seed: -1789002344
I20260928 11:44:06.505679   856 test_util.cc:268] Using random seed: -1789000524
I20260928 11:44:06.507053   857 test_util.cc:268] Using random seed: -1788999277
I20260928 11:44:06.508697   858 test_util.cc:268] Using random seed: -1788997627
I20260928 11:44:06.510339   859 test_util.cc:268] Using random seed: -1788996008
I20260928 11:44:06.512372   860 test_util.cc:268] Using random seed: -1788993960
I20260928 11:44:06.514192   861 test_util.cc:268] Using random seed: -1788992089
I20260928 11:44:06.515446   862 test_util.cc:268] Using random seed: -1788990904
I20260928 11:44:06.517226   863 test_util.cc:268] Using random seed: -1788989093
I20260928 11:44:06.519208   864 test_util.cc:268] Using random seed: -1788987118
I20260928 11:44:06.521494   865 test_util.cc:268] Using random seed: -1788984877
I20260928 11:44:06.532099   866 test_util.cc:268] Using random seed: -1788974251
I20260928 11:44:06.534660   867 test_util.cc:268] Using random seed: -1788971690
I20260928 11:44:06.538767   868 test_util.cc:268] Using random seed: -1788967582
I20260928 11:44:06.540890   869 test_util.cc:268] Using random seed: -1788965520
I20260928 11:44:06.543041   870 test_util.cc:268] Using random seed: -1788963286
I20260928 11:44:06.545214   871 test_util.cc:268] Using random seed: -1788961540
I20260928 11:44:06.546779   872 test_util.cc:268] Using random seed: -1788959562
I20260928 11:44:06.548872   873 test_util.cc:268] Using random seed: -1788957448
I20260928 11:44:06.553481   874 test_util.cc:268] Using random seed: -1788952930
I20260928 11:44:06.555814   875 test_util.cc:268] Using random seed: -1788950563
I20260928 11:44:06.558261   876 test_util.cc:268] Using random seed: -1788948067
I20260928 11:44:06.560390   877 test_util.cc:268] Using random seed: -1788946026
I20260928 11:44:06.563019   878 test_util.cc:268] Using random seed: -1788943401
I20260928 11:44:06.565495   879 test_util.cc:268] Using random seed: -1788940973
I20260928 11:44:06.568219   880 test_util.cc:268] Using random seed: -1788938123
I20260928 11:44:06.570593   881 test_util.cc:268] Using random seed: -1788935820
I20260928 11:44:06.573035   882 test_util.cc:268] Using random seed: -1788933821
I20260928 11:44:06.575048   883 test_util.cc:268] Using random seed: -1788931359
W20260928 11:44:26.758121   837 connection.cc:196] Error closing socket: Network error: TlsSocket::Close: Broken pipe
[       OK ] Parameters/TestRpc.TestCancellationMultiThreads/SSL_UnixSocket (20468 ms)
[ RUN      ] Parameters/TestRpc.TestCallId/SSL_UnixSocket
I20260928 11:44:26.810264   897 acceptor_pool.cc:254] collecting diagnostics on the listening RPC socket unix:/tmp/dist-test-taskA7Yeqp/test-tmp/rpc-test-f140fb0857144b5da616d3741ec61dee.sock every 8 connection(s)
I20260928 11:44:26.811400   898 acceptor_pool.cc:254] collecting diagnostics on the listening RPC socket unix:/tmp/dist-test-taskA7Yeqp/test-tmp/rpc-test-f140fb0857144b5da616d3741ec61dee.sock every 8 connection(s)
[       OK ] Parameters/TestRpc.TestCallId/SSL_UnixSocket (117 ms)
[----------] 20 tests from Parameters/TestRpc (39145 ms total)

[----------] Global test environment tear-down
[==========] 21 tests from 2 test suites ran. (42294 ms total)
[  PASSED  ] 20 tests.
[  FAILED  ] 1 test, listed below:
[  FAILED  ] Parameters/TestRpc.TestCallWithChainCertAndRootCA/SSL_UnixSocket, where GetParam() = (true, true)

 1 FAILED TEST
I20260928 11:44:26.912418   390 logging.cc:424] LogThrottler /data0/somelongdirectorytoavoidrpathissues/src/kudu/src/kudu/rpc/acceptor_pool.cc:285: suppressed but not reported on 3 messages since previous log ~35 seconds ago