Diagnosed failure

Parameters/TestRpc.TestCallWithChainCertAndChainCA/SSL_UnixSocket: /data0/somelongdirectorytoavoidrpathissues/src/kudu/src/kudu/rpc/rpc-test.cc:270: Failure
Failed
Bad status: Runtime error: could not verify certificate chain (error with cert: subject=CN = localhost, ST = sadfjas, C = AS, emailAddress = sdflkdsajf, O = lskdfjlsad, OU = sldfkja, issuer=C = AS, ST = ASDfkjdhf, L = lskdjf, O = saldfja, OU = skdjf, CN = localhost, emailAddress = sadjflkadsj): : certificate has expired
Google Test trace:
/data0/somelongdirectorytoavoidrpathissues/src/kudu/src/kudu/rpc/rpc-test.cc:267: Connecting to unix:/tmp/dist-test-taskmWfMUL/test-tmp/rpc-test-fe6ba8fd84184cddbcbbe98b2248df82.sock
I20260926 13:40:50.285786   383 test_util.cc:175] -----------------------------------------------
I20260926 13:40:50.285845   383 test_util.cc:176] Had fatal failures, leaving test files at /tmp/dist-test-taskmWfMUL/test-tmp/rpc-test.6.Parameters_TestRpc.TestCallWithChainCertAndChainCA_SSL_UnixSocket.1790430050208990-383-0

Full log

Note: This is test shard 7 of 8.
[==========] Running 21 tests from 2 test suites.
[----------] Global test environment set-up.
[----------] 20 tests from Parameters/TestRpc
[ RUN      ] Parameters/TestRpc.TestMessengerCreateDestroy/SSL_UnixSocket
WARNING: Logging before InitGoogleLogging() is written to STDERR
I20260926 13:40:50.234724   383 rpc-test.cc:169] started messenger TestCreateDestroy
[       OK ] Parameters/TestRpc.TestMessengerCreateDestroy/SSL_UnixSocket (20 ms)
[ RUN      ] Parameters/TestRpc.TestNegotiationDeadlock/SSL_UnixSocket
I20260926 13:40:50.242854   404 acceptor_pool.cc:254] collecting diagnostics on the listening RPC socket unix:/tmp/dist-test-taskmWfMUL/test-tmp/rpc-test-ec82dbce4b874b75b31d4bbb78b15666.sock every 8 connection(s)
I20260926 13:40:50.242769   403 acceptor_pool.cc:254] collecting diagnostics on the listening RPC socket unix:/tmp/dist-test-taskmWfMUL/test-tmp/rpc-test-ec82dbce4b874b75b31d4bbb78b15666.sock every 8 connection(s)
[       OK ] Parameters/TestRpc.TestNegotiationDeadlock/SSL_UnixSocket (16 ms)
[ RUN      ] Parameters/TestRpc.TestCallWithChainCertAndChainCA/SSL_UnixSocket
I20260926 13:40:50.280673   420 acceptor_pool.cc:254] collecting diagnostics on the listening RPC socket unix:/tmp/dist-test-taskmWfMUL/test-tmp/rpc-test-fe6ba8fd84184cddbcbbe98b2248df82.sock every 8 connection(s)
I20260926 13:40:50.280644   419 acceptor_pool.cc:254] collecting diagnostics on the listening RPC socket unix:/tmp/dist-test-taskmWfMUL/test-tmp/rpc-test-fe6ba8fd84184cddbcbbe98b2248df82.sock every 8 connection(s)
/data0/somelongdirectorytoavoidrpathissues/src/kudu/src/kudu/rpc/rpc-test.cc:270: Failure
Failed
Bad status: Runtime error: could not verify certificate chain (error with cert: subject=CN = localhost, ST = sadfjas, C = AS, emailAddress = sdflkdsajf, O = lskdfjlsad, OU = sldfkja, issuer=C = AS, ST = ASDfkjdhf, L = lskdjf, O = saldfja, OU = skdjf, CN = localhost, emailAddress = sadjflkadsj): : certificate has expired
Google Test trace:
/data0/somelongdirectorytoavoidrpathissues/src/kudu/src/kudu/rpc/rpc-test.cc:267: Connecting to unix:/tmp/dist-test-taskmWfMUL/test-tmp/rpc-test-fe6ba8fd84184cddbcbbe98b2248df82.sock
I20260926 13:40:50.285786   383 test_util.cc:175] -----------------------------------------------
I20260926 13:40:50.285845   383 test_util.cc:176] Had fatal failures, leaving test files at /tmp/dist-test-taskmWfMUL/test-tmp/rpc-test.6.Parameters_TestRpc.TestCallWithChainCertAndChainCA_SSL_UnixSocket.1790430050208990-383-0
[  FAILED  ] Parameters/TestRpc.TestCallWithChainCertAndChainCA/SSL_UnixSocket, where GetParam() = (true, true) (32 ms)
[ RUN      ] Parameters/TestRpc.TestCallWithPasswordProtectedKey/SSL_UnixSocket
I20260926 13:40:50.292708   444 acceptor_pool.cc:254] collecting diagnostics on the listening RPC socket unix:/tmp/dist-test-taskmWfMUL/test-tmp/rpc-test-e85cd4af1d8845bba6392610f50c9ba8.sock every 8 connection(s)
I20260926 13:40:50.292745   445 acceptor_pool.cc:254] collecting diagnostics on the listening RPC socket unix:/tmp/dist-test-taskmWfMUL/test-tmp/rpc-test-e85cd4af1d8845bba6392610f50c9ba8.sock every 8 connection(s)
W20260926 13:40:50.306859   441 connection.cc:196] Error closing socket: Network error: TlsSocket::Close: Broken pipe
[       OK ] Parameters/TestRpc.TestCallWithPasswordProtectedKey/SSL_UnixSocket (22 ms)
[ RUN      ] Parameters/TestRpc.TestCallToBadServer/SSL_UnixSocket
I20260926 13:40:50.335842   383 rpc-test.cc:394] Status: Network error: Client connection negotiation failed: client connection to 0.0.0.0:0: connect: Connection refused (error 111)
I20260926 13:40:50.336344   383 rpc-test.cc:394] Status: Network error: Client connection negotiation failed: client connection to 0.0.0.0:0: connect: Connection refused (error 111)
I20260926 13:40:50.336796   383 rpc-test.cc:394] Status: Network error: Client connection negotiation failed: client connection to 0.0.0.0:0: connect: Connection refused (error 111)
I20260926 13:40:50.337306   383 rpc-test.cc:394] Status: Network error: Client connection negotiation failed: client connection to 0.0.0.0:0: connect: Connection refused (error 111)
I20260926 13:40:50.337746   383 rpc-test.cc:394] Status: Network error: Client connection negotiation failed: client connection to 0.0.0.0:0: connect: Connection refused (error 111)
[       OK ] Parameters/TestRpc.TestCallToBadServer/SSL_UnixSocket (29 ms)
[ RUN      ] Parameters/TestRpc.TestWrongService/SSL_UnixSocket
I20260926 13:40:50.359905   479 acceptor_pool.cc:254] collecting diagnostics on the listening RPC socket unix:/tmp/dist-test-taskmWfMUL/test-tmp/rpc-test-b589d91b134b45e4bba4cde778a28fb1.sock every 8 connection(s)
I20260926 13:40:50.359994   480 acceptor_pool.cc:254] collecting diagnostics on the listening RPC socket unix:/tmp/dist-test-taskmWfMUL/test-tmp/rpc-test-b589d91b134b45e4bba4cde778a28fb1.sock every 8 connection(s)
I20260926 13:40:50.375113   476 messenger.cc:345] service WrongServiceName not registered on TestServer
W20260926 13:40:50.375921   476 connection.cc:196] Error closing socket: Network error: TlsSocket::Close: Broken pipe
[       OK ] Parameters/TestRpc.TestWrongService/SSL_UnixSocket (39 ms)
[ RUN      ] Parameters/TestRpc.TestConnectionKeepalive/SSL_UnixSocket
I20260926 13:40:50.387502   502 acceptor_pool.cc:254] collecting diagnostics on the listening RPC socket unix:/tmp/dist-test-taskmWfMUL/test-tmp/rpc-test-9952c4b011ec4377a403bc82c1b93f0d.sock every 8 connection(s)
I20260926 13:40:50.387547   503 acceptor_pool.cc:254] collecting diagnostics on the listening RPC socket unix:/tmp/dist-test-taskmWfMUL/test-tmp/rpc-test-9952c4b011ec4377a403bc82c1b93f0d.sock every 8 connection(s)
I20260926 13:40:50.387845   383 rpc-test.cc:488] Connecting to unix:/tmp/dist-test-taskmWfMUL/test-tmp/rpc-test-9952c4b011ec4377a403bc82c1b93f0d.sock
W20260926 13:40:50.879565   515 connection.cc:196] Error closing socket: Network error: TlsSocket::Close: Broken pipe
[       OK ] Parameters/TestRpc.TestConnectionKeepalive/SSL_UnixSocket (1035 ms)
[ RUN      ] Parameters/TestRpc.TestClientConnectionMetrics/SSL_UnixSocket
I20260926 13:40:51.432663   527 acceptor_pool.cc:254] collecting diagnostics on the listening RPC socket unix:/tmp/dist-test-taskmWfMUL/test-tmp/rpc-test-7c7eef01982b47d6a6bf81493ed67b4e.sock every 8 connection(s)
I20260926 13:40:51.432705   528 acceptor_pool.cc:254] collecting diagnostics on the listening RPC socket unix:/tmp/dist-test-taskmWfMUL/test-tmp/rpc-test-7c7eef01982b47d6a6bf81493ed67b4e.sock every 8 connection(s)
I20260926 13:40:51.432996   383 rpc-test.cc:569] Connecting to unix:/tmp/dist-test-taskmWfMUL/test-tmp/rpc-test-7c7eef01982b47d6a6bf81493ed67b4e.sock
W20260926 13:41:02.039960   524 connection.cc:196] Error closing socket: Network error: TlsSocket::Close: Broken pipe
[       OK ] Parameters/TestRpc.TestClientConnectionMetrics/SSL_UnixSocket (10627 ms)
[ RUN      ] Parameters/TestRpc.TestCredentialsPolicy/SSL_UnixSocket
I20260926 13:41:02.053545   550 acceptor_pool.cc:254] collecting diagnostics on the listening RPC socket unix:/tmp/dist-test-taskmWfMUL/test-tmp/rpc-test-89f6b48f0fe448ef86579dae2353fc20.sock every 8 connection(s)
I20260926 13:41:02.053622   551 acceptor_pool.cc:254] collecting diagnostics on the listening RPC socket unix:/tmp/dist-test-taskmWfMUL/test-tmp/rpc-test-89f6b48f0fe448ef86579dae2353fc20.sock every 8 connection(s)
I20260926 13:41:02.054003   383 rpc-test.cc:700] Connecting to unix:/tmp/dist-test-taskmWfMUL/test-tmp/rpc-test-89f6b48f0fe448ef86579dae2353fc20.sock
W20260926 13:41:02.087198   549 connection.cc:196] Error closing socket: Network error: TlsSocket::Close: Broken pipe
W20260926 13:41:02.091763   549 connection.cc:196] Error closing socket: Network error: TlsSocket::Close: Broken pipe
[       OK ] Parameters/TestRpc.TestCredentialsPolicy/SSL_UnixSocket (51 ms)
[ RUN      ] Parameters/TestRpc.TestCallLongerThanKeepalive/SSL_UnixSocket
I20260926 13:41:02.126559   575 acceptor_pool.cc:254] collecting diagnostics on the listening RPC socket unix:/tmp/dist-test-taskmWfMUL/test-tmp/rpc-test-5551c41df28d4804ab58953de0b30688.sock every 8 connection(s)
I20260926 13:41:02.126582   576 acceptor_pool.cc:254] collecting diagnostics on the listening RPC socket unix:/tmp/dist-test-taskmWfMUL/test-tmp/rpc-test-5551c41df28d4804ab58953de0b30688.sock every 8 connection(s)
I20260926 13:41:02.156498   579 rpc-test-base.h:222] got call: sleep_micros: 3000000 deferred: true
I20260926 13:41:05.157459   579 rpcz_store.cc:275] Call kudu.rpc.GenericCalculatorService.Sleep from unix:<unnamed> (request call id 0) took 3001 ms. Trace:
I20260926 13:41:05.157609   579 rpcz_store.cc:276] 0926 13:41:02.156407 (+     0us) service_pool.cc:170] Inserting onto call queue
0926 13:41:02.156470 (+    63us) service_pool.cc:227] Handling call
0926 13:41:05.157440 (+3000970us) inbound_call.cc:173] Queueing success response
Metrics: {}
W20260926 13:41:05.159266   572 connection.cc:196] Error closing socket: Network error: TlsSocket::Close: Broken pipe
[       OK ] Parameters/TestRpc.TestCallLongerThanKeepalive/SSL_UnixSocket (3067 ms)
[ RUN      ] Parameters/TestRpc.TestRpcSidecar/SSL_UnixSocket
I20260926 13:41:05.188918   600 acceptor_pool.cc:254] collecting diagnostics on the listening RPC socket unix:/tmp/dist-test-taskmWfMUL/test-tmp/rpc-test-211668bd965e4b30927a8474b058c1ed.sock every 8 connection(s)
I20260926 13:41:05.188959   601 acceptor_pool.cc:254] collecting diagnostics on the listening RPC socket unix:/tmp/dist-test-taskmWfMUL/test-tmp/rpc-test-211668bd965e4b30927a8474b058c1ed.sock every 8 connection(s)
W20260926 13:41:05.256261   597 connection.cc:196] Error closing socket: Network error: TlsSocket::Close: Broken pipe
[       OK ] Parameters/TestRpc.TestRpcSidecar/SSL_UnixSocket (96 ms)
[ RUN      ] Parameters/TestRpc.TestRpcSidecarLimits/SSL_UnixSocket
I20260926 13:41:07.019201   625 acceptor_pool.cc:254] collecting diagnostics on the listening RPC socket unix:/tmp/dist-test-taskmWfMUL/test-tmp/rpc-test-593a1d93083a49a291d7922ef0622848.sock every 8 connection(s)
I20260926 13:41:07.019168   626 acceptor_pool.cc:254] collecting diagnostics on the listening RPC socket unix:/tmp/dist-test-taskmWfMUL/test-tmp/rpc-test-593a1d93083a49a291d7922ef0622848.sock every 8 connection(s)
W20260926 13:41:07.063814   383 serialization.cc:72] Serialized kudu.rpc_test.PushStringsRequestPB (2147483654 bytes) is larger than the maximum configured RPC message size (52428800 bytes). Sending anyway, but peer may reject the data.
W20260926 13:41:07.067476   622 connection.cc:535] server connection from unix:<unnamed> recv error: Network error: RPC frame had a length of 2147483714, but we only support messages up to 52428800 bytes long.
W20260926 13:41:07.067533   622 connection.cc:158] shutting down server connection from unix:<unnamed> with pending inbound data: 4/2147483714 bytes received; last active 0 ns ago: status Network error: RPC frame had a length of 2147483714, but we only support messages up to 52428800 bytes long.
W20260926 13:41:07.067778   638 connection.cc:196] Error closing socket: Network error: TlsSocket::Close: Broken pipe
I20260926 13:41:07.087534   650 acceptor_pool.cc:254] collecting diagnostics on the listening RPC socket unix:/tmp/dist-test-taskmWfMUL/test-tmp/rpc-test-593a1d93083a49a291d7922ef0622848.sock every 8 connection(s)
I20260926 13:41:07.087534   651 acceptor_pool.cc:254] collecting diagnostics on the listening RPC socket unix:/tmp/dist-test-taskmWfMUL/test-tmp/rpc-test-593a1d93083a49a291d7922ef0622848.sock every 8 connection(s)
W20260926 13:41:11.926579   647 connection.cc:577] server connection from unix:<unnamed>: received bad data: 'Corruption: Invalid packet: message had a length of 2147483710, but we only support messages up to 2147483647 bytes
'
W20260926 13:41:11.927126   663 connection.cc:196] Error closing socket: Network error: TlsSocket::Close: Broken pipe
[       OK ] Parameters/TestRpc.TestRpcSidecarLimits/SSL_UnixSocket (6671 ms)
[ RUN      ] Parameters/TestRpc.TestCallTimeoutDoesntAffectNegotiation/SSL_UnixSocket
I20260926 13:41:11.946309   675 acceptor_pool.cc:254] collecting diagnostics on the listening RPC socket unix:/tmp/dist-test-taskmWfMUL/test-tmp/rpc-test-7e248b67d81b41f88f926ccd1efd155b.sock every 8 connection(s)
I20260926 13:41:11.946345   676 acceptor_pool.cc:254] collecting diagnostics on the listening RPC socket unix:/tmp/dist-test-taskmWfMUL/test-tmp/rpc-test-7e248b67d81b41f88f926ccd1efd155b.sock every 8 connection(s)
W20260926 13:41:11.980592   671 negotiation.cc:266] Injecting 500ms delay in negotiation
I20260926 13:41:12.031003   383 rpc-test-base.h:595] status: Timed out: connection negotiation to unix:/tmp/dist-test-taskmWfMUL/test-tmp/rpc-test-7e248b67d81b41f88f926ccd1efd155b.sock for RPC Sleep timed out after 0.050s (ON_OUTBOUND_QUEUE), seconds elapsed: 0.0508963
[       OK ] Parameters/TestRpc.TestCallTimeoutDoesntAffectNegotiation/SSL_UnixSocket (557 ms)
[ RUN      ] Parameters/TestRpc.TestRpcHandlerLatencyMetric/SSL_UnixSocket
I20260926 13:41:12.496312   700 acceptor_pool.cc:254] collecting diagnostics on the listening RPC socket unix:/tmp/dist-test-taskmWfMUL/test-tmp/rpc-test-09a9d86d0dc743e3a31dbf92c1112f68.sock every 8 connection(s)
I20260926 13:41:12.496424   701 acceptor_pool.cc:254] collecting diagnostics on the listening RPC socket unix:/tmp/dist-test-taskmWfMUL/test-tmp/rpc-test-09a9d86d0dc743e3a31dbf92c1112f68.sock every 8 connection(s)
I20260926 13:41:12.539019   383 rpc-test.cc:1236] Sleep() min lat: 20386
I20260926 13:41:12.539093   383 rpc-test.cc:1237] Sleep() mean lat: 20386
I20260926 13:41:12.539120   383 rpc-test.cc:1238] Sleep() max lat: 20386
I20260926 13:41:12.539134   383 rpc-test.cc:1239] Sleep() #calls: 1
W20260926 13:41:12.539963   697 connection.cc:196] Error closing socket: Network error: TlsSocket::Close: Broken pipe
[       OK ] Parameters/TestRpc.TestRpcHandlerLatencyMetric/SSL_UnixSocket (54 ms)
[ RUN      ] Parameters/TestRpc.TimedOutOnResponseMetricServiceQueue/SSL_UnixSocket
I20260926 13:41:12.568241   726 acceptor_pool.cc:254] collecting diagnostics on the listening RPC socket unix:/tmp/dist-test-taskmWfMUL/test-tmp/rpc-test-57860d14ec0a4754b8f2ee88e7444e65.sock every 8 connection(s)
I20260926 13:41:12.568253   727 acceptor_pool.cc:254] collecting diagnostics on the listening RPC socket unix:/tmp/dist-test-taskmWfMUL/test-tmp/rpc-test-57860d14ec0a4754b8f2ee88e7444e65.sock every 8 connection(s)
W20260926 13:41:12.622054   728 rpcz_store.cc:267] Call kudu.rpc_test.CalculatorService.Sleep from unix:<unnamed> (request call id 2) took 20 ms (client timeout 20 ms). Trace:
W20260926 13:41:12.622157   728 rpcz_store.cc:269] 0926 13:41:12.601694 (+     0us) service_pool.cc:170] Inserting onto call queue
0926 13:41:12.621994 (+ 20300us) service_pool.cc:214] Skipping call since client already timed out
0926 13:41:12.622028 (+    34us) inbound_call.cc:173] Queueing failure response
Metrics: {}
[       OK ] Parameters/TestRpc.TimedOutOnResponseMetricServiceQueue/SSL_UnixSocket (82 ms)
[ RUN      ] Parameters/TestRpc.RpcPendingConnectionsMetric/SSL_UnixSocket
I20260926 13:41:12.626382   749 acceptor_pool.cc:254] collecting diagnostics on the listening RPC socket 0.0.0.0:45165 every 8 connection(s)
I20260926 13:41:12.626453   750 acceptor_pool.cc:254] collecting diagnostics on the listening RPC socket 0.0.0.0:45165 every 8 connection(s)
W20260926 13:41:12.636405   745 negotiation.cc:337] Failed RPC negotiation. Trace:
0926 13:41:12.635967 (+     0us) reactor.cc:625] Submitting negotiation task for server connection from 127.0.0.1:34876 (local address 127.0.0.1:45165)
0926 13:41:12.636118 (+   151us) server_negotiation.cc:206] Beginning negotiation
0926 13:41:12.636121 (+     3us) server_negotiation.cc:399] Waiting for connection header
0926 13:41:12.636207 (+    86us) negotiation.cc:327] Negotiation complete: Network error: Server connection negotiation failed: server connection from 127.0.0.1:34876: BlockingRecv error: recv got EOF from 127.0.0.1:34876 (error 108)
Metrics: {"server-negotiator.queue_time_us":45}
[       OK ] Parameters/TestRpc.RpcPendingConnectionsMetric/SSL_UnixSocket (23 ms)
[ RUN      ] Parameters/TestRpc.TestRpcContextClientDeadline/SSL_UnixSocket
I20260926 13:41:12.667101   765 acceptor_pool.cc:254] collecting diagnostics on the listening RPC socket unix:/tmp/dist-test-taskmWfMUL/test-tmp/rpc-test-452d3a1b76fd40cdaa956eaaabfd2bb7.sock every 8 connection(s)
I20260926 13:41:12.667140   766 acceptor_pool.cc:254] collecting diagnostics on the listening RPC socket unix:/tmp/dist-test-taskmWfMUL/test-tmp/rpc-test-452d3a1b76fd40cdaa956eaaabfd2bb7.sock every 8 connection(s)
[       OK ] Parameters/TestRpc.TestRpcContextClientDeadline/SSL_UnixSocket (58 ms)
[ RUN      ] Parameters/TestRpc.TestApplicationFeatureFlagUnsupportedServer/SSL_UnixSocket
I20260926 13:41:12.713119   790 acceptor_pool.cc:254] collecting diagnostics on the listening RPC socket unix:/tmp/dist-test-taskmWfMUL/test-tmp/rpc-test-db27c748738b4ba299521e95133bff29.sock every 8 connection(s)
I20260926 13:41:12.713174   791 acceptor_pool.cc:254] collecting diagnostics on the listening RPC socket unix:/tmp/dist-test-taskmWfMUL/test-tmp/rpc-test-db27c748738b4ba299521e95133bff29.sock every 8 connection(s)
[       OK ] Parameters/TestRpc.TestApplicationFeatureFlagUnsupportedServer/SSL_UnixSocket (32 ms)
[ RUN      ] Parameters/TestRpc.TestCancellationAsync/SSL_UnixSocket
I20260926 13:41:12.784505   815 acceptor_pool.cc:254] collecting diagnostics on the listening RPC socket unix:/tmp/dist-test-taskmWfMUL/test-tmp/rpc-test-7e364b51f77c43f5b0cef95f16be4b96.sock every 8 connection(s)
I20260926 13:41:12.784538   816 acceptor_pool.cc:254] collecting diagnostics on the listening RPC socket unix:/tmp/dist-test-taskmWfMUL/test-tmp/rpc-test-7e364b51f77c43f5b0cef95f16be4b96.sock every 8 connection(s)
I20260926 13:41:12.784828   383 rpc-test.cc:1716] Connecting to unix:/tmp/dist-test-taskmWfMUL/test-tmp/rpc-test-7e364b51f77c43f5b0cef95f16be4b96.sock
I20260926 13:41:12.807215   383 test_util.cc:268] Using random seed: -58974420
I20260926 13:41:12.822875   819 rpc-test-base.h:240] got call: sleep_micros: 500 pattern: 4294967295 num_repetitions: 2097152 sidecar_idx: 0
I20260926 13:41:12.841164   818 rpc-test-base.h:240] got call: sleep_micros: 500 pattern: 4294967295 num_repetitions: 2097152 sidecar_idx: 0
I20260926 13:41:12.858501   819 rpc-test-base.h:240] got call: sleep_micros: 500 pattern: 4294967295 num_repetitions: 2097152 sidecar_idx: 0
I20260926 13:41:12.874752   818 rpc-test-base.h:240] got call: sleep_micros: 500 pattern: 4294967295 num_repetitions: 2097152 sidecar_idx: 0
I20260926 13:41:12.889912   819 rpc-test-base.h:240] got call: sleep_micros: 500 pattern: 4294967295 num_repetitions: 2097152 sidecar_idx: 0
I20260926 13:41:12.904753   818 rpc-test-base.h:240] got call: sleep_micros: 500 pattern: 4294967295 num_repetitions: 2097152 sidecar_idx: 0
I20260926 13:41:12.919642   819 rpc-test-base.h:240] got call: sleep_micros: 500 pattern: 4294967295 num_repetitions: 2097152 sidecar_idx: 0
I20260926 13:41:12.934291   818 rpc-test-base.h:240] got call: sleep_micros: 500 pattern: 4294967295 num_repetitions: 2097152 sidecar_idx: 0
W20260926 13:41:12.935948   812 connection.cc:196] Error closing socket: Network error: TlsSocket::Close: Broken pipe
W20260926 13:41:12.942744   812 connection.cc:441] server connection from unix:<unnamed> torn down before Call kudu.rpc.GenericCalculatorService.SleepWithSidecar from unix:<unnamed> (request call id 8) could send its response
W20260926 13:41:12.952525   812 connection.cc:441] server connection from unix:<unnamed> torn down before Call kudu.rpc.GenericCalculatorService.SleepWithSidecar from unix:<unnamed> (request call id 9) could send its response
[       OK ] Parameters/TestRpc.TestCancellationAsync/SSL_UnixSocket (215 ms)
[ RUN      ] Parameters/TestRpc.TestPerformanceBySocketType/SSL_UnixSocket
I20260926 13:41:12.970738   840 acceptor_pool.cc:254] collecting diagnostics on the listening RPC socket unix:/tmp/dist-test-taskmWfMUL/test-tmp/rpc-test-b0e4a0a148d34267b2c5659458a681d8.sock every 8 connection(s)
I20260926 13:41:12.970774   841 acceptor_pool.cc:254] collecting diagnostics on the listening RPC socket unix:/tmp/dist-test-taskmWfMUL/test-tmp/rpc-test-b0e4a0a148d34267b2c5659458a681d8.sock every 8 connection(s)
I20260926 13:41:12.971115   383 rpc-test.cc:1846] Connecting to unix:/tmp/dist-test-taskmWfMUL/test-tmp/rpc-test-b0e4a0a148d34267b2c5659458a681d8.sock
I20260926 13:41:14.560217   383 rpc-test.cc:1859] Sending 1024MB via ssl-enabled unix socket: real 1.572s	user 1.985s	sys 0.851s
I20260926 13:41:16.144910   383 rpc-test.cc:1859] Sending 1024MB via ssl-enabled unix socket: real 1.585s	user 2.082s	sys 0.798s
I20260926 13:41:17.676898   383 rpc-test.cc:1859] Sending 1024MB via ssl-enabled unix socket: real 1.532s	user 1.939s	sys 0.835s
I20260926 13:41:19.272253   383 rpc-test.cc:1859] Sending 1024MB via ssl-enabled unix socket: real 1.595s	user 1.978s	sys 0.915s
I20260926 13:41:20.875505   383 rpc-test.cc:1859] Sending 1024MB via ssl-enabled unix socket: real 1.603s	user 2.032s	sys 0.873s
W20260926 13:41:20.876358   837 connection.cc:196] Error closing socket: Network error: TlsSocket::Close: Broken pipe
[       OK ] Parameters/TestRpc.TestPerformanceBySocketType/SSL_UnixSocket (7923 ms)
[----------] 20 tests from Parameters/TestRpc (30661 ms total)

[----------] 1 test from Parameters/TestRpcSocketTxRxQueue
[ RUN      ] Parameters/TestRpcSocketTxRxQueue.AcceptorRxQueueSizeMetric/0
I20260926 13:41:20.879825   865 acceptor_pool.cc:254] collecting diagnostics on the listening RPC socket 0.0.0.0:44547 every 1 connection(s)
I20260926 13:41:20.879926   866 acceptor_pool.cc:254] collecting diagnostics on the listening RPC socket 0.0.0.0:44547 every 1 connection(s)
W20260926 13:41:20.880725   861 negotiation.cc:337] Failed RPC negotiation. Trace:
0926 13:41:20.880465 (+     0us) reactor.cc:625] Submitting negotiation task for server connection from 127.0.0.1:35562 (local address 127.0.0.1:44547)
0926 13:41:20.880555 (+    90us) server_negotiation.cc:206] Beginning negotiation
0926 13:41:20.880559 (+     4us) server_negotiation.cc:399] Waiting for connection header
0926 13:41:20.880632 (+    73us) negotiation.cc:327] Negotiation complete: Network error: Server connection negotiation failed: server connection from 127.0.0.1:35562: BlockingRecv error: recv got EOF from 127.0.0.1:35562 (error 108)
Metrics: {"server-negotiator.queue_time_us":24}
[       OK ] Parameters/TestRpcSocketTxRxQueue.AcceptorRxQueueSizeMetric/0 (5 ms)
[----------] 1 test from Parameters/TestRpcSocketTxRxQueue (5 ms total)

[----------] Global test environment tear-down
[==========] 21 tests from 2 test suites ran. (30667 ms total)
[  PASSED  ] 20 tests.
[  FAILED  ] 1 test, listed below:
[  FAILED  ] Parameters/TestRpc.TestCallWithChainCertAndChainCA/SSL_UnixSocket, where GetParam() = (true, true)

 1 FAILED TEST