Diagnosed failure

Parameters/TestRpc.TestCallWithChainCertAndRootCA/SSL_UnixSocket: /data0/somelongdirectorytoavoidrpathissues/src/kudu/src/kudu/rpc/rpc-test.cc:303: Failure
Failed
Bad status: Runtime error: could not verify certificate chain (error with cert: subject=CN = localhost, ST = sadfjas, C = AS, emailAddress = sdflkdsajf, O = lskdfjlsad, OU = sldfkja, issuer=C = AS, ST = ASDfkjdhf, L = lskdjf, O = saldfja, OU = skdjf, CN = localhost, emailAddress = sadjflkadsj): : certificate has expired
Google Test trace:
/data0/somelongdirectorytoavoidrpathissues/src/kudu/src/kudu/rpc/rpc-test.cc:300: Connecting to unix:/tmp/dist-test-taskAmo0m4/test-tmp/rpc-test-efbe09220d3145a2a96f64676e62abf5.sock
I20260927 14:00:56.048480 17497 test_util.cc:175] -----------------------------------------------
I20260927 14:00:56.048648 17497 test_util.cc:176] Had fatal failures, leaving test files at /tmp/dist-test-taskAmo0m4/test-tmp/rpc-test.2.Parameters_TestRpc.TestCallWithChainCertAndRootCA_SSL_UnixSocket.1790517652597118-17497-0

Full log

Note: This is test shard 3 of 8.
[==========] Running 21 tests from 2 test suites.
[----------] Global test environment set-up.
[----------] 1 test from TestRpc
[ RUN      ] TestRpc.TestNegotiationTimeout
WARNING: Logging before InitGoogleLogging() is written to STDERR
I20260927 14:00:52.785709 17497 rpc-test-base.h:595] status: Timed out: connection negotiation to 0.0.0.0:40723 for RPC Sleep timed out after 0.100s (ON_OUTBOUND_QUEUE), seconds elapsed: 0.10088
W20260927 14:00:55.735620 17507 negotiation.cc:337] Failed RPC negotiation. Trace:
0927 14:00:52.685535 (+     0us) reactor.cc:625] Submitting negotiation task for client connection to 0.0.0.0:40723 (local address 127.0.0.1:41324)
0927 14:00:52.686394 (+   859us) negotiation.cc:107] Waiting for socket to connect
0927 14:00:52.686443 (+    49us) client_negotiation.cc:174] Beginning negotiation
0927 14:00:52.698763 (+ 12320us) client_negotiation.cc:252] Sending NEGOTIATE NegotiatePB request
0927 14:00:55.734471 (+3035708us) negotiation.cc:327] Negotiation complete: Timed out: Client connection negotiation failed: client connection to 0.0.0.0:40723: received 0 of 4 requested bytes
Metrics: {"client-negotiator.queue_time_us":259}
[       OK ] TestRpc.TestNegotiationTimeout (3090 ms)
[----------] 1 test from TestRpc (3090 ms total)

[----------] 20 tests from Parameters/TestRpc
[ RUN      ] Parameters/TestRpc.TestAcceptorPoolStartStop/SSL_UnixSocket
I20260927 14:00:55.785923 17523 acceptor_pool.cc:254] collecting diagnostics on the listening RPC socket unix:/tmp/dist-test-taskAmo0m4/test-tmp/rpc-test-23f37043bb294dd8a42aeb8b5aca6d8c.sock every 8 connection(s)
I20260927 14:00:55.787683 17524 acceptor_pool.cc:254] collecting diagnostics on the listening RPC socket unix:/tmp/dist-test-taskAmo0m4/test-tmp/rpc-test-23f37043bb294dd8a42aeb8b5aca6d8c.sock every 8 connection(s)
I20260927 14:00:55.822965 17534 acceptor_pool.cc:254] collecting diagnostics on the listening RPC socket unix:/tmp/dist-test-taskAmo0m4/test-tmp/rpc-test-23f37043bb294dd8a42aeb8b5aca6d8c.sock every 8 connection(s)
I20260927 14:00:55.824538 17535 acceptor_pool.cc:254] collecting diagnostics on the listening RPC socket unix:/tmp/dist-test-taskAmo0m4/test-tmp/rpc-test-23f37043bb294dd8a42aeb8b5aca6d8c.sock every 8 connection(s)
I20260927 14:00:55.856303 17545 acceptor_pool.cc:254] collecting diagnostics on the listening RPC socket unix:/tmp/dist-test-taskAmo0m4/test-tmp/rpc-test-23f37043bb294dd8a42aeb8b5aca6d8c.sock every 8 connection(s)
I20260927 14:00:55.857021 17546 acceptor_pool.cc:254] collecting diagnostics on the listening RPC socket unix:/tmp/dist-test-taskAmo0m4/test-tmp/rpc-test-23f37043bb294dd8a42aeb8b5aca6d8c.sock every 8 connection(s)
I20260927 14:00:55.876597 17556 acceptor_pool.cc:254] collecting diagnostics on the listening RPC socket unix:/tmp/dist-test-taskAmo0m4/test-tmp/rpc-test-23f37043bb294dd8a42aeb8b5aca6d8c.sock every 8 connection(s)
I20260927 14:00:55.877295 17557 acceptor_pool.cc:254] collecting diagnostics on the listening RPC socket unix:/tmp/dist-test-taskAmo0m4/test-tmp/rpc-test-23f37043bb294dd8a42aeb8b5aca6d8c.sock every 8 connection(s)
I20260927 14:00:55.893234 17567 acceptor_pool.cc:254] collecting diagnostics on the listening RPC socket unix:/tmp/dist-test-taskAmo0m4/test-tmp/rpc-test-23f37043bb294dd8a42aeb8b5aca6d8c.sock every 8 connection(s)
I20260927 14:00:55.893966 17568 acceptor_pool.cc:254] collecting diagnostics on the listening RPC socket unix:/tmp/dist-test-taskAmo0m4/test-tmp/rpc-test-23f37043bb294dd8a42aeb8b5aca6d8c.sock every 8 connection(s)
[       OK ] Parameters/TestRpc.TestAcceptorPoolStartStop/SSL_UnixSocket (157 ms)
[ RUN      ] Parameters/TestRpc.TestCall/SSL_UnixSocket
I20260927 14:00:55.935925 17580 acceptor_pool.cc:254] collecting diagnostics on the listening RPC socket unix:/tmp/dist-test-taskAmo0m4/test-tmp/rpc-test-c0ebb3f19bd842e993b17ae155e99d6d.sock every 8 connection(s)
I20260927 14:00:55.938181 17581 acceptor_pool.cc:254] collecting diagnostics on the listening RPC socket unix:/tmp/dist-test-taskAmo0m4/test-tmp/rpc-test-c0ebb3f19bd842e993b17ae155e99d6d.sock every 8 connection(s)
I20260927 14:00:55.943238 17497 rpc-test.cc:234] Connecting to unix:/tmp/dist-test-taskAmo0m4/test-tmp/rpc-test-c0ebb3f19bd842e993b17ae155e99d6d.sock
W20260927 14:00:55.994973 17577 connection.cc:196] Error closing socket: Network error: TlsSocket::Close: Broken pipe
[       OK ] Parameters/TestRpc.TestCall/SSL_UnixSocket (101 ms)
[ RUN      ] Parameters/TestRpc.TestCallWithChainCertAndRootCA/SSL_UnixSocket
I20260927 14:00:56.027276 17605 acceptor_pool.cc:254] collecting diagnostics on the listening RPC socket unix:/tmp/dist-test-taskAmo0m4/test-tmp/rpc-test-efbe09220d3145a2a96f64676e62abf5.sock every 8 connection(s)
I20260927 14:00:56.028054 17606 acceptor_pool.cc:254] collecting diagnostics on the listening RPC socket unix:/tmp/dist-test-taskAmo0m4/test-tmp/rpc-test-efbe09220d3145a2a96f64676e62abf5.sock every 8 connection(s)
/data0/somelongdirectorytoavoidrpathissues/src/kudu/src/kudu/rpc/rpc-test.cc:303: Failure
Failed
Bad status: Runtime error: could not verify certificate chain (error with cert: subject=CN = localhost, ST = sadfjas, C = AS, emailAddress = sdflkdsajf, O = lskdfjlsad, OU = sldfkja, issuer=C = AS, ST = ASDfkjdhf, L = lskdjf, O = saldfja, OU = skdjf, CN = localhost, emailAddress = sadjflkadsj): : certificate has expired
Google Test trace:
/data0/somelongdirectorytoavoidrpathissues/src/kudu/src/kudu/rpc/rpc-test.cc:300: Connecting to unix:/tmp/dist-test-taskAmo0m4/test-tmp/rpc-test-efbe09220d3145a2a96f64676e62abf5.sock
I20260927 14:00:56.048480 17497 test_util.cc:175] -----------------------------------------------
I20260927 14:00:56.048648 17497 test_util.cc:176] Had fatal failures, leaving test files at /tmp/dist-test-taskAmo0m4/test-tmp/rpc-test.2.Parameters_TestRpc.TestCallWithChainCertAndRootCA_SSL_UnixSocket.1790517652597118-17497-0
[  FAILED  ] Parameters/TestRpc.TestCallWithChainCertAndRootCA/SSL_UnixSocket, where GetParam() = (true, true) (48 ms)
[ RUN      ] Parameters/TestRpc.TestCallWithBadPasswordProtectedKey/SSL_UnixSocket
[       OK ] Parameters/TestRpc.TestCallWithBadPasswordProtectedKey/SSL_UnixSocket (31 ms)
[ RUN      ] Parameters/TestRpc.TestInvalidMethodCall/SSL_UnixSocket
I20260927 14:00:56.098263 17642 acceptor_pool.cc:254] collecting diagnostics on the listening RPC socket unix:/tmp/dist-test-taskAmo0m4/test-tmp/rpc-test-e4b92005963545f286b5c1a047adcd44.sock every 8 connection(s)
I20260927 14:00:56.099123 17643 acceptor_pool.cc:254] collecting diagnostics on the listening RPC socket unix:/tmp/dist-test-taskAmo0m4/test-tmp/rpc-test-e4b92005963545f286b5c1a047adcd44.sock every 8 connection(s)
I20260927 14:00:56.102540 17497 rpc-test.cc:406] Connecting to unix:/tmp/dist-test-taskAmo0m4/test-tmp/rpc-test-e4b92005963545f286b5c1a047adcd44.sock
[       OK ] Parameters/TestRpc.TestInvalidMethodCall/SSL_UnixSocket (65 ms)
[ RUN      ] Parameters/TestRpc.TestHighFDs/SSL_UnixSocket
I20260927 14:00:56.369125 17667 acceptor_pool.cc:254] collecting diagnostics on the listening RPC socket unix:/tmp/dist-test-taskAmo0m4/test-tmp/rpc-test-3eb3c018dbbe41f88678fd614c638a93.sock every 8 connection(s)
I20260927 14:00:56.369954 17668 acceptor_pool.cc:254] collecting diagnostics on the listening RPC socket unix:/tmp/dist-test-taskAmo0m4/test-tmp/rpc-test-3eb3c018dbbe41f88678fd614c638a93.sock every 8 connection(s)
W20260927 14:00:56.402758 17664 connection.cc:196] Error closing socket: Network error: TlsSocket::Close: Broken pipe
[       OK ] Parameters/TestRpc.TestHighFDs/SSL_UnixSocket (269 ms)
[ RUN      ] Parameters/TestRpc.TestConnectionAlwaysKeepalive/SSL_UnixSocket
I20260927 14:00:56.446808 17690 acceptor_pool.cc:254] collecting diagnostics on the listening RPC socket unix:/tmp/dist-test-taskAmo0m4/test-tmp/rpc-test-4dcf67d4e96f43f9b133cf03c6ab9880.sock every 8 connection(s)
I20260927 14:00:56.447553 17691 acceptor_pool.cc:254] collecting diagnostics on the listening RPC socket unix:/tmp/dist-test-taskAmo0m4/test-tmp/rpc-test-4dcf67d4e96f43f9b133cf03c6ab9880.sock every 8 connection(s)
I20260927 14:00:56.450711 17497 rpc-test.cc:532] Connecting to unix:/tmp/dist-test-taskAmo0m4/test-tmp/rpc-test-4dcf67d4e96f43f9b133cf03c6ab9880.sock
[       OK ] Parameters/TestRpc.TestConnectionAlwaysKeepalive/SSL_UnixSocket (3075 ms)
[ RUN      ] Parameters/TestRpc.TestReopenOutboundConnections/SSL_UnixSocket
I20260927 14:00:59.524361 17713 acceptor_pool.cc:254] collecting diagnostics on the listening RPC socket unix:/tmp/dist-test-taskAmo0m4/test-tmp/rpc-test-9e395fd13751485984a92038b657c6f8.sock every 8 connection(s)
I20260927 14:00:59.525154 17714 acceptor_pool.cc:254] collecting diagnostics on the listening RPC socket unix:/tmp/dist-test-taskAmo0m4/test-tmp/rpc-test-9e395fd13751485984a92038b657c6f8.sock every 8 connection(s)
I20260927 14:00:59.528394 17497 rpc-test.cc:658] Connecting to unix:/tmp/dist-test-taskAmo0m4/test-tmp/rpc-test-9e395fd13751485984a92038b657c6f8.sock
W20260927 14:00:59.553761 17712 connection.cc:196] Error closing socket: Network error: TlsSocket::Close: Broken pipe
W20260927 14:00:59.564689 17712 connection.cc:196] Error closing socket: Network error: TlsSocket::Close: Broken pipe
W20260927 14:00:59.576022 17712 connection.cc:196] Error closing socket: Network error: TlsSocket::Close: Broken pipe
W20260927 14:00:59.586182 17712 connection.cc:196] Error closing socket: Network error: TlsSocket::Close: Broken pipe
W20260927 14:00:59.596478 17712 connection.cc:196] Error closing socket: Network error: TlsSocket::Close: Broken pipe
W20260927 14:00:59.606604 17712 connection.cc:196] Error closing socket: Network error: TlsSocket::Close: Broken pipe
W20260927 14:00:59.616309 17712 connection.cc:196] Error closing socket: Network error: TlsSocket::Close: Broken pipe
W20260927 14:00:59.626819 17712 connection.cc:196] Error closing socket: Network error: TlsSocket::Close: Broken pipe
W20260927 14:00:59.636924 17712 connection.cc:196] Error closing socket: Network error: TlsSocket::Close: Broken pipe
W20260927 14:00:59.646798 17712 connection.cc:196] Error closing socket: Network error: TlsSocket::Close: Broken pipe
W20260927 14:00:59.656651 17712 connection.cc:196] Error closing socket: Network error: TlsSocket::Close: Broken pipe
W20260927 14:00:59.666718 17712 connection.cc:196] Error closing socket: Network error: TlsSocket::Close: Broken pipe
W20260927 14:00:59.677019 17712 connection.cc:196] Error closing socket: Network error: TlsSocket::Close: Broken pipe
W20260927 14:00:59.687573 17713 acceptor_pool.cc:285] unable to collect diagnostics on RPC socket unix:/tmp/dist-test-taskAmo0m4/test-tmp/rpc-test-9e395fd13751485984a92038b657c6f8.sock: Not implemented: netlink diagnostics is currently supported only on IPv4 TCP sockets
W20260927 14:00:59.687517 17712 connection.cc:196] Error closing socket: Network error: TlsSocket::Close: Broken pipe
W20260927 14:00:59.698133 17712 connection.cc:196] Error closing socket: Network error: TlsSocket::Close: Broken pipe
W20260927 14:00:59.707543 17712 connection.cc:196] Error closing socket: Network error: TlsSocket::Close: Broken pipe
W20260927 14:00:59.717466 17712 connection.cc:196] Error closing socket: Network error: TlsSocket::Close: Broken pipe
W20260927 14:00:59.727398 17712 connection.cc:196] Error closing socket: Network error: TlsSocket::Close: Broken pipe
W20260927 14:00:59.737576 17712 connection.cc:196] Error closing socket: Network error: TlsSocket::Close: Broken pipe
W20260927 14:00:59.747299 17712 connection.cc:196] Error closing socket: Network error: TlsSocket::Close: Broken pipe
W20260927 14:00:59.757114 17712 connection.cc:196] Error closing socket: Network error: TlsSocket::Close: Broken pipe
W20260927 14:00:59.767057 17712 connection.cc:196] Error closing socket: Network error: TlsSocket::Close: Broken pipe
W20260927 14:00:59.776638 17712 connection.cc:196] Error closing socket: Network error: TlsSocket::Close: Broken pipe
W20260927 14:00:59.786878 17712 connection.cc:196] Error closing socket: Network error: TlsSocket::Close: Broken pipe
W20260927 14:00:59.796823 17712 connection.cc:196] Error closing socket: Network error: TlsSocket::Close: Broken pipe
W20260927 14:00:59.806457 17712 connection.cc:196] Error closing socket: Network error: TlsSocket::Close: Broken pipe
W20260927 14:00:59.817690 17712 connection.cc:196] Error closing socket: Network error: TlsSocket::Close: Broken pipe
W20260927 14:00:59.826948 17712 connection.cc:196] Error closing socket: Network error: TlsSocket::Close: Broken pipe
W20260927 14:00:59.835937 17712 connection.cc:196] Error closing socket: Network error: TlsSocket::Close: Broken pipe
W20260927 14:00:59.845206 17712 connection.cc:196] Error closing socket: Network error: TlsSocket::Close: Broken pipe
W20260927 14:00:59.854849 17712 connection.cc:196] Error closing socket: Network error: TlsSocket::Close: Broken pipe
W20260927 14:00:59.865556 17712 connection.cc:196] Error closing socket: Network error: TlsSocket::Close: Broken pipe
[       OK ] Parameters/TestRpc.TestReopenOutboundConnections/SSL_UnixSocket (379 ms)
[ RUN      ] Parameters/TestRpc.TestConnectionNetworkPlane/SSL_UnixSocket
I20260927 14:00:59.885771 17736 acceptor_pool.cc:254] collecting diagnostics on the listening RPC socket unix:/tmp/dist-test-taskAmo0m4/test-tmp/rpc-test-873f5daf0ff64ce485973c0af9d305a2.sock every 8 connection(s)
I20260927 14:00:59.886574 17737 acceptor_pool.cc:254] collecting diagnostics on the listening RPC socket unix:/tmp/dist-test-taskAmo0m4/test-tmp/rpc-test-873f5daf0ff64ce485973c0af9d305a2.sock every 8 connection(s)
I20260927 14:00:59.889681 17497 rpc-test.cc:772] Connecting to unix:/tmp/dist-test-taskAmo0m4/test-tmp/rpc-test-873f5daf0ff64ce485973c0af9d305a2.sock
W20260927 14:00:59.937369 17735 connection.cc:196] Error closing socket: Network error: TlsSocket::Close: Broken pipe
W20260927 14:00:59.938261 17735 connection.cc:196] Error closing socket: Network error: TlsSocket::Close: Broken pipe
[       OK ] Parameters/TestRpc.TestConnectionNetworkPlane/SSL_UnixSocket (75 ms)
[ RUN      ] Parameters/TestRpc.TestTCPKeepalive/SSL_UnixSocket
I20260927 14:00:59.981451 17761 acceptor_pool.cc:254] collecting diagnostics on the listening RPC socket unix:/tmp/dist-test-taskAmo0m4/test-tmp/rpc-test-863f65755f9a487088a0453f69b2dbb6.sock every 8 connection(s)
I20260927 14:00:59.982214 17762 acceptor_pool.cc:254] collecting diagnostics on the listening RPC socket unix:/tmp/dist-test-taskAmo0m4/test-tmp/rpc-test-863f65755f9a487088a0453f69b2dbb6.sock every 8 connection(s)
I20260927 14:01:00.010774 17765 rpc-test-base.h:222] got call: sleep_micros: 8000000 deferred: true
I20260927 14:01:08.014889 17765 rpcz_store.cc:275] Call kudu.rpc.GenericCalculatorService.Sleep from unix:<unnamed> (request call id 0) took 8004 ms. Trace:
I20260927 14:01:08.015375 17765 rpcz_store.cc:276] 0927 14:01:00.010590 (+     0us) service_pool.cc:170] Inserting onto call queue
0927 14:01:00.010693 (+   103us) service_pool.cc:227] Handling call
0927 14:01:08.014693 (+8004000us) inbound_call.cc:173] Queueing success response
Metrics: {}
W20260927 14:01:08.022573 17758 connection.cc:196] Error closing socket: Network error: TlsSocket::Close: Broken pipe
[       OK ] Parameters/TestRpc.TestTCPKeepalive/SSL_UnixSocket (8085 ms)
[ RUN      ] Parameters/TestRpc.TestMaxSmallSidecars/SSL_UnixSocket
I20260927 14:01:08.054934 17787 acceptor_pool.cc:254] collecting diagnostics on the listening RPC socket unix:/tmp/dist-test-taskAmo0m4/test-tmp/rpc-test-22ba2e358829445ca5a4505378d757d6.sock every 8 connection(s)
I20260927 14:01:08.055833 17788 acceptor_pool.cc:254] collecting diagnostics on the listening RPC socket unix:/tmp/dist-test-taskAmo0m4/test-tmp/rpc-test-22ba2e358829445ca5a4505378d757d6.sock every 8 connection(s)
W20260927 14:01:08.234766 17784 connection.cc:196] Error closing socket: Network error: TlsSocket::Close: Broken pipe
[       OK ] Parameters/TestRpc.TestMaxSmallSidecars/SSL_UnixSocket (207 ms)
[ RUN      ] Parameters/TestRpc.TestCallTimeout/SSL_UnixSocket
I20260927 14:01:08.265789 17812 acceptor_pool.cc:254] collecting diagnostics on the listening RPC socket unix:/tmp/dist-test-taskAmo0m4/test-tmp/rpc-test-5773b8313010481b91987d828c25c990.sock every 8 connection(s)
I20260927 14:01:08.266628 17813 acceptor_pool.cc:254] collecting diagnostics on the listening RPC socket unix:/tmp/dist-test-taskAmo0m4/test-tmp/rpc-test-5773b8313010481b91987d828c25c990.sock every 8 connection(s)
I20260927 14:01:08.301021 17497 rpc-test-base.h:595] status: Timed out: connection negotiation to unix:/tmp/dist-test-taskAmo0m4/test-tmp/rpc-test-5773b8313010481b91987d828c25c990.sock for RPC Sleep timed out after 0.000s (ON_OUTBOUND_QUEUE), seconds elapsed: 0.00260918
I20260927 14:01:08.308879 17816 rpc-test-base.h:222] got call: sleep_micros: 700000
I20260927 14:01:08.502874 17497 rpc-test-base.h:595] status: Timed out: Sleep RPC to unix:/tmp/dist-test-taskAmo0m4/test-tmp/rpc-test-5773b8313010481b91987d828c25c990.sock timed out after 0.200s (SENT), seconds elapsed: 0.201438
I20260927 14:01:08.506875 17815 rpc-test-base.h:222] got call: sleep_micros: 2000000
W20260927 14:01:09.009603 17816 rpcz_store.cc:267] Call kudu.rpc.GenericCalculatorService.Sleep from unix:<unnamed> (request call id 1) took 700 ms (client timeout 200 ms). Trace:
W20260927 14:01:09.010041 17816 rpcz_store.cc:269] 0927 14:01:08.308693 (+     0us) service_pool.cc:170] Inserting onto call queue
0927 14:01:08.308831 (+   138us) service_pool.cc:227] Handling call
0927 14:01:09.009543 (+700712us) inbound_call.cc:173] Queueing success response
Metrics: {}
I20260927 14:01:10.005844 17497 rpc-test-base.h:595] status: Timed out: Sleep RPC to unix:/tmp/dist-test-taskAmo0m4/test-tmp/rpc-test-5773b8313010481b91987d828c25c990.sock timed out after 1.500s (SENT), seconds elapsed: 1.50254
W20260927 14:01:10.507506 17815 rpcz_store.cc:267] Call kudu.rpc.GenericCalculatorService.Sleep from unix:<unnamed> (request call id 2) took 2003 ms (client timeout 1500 ms). Trace:
W20260927 14:01:10.507818 17815 rpcz_store.cc:269] 0927 14:01:08.504411 (+     0us) service_pool.cc:170] Inserting onto call queue
0927 14:01:08.506662 (+  2251us) service_pool.cc:227] Handling call
0927 14:01:10.507449 (+2000787us) inbound_call.cc:173] Queueing success response
Metrics: {}
W20260927 14:01:10.508426 17809 connection.cc:441] server connection from unix:<unnamed> torn down before Call kudu.rpc.GenericCalculatorService.Sleep from unix:<unnamed> (request call id 2) could send its response
[       OK ] Parameters/TestRpc.TestCallTimeout/SSL_UnixSocket (2274 ms)
[ RUN      ] Parameters/TestRpc.TestServerShutsDown/SSL_UnixSocket
I20260927 14:01:10.516628 17497 rpc-test.cc:1125] Connecting to 0.0.0.0:33607
W20260927 14:01:10.526340 17829 negotiation.cc:337] Failed RPC negotiation. Trace:
0927 14:01:10.524845 (+     0us) reactor.cc:625] Submitting negotiation task for client connection to 0.0.0.0:33607 (local address 127.0.0.1:52030)
0927 14:01:10.525296 (+   451us) negotiation.cc:107] Waiting for socket to connect
0927 14:01:10.525327 (+    31us) client_negotiation.cc:174] Beginning negotiation
0927 14:01:10.525539 (+   212us) client_negotiation.cc:252] Sending NEGOTIATE NegotiatePB request
0927 14:01:10.525745 (+   206us) negotiation.cc:327] Negotiation complete: Network error: Client connection negotiation failed: client connection to 0.0.0.0:33607: BlockingWrite error: write error: Broken pipe (error 32)
Metrics: {"client-negotiator.queue_time_us":123}
[       OK ] Parameters/TestRpc.TestServerShutsDown/SSL_UnixSocket (14 ms)
[ RUN      ] Parameters/TestRpc.TimedOutOnResponseMetric/SSL_UnixSocket
I20260927 14:01:10.560197 17846 acceptor_pool.cc:254] collecting diagnostics on the listening RPC socket unix:/tmp/dist-test-taskAmo0m4/test-tmp/rpc-test-d8921ea483be4d3dacabce6a0021b10f.sock every 8 connection(s)
I20260927 14:01:10.561002 17847 acceptor_pool.cc:254] collecting diagnostics on the listening RPC socket unix:/tmp/dist-test-taskAmo0m4/test-tmp/rpc-test-d8921ea483be4d3dacabce6a0021b10f.sock every 8 connection(s)
W20260927 14:01:10.799976 17850 rpcz_store.cc:267] Call kudu.rpc_test.CalculatorService.Sleep from unix:<unnamed> (request call id 3) took 50 ms (client timeout 25 ms). Trace:
W20260927 14:01:10.800278 17850 rpcz_store.cc:269] 0927 14:01:10.749342 (+     0us) service_pool.cc:170] Inserting onto call queue
0927 14:01:10.749457 (+   115us) service_pool.cc:227] Handling call
0927 14:01:10.799886 (+ 50429us) inbound_call.cc:173] Queueing success response
Related trace 'test_child':
Metrics: {"test_sleep_us":50000,"child_traces":[["test_child",{"related_trace_metric":1}]]}
W20260927 14:01:10.859176 17850 rpcz_store.cc:267] Call kudu.rpc_test.CalculatorService.Sleep from unix:<unnamed> (request call id 4) took 50 ms (client timeout 50 ms). Trace:
W20260927 14:01:10.859521 17850 rpcz_store.cc:269] 0927 14:01:10.808636 (+     0us) service_pool.cc:170] Inserting onto call queue
0927 14:01:10.808769 (+   133us) service_pool.cc:227] Handling call
0927 14:01:10.859113 (+ 50344us) inbound_call.cc:173] Queueing success response
Related trace 'test_child':
Metrics: {"test_sleep_us":50000,"child_traces":[["test_child",{"related_trace_metric":1}]]}
W20260927 14:01:10.862994 17843 connection.cc:196] Error closing socket: Network error: TlsSocket::Close: Broken pipe
[       OK ] Parameters/TestRpc.TimedOutOnResponseMetric/SSL_UnixSocket (339 ms)
[ RUN      ] Parameters/TestRpc.AcceptorDispatchingTimesMetric/SSL_UnixSocket
I20260927 14:01:10.880398 17871 acceptor_pool.cc:254] collecting diagnostics on the listening RPC socket 0.0.0.0:43563 every 8 connection(s)
I20260927 14:01:10.881240 17872 acceptor_pool.cc:254] collecting diagnostics on the listening RPC socket 0.0.0.0:43563 every 8 connection(s)
W20260927 14:01:10.887328 17867 negotiation.cc:337] Failed RPC negotiation. Trace:
0927 14:01:10.885022 (+     0us) reactor.cc:625] Submitting negotiation task for server connection from 127.0.0.1:35720 (local address 127.0.0.1:43563)
0927 14:01:10.885601 (+   579us) server_negotiation.cc:206] Beginning negotiation
0927 14:01:10.885623 (+    22us) server_negotiation.cc:399] Waiting for connection header
0927 14:01:10.886078 (+   455us) negotiation.cc:327] Negotiation complete: Network error: Server connection negotiation failed: server connection from 127.0.0.1:35720: BlockingRecv error: recv got EOF from 127.0.0.1:35720 (error 108)
Metrics: {"server-negotiator.queue_time_us":130}
[       OK ] Parameters/TestRpc.AcceptorDispatchingTimesMetric/SSL_UnixSocket (22 ms)
[ RUN      ] Parameters/TestRpc.TestRpcCallbackDestroysMessenger/SSL_UnixSocket
[       OK ] Parameters/TestRpc.TestRpcCallbackDestroysMessenger/SSL_UnixSocket (28 ms)
[ RUN      ] Parameters/TestRpc.TestApplicationFeatureFlag/SSL_UnixSocket
I20260927 14:01:10.950883 17896 acceptor_pool.cc:254] collecting diagnostics on the listening RPC socket unix:/tmp/dist-test-taskAmo0m4/test-tmp/rpc-test-24b524e5847f43cea50a787df9f34f24.sock every 8 connection(s)
I20260927 14:01:10.951593 17897 acceptor_pool.cc:254] collecting diagnostics on the listening RPC socket unix:/tmp/dist-test-taskAmo0m4/test-tmp/rpc-test-24b524e5847f43cea50a787df9f34f24.sock every 8 connection(s)
W20260927 14:01:10.984537 17893 messenger.cc:357] Unable to handle RPC call: Not implemented: call requires unsupported application feature flags: 99
[       OK ] Parameters/TestRpc.TestApplicationFeatureFlag/SSL_UnixSocket (73 ms)
[ RUN      ] Parameters/TestRpc.TestCancellation/SSL_UnixSocket
I20260927 14:01:11.016384 17921 acceptor_pool.cc:254] collecting diagnostics on the listening RPC socket unix:/tmp/dist-test-taskAmo0m4/test-tmp/rpc-test-33733b7ec17448a089f57be9ffbc9d08.sock every 8 connection(s)
I20260927 14:01:11.017127 17922 acceptor_pool.cc:254] collecting diagnostics on the listening RPC socket unix:/tmp/dist-test-taskAmo0m4/test-tmp/rpc-test-33733b7ec17448a089f57be9ffbc9d08.sock every 8 connection(s)
I20260927 14:01:11.020328 17497 rpc-test.cc:1648] Connecting to unix:/tmp/dist-test-taskAmo0m4/test-tmp/rpc-test-33733b7ec17448a089f57be9ffbc9d08.sock
I20260927 14:01:11.123339 17497 rpc-test-base.h:595] status: Aborted: Sleep RPC to unix:/tmp/dist-test-taskAmo0m4/test-tmp/rpc-test-33733b7ec17448a089f57be9ffbc9d08.sock is cancelled in state READY, seconds elapsed: 0.000428934
I20260927 14:01:11.310434 17497 rpc-test-base.h:595] status: Aborted: Sleep RPC to unix:/tmp/dist-test-taskAmo0m4/test-tmp/rpc-test-33733b7ec17448a089f57be9ffbc9d08.sock is cancelled in state SENT, seconds elapsed: 0.000992872
I20260927 14:01:11.310668 17924 rpc-test-base.h:222] got call: sleep_micros: 510000
I20260927 14:01:11.489857 17497 rpc-test-base.h:595] status: Aborted: Sleep RPC to unix:/tmp/dist-test-taskAmo0m4/test-tmp/rpc-test-33733b7ec17448a089f57be9ffbc9d08.sock is cancelled in state SENT, seconds elapsed: 0.000758225
I20260927 14:01:11.490269 17923 rpc-test-base.h:222] got call: sleep_micros: 510000
I20260927 14:01:11.683234 17497 rpc-test-base.h:595] status: Aborted: Sleep RPC to unix:/tmp/dist-test-taskAmo0m4/test-tmp/rpc-test-33733b7ec17448a089f57be9ffbc9d08.sock is cancelled in state SENT, seconds elapsed: 0.000902446
W20260927 14:01:11.695152 17925 rpcz_store.cc:267] Call kudu.rpc.GenericCalculatorService.Sleep from unix:<unnamed> (request call id 11) took 11 ms (client timeout 10 ms). Trace:
W20260927 14:01:11.695562 17925 rpcz_store.cc:269] 0927 14:01:11.683246 (+     0us) service_pool.cc:170] Inserting onto call queue
0927 14:01:11.694865 (+ 11619us) service_pool.cc:214] Skipping call since client already timed out
0927 14:01:11.694984 (+   119us) inbound_call.cc:173] Queueing failure response
Metrics: {}
I20260927 14:01:11.696233 17925 rpc-test-base.h:222] got call: sleep_micros: 1500000
W20260927 14:01:11.821276 17924 rpcz_store.cc:267] Call kudu.rpc.GenericCalculatorService.Sleep from unix:<unnamed> (request call id 3) took 510 ms (client timeout 10 ms). Trace:
W20260927 14:01:11.821587 17924 rpcz_store.cc:269] 0927 14:01:11.310459 (+     0us) service_pool.cc:170] Inserting onto call queue
0927 14:01:11.310607 (+   148us) service_pool.cc:227] Handling call
0927 14:01:11.821221 (+510614us) inbound_call.cc:173] Queueing success response
Metrics: {}
W20260927 14:01:12.000905 17923 rpcz_store.cc:267] Call kudu.rpc.GenericCalculatorService.Sleep from unix:<unnamed> (request call id 7) took 511 ms (client timeout 10 ms). Trace:
W20260927 14:01:12.001268 17923 rpcz_store.cc:269] 0927 14:01:11.490019 (+     0us) service_pool.cc:170] Inserting onto call queue
0927 14:01:11.490213 (+   194us) service_pool.cc:227] Handling call
0927 14:01:12.000850 (+510637us) inbound_call.cc:173] Queueing success response
Metrics: {}
I20260927 14:01:12.685392 17497 rpc-test-base.h:595] status: Timed out: Sleep RPC to unix:/tmp/dist-test-taskAmo0m4/test-tmp/rpc-test-33733b7ec17448a089f57be9ffbc9d08.sock timed out after 1.000s (SENT), seconds elapsed: 1.00172
I20260927 14:01:12.687783 17923 rpc-test-base.h:222] got call: sleep_micros: 1500000
W20260927 14:01:13.196918 17925 rpcz_store.cc:267] Call kudu.rpc.GenericCalculatorService.Sleep from unix:<unnamed> (request call id 12) took 1512 ms (client timeout 1000 ms). Trace:
W20260927 14:01:13.197242 17925 rpcz_store.cc:269] 0927 14:01:11.684495 (+     0us) service_pool.cc:170] Inserting onto call queue
0927 14:01:11.696190 (+ 11695us) service_pool.cc:227] Handling call
0927 14:01:13.196757 (+1500567us) inbound_call.cc:173] Queueing success response
Metrics: {}
I20260927 14:01:13.687835 17497 rpc-test-base.h:595] status: Timed out: Sleep RPC to unix:/tmp/dist-test-taskAmo0m4/test-tmp/rpc-test-33733b7ec17448a089f57be9ffbc9d08.sock timed out after 1.000s (SENT), seconds elapsed: 1.00186
W20260927 14:01:13.689445 17918 messenger.cc:357] Unable to handle RPC call: Not implemented: call requires unsupported application feature flags: 99, 1
W20260927 14:01:13.690924 17918 messenger.cc:357] Unable to handle RPC call: Not implemented: call requires unsupported application feature flags: 99, 1
W20260927 14:01:13.944767 17918 connection.cc:196] Error closing socket: Network error: TlsSocket::Close: Broken pipe
W20260927 14:01:14.188454 17923 rpcz_store.cc:267] Call kudu.rpc.GenericCalculatorService.Sleep from unix:<unnamed> (request call id 13) took 1501 ms (client timeout 1000 ms). Trace:
W20260927 14:01:14.188787 17923 rpcz_store.cc:269] 0927 14:01:12.687395 (+     0us) service_pool.cc:170] Inserting onto call queue
0927 14:01:12.687657 (+   262us) service_pool.cc:227] Handling call
0927 14:01:14.188392 (+1500735us) inbound_call.cc:173] Queueing success response
Metrics: {}
W20260927 14:01:14.189507 17918 connection.cc:441] server connection from unix:<unnamed> torn down before Call kudu.rpc.GenericCalculatorService.Sleep from unix:<unnamed> (request call id 13) could send its response
[       OK ] Parameters/TestRpc.TestCancellation/SSL_UnixSocket (3205 ms)
[ RUN      ] Parameters/TestRpc.TestCancellationMultiThreads/SSL_UnixSocket
I20260927 14:01:14.225284 17947 acceptor_pool.cc:254] collecting diagnostics on the listening RPC socket unix:/tmp/dist-test-taskAmo0m4/test-tmp/rpc-test-5a175fe0997a46bb8c2ae9fce6582821.sock every 8 connection(s)
I20260927 14:01:14.226193 17948 acceptor_pool.cc:254] collecting diagnostics on the listening RPC socket unix:/tmp/dist-test-taskAmo0m4/test-tmp/rpc-test-5a175fe0997a46bb8c2ae9fce6582821.sock every 8 connection(s)
I20260927 14:01:14.230100 17497 rpc-test.cc:1808] Connecting to unix:/tmp/dist-test-taskAmo0m4/test-tmp/rpc-test-5a175fe0997a46bb8c2ae9fce6582821.sock
I20260927 14:01:14.380196 17961 test_util.cc:268] Using random seed: 1643252533
I20260927 14:01:14.381531 17962 test_util.cc:268] Using random seed: 1643253951
I20260927 14:01:14.383486 17963 test_util.cc:268] Using random seed: 1643255707
I20260927 14:01:14.385114 17964 test_util.cc:268] Using random seed: 1643257509
I20260927 14:01:14.387300 17965 test_util.cc:268] Using random seed: 1643259551
I20260927 14:01:14.388834 17966 test_util.cc:268] Using random seed: 1643261113
I20260927 14:01:14.390741 17967 test_util.cc:268] Using random seed: 1643263001
I20260927 14:01:14.392300 17968 test_util.cc:268] Using random seed: 1643264581
I20260927 14:01:14.394073 17969 test_util.cc:268] Using random seed: 1643266326
I20260927 14:01:14.395562 17970 test_util.cc:268] Using random seed: 1643267869
I20260927 14:01:14.397482 17971 test_util.cc:268] Using random seed: 1643269730
I20260927 14:01:14.398985 17972 test_util.cc:268] Using random seed: 1643271254
I20260927 14:01:14.402437 17973 test_util.cc:268] Using random seed: 1643274622
I20260927 14:01:14.404373 17974 test_util.cc:268] Using random seed: 1643276571
I20260927 14:01:14.415234 17975 test_util.cc:268] Using random seed: 1643287483
I20260927 14:01:14.417308 17976 test_util.cc:268] Using random seed: 1643289497
I20260927 14:01:14.419448 17977 test_util.cc:268] Using random seed: 1643291685
I20260927 14:01:14.422319 17978 test_util.cc:268] Using random seed: 1643294538
I20260927 14:01:14.424736 17979 test_util.cc:268] Using random seed: 1643296928
I20260927 14:01:14.426743 17980 test_util.cc:268] Using random seed: 1643298974
I20260927 14:01:14.428996 17981 test_util.cc:268] Using random seed: 1643301167
I20260927 14:01:14.430703 17982 test_util.cc:268] Using random seed: 1643302887
I20260927 14:01:14.432885 17983 test_util.cc:268] Using random seed: 1643305084
I20260927 14:01:14.435789 17984 test_util.cc:268] Using random seed: 1643308055
I20260927 14:01:14.437901 17985 test_util.cc:268] Using random seed: 1643310090
I20260927 14:01:14.440017 17986 test_util.cc:268] Using random seed: 1643312228
I20260927 14:01:14.441659 17987 test_util.cc:268] Using random seed: 1643313904
I20260927 14:01:14.443699 17988 test_util.cc:268] Using random seed: 1643315938
I20260927 14:01:14.445622 17989 test_util.cc:268] Using random seed: 1643317862
I20260927 14:01:14.447678 17990 test_util.cc:268] Using random seed: 1643319920
W20260927 14:01:35.025080 17944 connection.cc:196] Error closing socket: Network error: TlsSocket::Close: Broken pipe
[       OK ] Parameters/TestRpc.TestCancellationMultiThreads/SSL_UnixSocket (20845 ms)
[ RUN      ] Parameters/TestRpc.TestCallId/SSL_UnixSocket
I20260927 14:01:35.068761 18004 acceptor_pool.cc:254] collecting diagnostics on the listening RPC socket unix:/tmp/dist-test-taskAmo0m4/test-tmp/rpc-test-1030ec6634f44f59b301b4cbc7d594fa.sock every 8 connection(s)
I20260927 14:01:35.069617 18005 acceptor_pool.cc:254] collecting diagnostics on the listening RPC socket unix:/tmp/dist-test-taskAmo0m4/test-tmp/rpc-test-1030ec6634f44f59b301b4cbc7d594fa.sock every 8 connection(s)
W20260927 14:01:35.123230 18001 connection.cc:196] Error closing socket: Network error: TlsSocket::Close: Broken pipe
[       OK ] Parameters/TestRpc.TestCallId/SSL_UnixSocket (87 ms)
[----------] 20 tests from Parameters/TestRpc (39392 ms total)

[----------] Global test environment tear-down
[==========] 21 tests from 2 test suites ran. (42483 ms total)
[  PASSED  ] 20 tests.
[  FAILED  ] 1 test, listed below:
[  FAILED  ] Parameters/TestRpc.TestCallWithChainCertAndRootCA/SSL_UnixSocket, where GetParam() = (true, true)

 1 FAILED TEST
I20260927 14:01:35.150182 17497 logging.cc:424] LogThrottler /data0/somelongdirectorytoavoidrpathissues/src/kudu/src/kudu/rpc/acceptor_pool.cc:285: suppressed but not reported on 3 messages since previous log ~35 seconds ago