Diagnosed failure

Parameters/TestRpc.TestCallWithChainCertAndChainCA/SSL_TCP: /data0/somelongdirectorytoavoidrpathissues/src/kudu/src/kudu/rpc/rpc-test.cc:270: Failure
Failed
Bad status: Runtime error: could not verify certificate chain (error with cert: subject=CN = localhost, ST = sadfjas, C = AS, emailAddress = sdflkdsajf, O = lskdfjlsad, OU = sldfkja, issuer=C = AS, ST = ASDfkjdhf, L = lskdjf, O = saldfja, OU = skdjf, CN = localhost, emailAddress = sadjflkadsj): : certificate has expired
Google Test trace:
/data0/somelongdirectorytoavoidrpathissues/src/kudu/src/kudu/rpc/rpc-test.cc:267: Connecting to 0.0.0.0:38509
I20260927 13:46:23.211272 15876 test_util.cc:175] -----------------------------------------------
I20260927 13:46:23.211385 15876 test_util.cc:176] Had fatal failures, leaving test files at /tmp/dist-test-taskdVs_bd/test-tmp/rpc-test.5.Parameters_TestRpc.TestCallWithChainCertAndChainCA_SSL_TCP.1790516783096800-15876-0

Full log

Note: This is test shard 6 of 8.
[==========] Running 21 tests from 2 test suites.
[----------] Global test environment set-up.
[----------] 20 tests from Parameters/TestRpc
[ RUN      ] Parameters/TestRpc.TestMessengerCreateDestroy/SSL_TCP
WARNING: Logging before InitGoogleLogging() is written to STDERR
I20260927 13:46:23.141054 15876 rpc-test.cc:169] started messenger TestCreateDestroy
[       OK ] Parameters/TestRpc.TestMessengerCreateDestroy/SSL_TCP (27 ms)
[ RUN      ] Parameters/TestRpc.TestNegotiationDeadlock/SSL_TCP
I20260927 13:46:23.158552 15896 acceptor_pool.cc:254] collecting diagnostics on the listening RPC socket 0.0.0.0:38665 every 8 connection(s)
I20260927 13:46:23.158865 15897 acceptor_pool.cc:254] collecting diagnostics on the listening RPC socket 0.0.0.0:38665 every 8 connection(s)
[       OK ] Parameters/TestRpc.TestNegotiationDeadlock/SSL_TCP (40 ms)
[ RUN      ] Parameters/TestRpc.TestCallWithChainCertAndChainCA/SSL_TCP
I20260927 13:46:23.197461 15912 acceptor_pool.cc:254] collecting diagnostics on the listening RPC socket 0.0.0.0:38509 every 8 connection(s)
I20260927 13:46:23.197798 15913 acceptor_pool.cc:254] collecting diagnostics on the listening RPC socket 0.0.0.0:38509 every 8 connection(s)
/data0/somelongdirectorytoavoidrpathissues/src/kudu/src/kudu/rpc/rpc-test.cc:270: Failure
Failed
Bad status: Runtime error: could not verify certificate chain (error with cert: subject=CN = localhost, ST = sadfjas, C = AS, emailAddress = sdflkdsajf, O = lskdfjlsad, OU = sldfkja, issuer=C = AS, ST = ASDfkjdhf, L = lskdjf, O = saldfja, OU = skdjf, CN = localhost, emailAddress = sadjflkadsj): : certificate has expired
Google Test trace:
/data0/somelongdirectorytoavoidrpathissues/src/kudu/src/kudu/rpc/rpc-test.cc:267: Connecting to 0.0.0.0:38509
I20260927 13:46:23.211272 15876 test_util.cc:175] -----------------------------------------------
I20260927 13:46:23.211385 15876 test_util.cc:176] Had fatal failures, leaving test files at /tmp/dist-test-taskdVs_bd/test-tmp/rpc-test.5.Parameters_TestRpc.TestCallWithChainCertAndChainCA_SSL_TCP.1790516783096800-15876-0
[  FAILED  ] Parameters/TestRpc.TestCallWithChainCertAndChainCA/SSL_TCP, where GetParam() = (true, false) (26 ms)
[ RUN      ] Parameters/TestRpc.TestCallWithPasswordProtectedKey/SSL_TCP
I20260927 13:46:23.225175 15937 acceptor_pool.cc:254] collecting diagnostics on the listening RPC socket 0.0.0.0:46557 every 8 connection(s)
I20260927 13:46:23.225435 15938 acceptor_pool.cc:254] collecting diagnostics on the listening RPC socket 0.0.0.0:46557 every 8 connection(s)
[       OK ] Parameters/TestRpc.TestCallWithPasswordProtectedKey/SSL_TCP (56 ms)
[ RUN      ] Parameters/TestRpc.TestCallToBadServer/SSL_TCP
I20260927 13:46:23.311944 15876 rpc-test.cc:394] Status: Network error: Client connection negotiation failed: client connection to 0.0.0.0:0: connect: Connection refused (error 111)
I20260927 13:46:23.313012 15876 rpc-test.cc:394] Status: Network error: Client connection negotiation failed: client connection to 0.0.0.0:0: connect: Connection refused (error 111)
I20260927 13:46:23.313898 15876 rpc-test.cc:394] Status: Network error: Client connection negotiation failed: client connection to 0.0.0.0:0: connect: Connection refused (error 111)
I20260927 13:46:23.314754 15876 rpc-test.cc:394] Status: Network error: Client connection negotiation failed: client connection to 0.0.0.0:0: connect: Connection refused (error 111)
I20260927 13:46:23.315557 15876 rpc-test.cc:394] Status: Network error: Client connection negotiation failed: client connection to 0.0.0.0:0: connect: Connection refused (error 111)
[       OK ] Parameters/TestRpc.TestCallToBadServer/SSL_TCP (50 ms)
[ RUN      ] Parameters/TestRpc.TestWrongService/SSL_TCP
I20260927 13:46:23.340422 15972 acceptor_pool.cc:254] collecting diagnostics on the listening RPC socket 0.0.0.0:44345 every 8 connection(s)
I20260927 13:46:23.340827 15973 acceptor_pool.cc:254] collecting diagnostics on the listening RPC socket 0.0.0.0:44345 every 8 connection(s)
I20260927 13:46:23.363332 15970 messenger.cc:345] service WrongServiceName not registered on TestServer
[       OK ] Parameters/TestRpc.TestWrongService/SSL_TCP (51 ms)
[ RUN      ] Parameters/TestRpc.TestConnectionKeepalive/SSL_TCP
I20260927 13:46:23.386701 15995 acceptor_pool.cc:254] collecting diagnostics on the listening RPC socket 0.0.0.0:42573 every 8 connection(s)
I20260927 13:46:23.387032 15996 acceptor_pool.cc:254] collecting diagnostics on the listening RPC socket 0.0.0.0:42573 every 8 connection(s)
I20260927 13:46:23.387967 15876 rpc-test.cc:488] Connecting to 0.0.0.0:42573
[       OK ] Parameters/TestRpc.TestConnectionKeepalive/SSL_TCP (1054 ms)
[ RUN      ] Parameters/TestRpc.TestClientConnectionMetrics/SSL_TCP
I20260927 13:46:24.463837 16020 acceptor_pool.cc:254] collecting diagnostics on the listening RPC socket 0.0.0.0:38527 every 8 connection(s)
I20260927 13:46:24.464154 16021 acceptor_pool.cc:254] collecting diagnostics on the listening RPC socket 0.0.0.0:38527 every 8 connection(s)
I20260927 13:46:24.465474 15876 rpc-test.cc:569] Connecting to 0.0.0.0:38527
[       OK ] Parameters/TestRpc.TestClientConnectionMetrics/SSL_TCP (21045 ms)
[ RUN      ] Parameters/TestRpc.TestCredentialsPolicy/SSL_TCP
I20260927 13:46:45.497936 16043 acceptor_pool.cc:254] collecting diagnostics on the listening RPC socket 0.0.0.0:43271 every 8 connection(s)
I20260927 13:46:45.498186 16044 acceptor_pool.cc:254] collecting diagnostics on the listening RPC socket 0.0.0.0:43271 every 8 connection(s)
I20260927 13:46:45.499142 15876 rpc-test.cc:700] Connecting to 0.0.0.0:43271
[       OK ] Parameters/TestRpc.TestCredentialsPolicy/SSL_TCP (67 ms)
[ RUN      ] Parameters/TestRpc.TestCallLongerThanKeepalive/SSL_TCP
I20260927 13:46:45.561322 16068 acceptor_pool.cc:254] collecting diagnostics on the listening RPC socket 0.0.0.0:36107 every 8 connection(s)
I20260927 13:46:45.561560 16069 acceptor_pool.cc:254] collecting diagnostics on the listening RPC socket 0.0.0.0:36107 every 8 connection(s)
I20260927 13:46:45.580226 16072 rpc-test-base.h:222] got call: sleep_micros: 3000000 deferred: true
I20260927 13:46:48.582369 16072 rpcz_store.cc:275] Call kudu.rpc.GenericCalculatorService.Sleep from 127.0.0.1:60506 (request call id 0) took 3002 ms. Trace:
I20260927 13:46:48.582598 16072 rpcz_store.cc:276] 0927 13:46:45.580111 (+     0us) service_pool.cc:170] Inserting onto call queue
0927 13:46:45.580178 (+    67us) service_pool.cc:227] Handling call
0927 13:46:48.582290 (+3002112us) inbound_call.cc:173] Queueing success response
Metrics: {}
[       OK ] Parameters/TestRpc.TestCallLongerThanKeepalive/SSL_TCP (3052 ms)
[ RUN      ] Parameters/TestRpc.TestRpcSidecar/SSL_TCP
I20260927 13:46:48.609390 16093 acceptor_pool.cc:254] collecting diagnostics on the listening RPC socket 0.0.0.0:33869 every 8 connection(s)
I20260927 13:46:48.609858 16094 acceptor_pool.cc:254] collecting diagnostics on the listening RPC socket 0.0.0.0:33869 every 8 connection(s)
[       OK ] Parameters/TestRpc.TestRpcSidecar/SSL_TCP (135 ms)
[ RUN      ] Parameters/TestRpc.TestRpcSidecarLimits/SSL_TCP
I20260927 13:46:50.999578 16118 acceptor_pool.cc:254] collecting diagnostics on the listening RPC socket 0.0.0.0:38461 every 8 connection(s)
I20260927 13:46:50.999851 16119 acceptor_pool.cc:254] collecting diagnostics on the listening RPC socket 0.0.0.0:38461 every 8 connection(s)
W20260927 13:46:51.030102 15876 serialization.cc:72] Serialized kudu.rpc_test.PushStringsRequestPB (2147483654 bytes) is larger than the maximum configured RPC message size (52428800 bytes). Sending anyway, but peer may reject the data.
W20260927 13:46:51.036898 16115 connection.cc:535] server connection from 127.0.0.1:47054 recv error: Network error: RPC frame had a length of 2147483714, but we only support messages up to 52428800 bytes long.
W20260927 13:46:51.037200 16115 connection.cc:158] shutting down server connection from 127.0.0.1:47054 with pending inbound data: 4/2147483714 bytes received; last active 0 ns ago: status Network error: RPC frame had a length of 2147483714, but we only support messages up to 52428800 bytes long.
W20260927 13:46:51.037793 16131 connection.cc:196] Error closing socket: Network error: TlsSocket::Close: Connection reset by peer
I20260927 13:46:51.050320 16143 acceptor_pool.cc:254] collecting diagnostics on the listening RPC socket 0.0.0.0:33255 every 8 connection(s)
I20260927 13:46:51.050858 16144 acceptor_pool.cc:254] collecting diagnostics on the listening RPC socket 0.0.0.0:33255 every 8 connection(s)
W20260927 13:46:56.942739 16142 connection.cc:577] server connection from 127.0.0.1:34122: received bad data: 'Corruption: Invalid packet: message had a length of 2147483710, but we only support messages up to 2147483647 bytes
'
[       OK ] Parameters/TestRpc.TestRpcSidecarLimits/SSL_TCP (8705 ms)
[ RUN      ] Parameters/TestRpc.TestCallTimeoutDoesntAffectNegotiation/SSL_TCP
I20260927 13:46:57.454309 16168 acceptor_pool.cc:254] collecting diagnostics on the listening RPC socket 0.0.0.0:44135 every 8 connection(s)
I20260927 13:46:57.454627 16169 acceptor_pool.cc:254] collecting diagnostics on the listening RPC socket 0.0.0.0:44135 every 8 connection(s)
W20260927 13:46:57.467484 16164 negotiation.cc:266] Injecting 500ms delay in negotiation
I20260927 13:46:57.517913 15876 rpc-test-base.h:595] status: Timed out: connection negotiation to 0.0.0.0:44135 for RPC Sleep timed out after 0.050s (ON_OUTBOUND_QUEUE), seconds elapsed: 0.0512607
[       OK ] Parameters/TestRpc.TestCallTimeoutDoesntAffectNegotiation/SSL_TCP (546 ms)
[ RUN      ] Parameters/TestRpc.TestRpcHandlerLatencyMetric/SSL_TCP
I20260927 13:46:57.997561 16193 acceptor_pool.cc:254] collecting diagnostics on the listening RPC socket 0.0.0.0:45093 every 8 connection(s)
I20260927 13:46:57.997828 16194 acceptor_pool.cc:254] collecting diagnostics on the listening RPC socket 0.0.0.0:45093 every 8 connection(s)
I20260927 13:46:58.049835 15876 rpc-test.cc:1236] Sleep() min lat: 20810
I20260927 13:46:58.049945 15876 rpc-test.cc:1237] Sleep() mean lat: 20810
I20260927 13:46:58.050043 15876 rpc-test.cc:1238] Sleep() max lat: 20810
I20260927 13:46:58.050084 15876 rpc-test.cc:1239] Sleep() #calls: 1
[       OK ] Parameters/TestRpc.TestRpcHandlerLatencyMetric/SSL_TCP (77 ms)
[ RUN      ] Parameters/TestRpc.TimedOutOnResponseMetricServiceQueue/SSL_TCP
I20260927 13:46:58.084537 16219 acceptor_pool.cc:254] collecting diagnostics on the listening RPC socket 0.0.0.0:33709 every 8 connection(s)
I20260927 13:46:58.084856 16220 acceptor_pool.cc:254] collecting diagnostics on the listening RPC socket 0.0.0.0:33709 every 8 connection(s)
W20260927 13:46:58.147648 16221 rpcz_store.cc:267] Call kudu.rpc_test.CalculatorService.Sleep from 127.0.0.1:60412 (request call id 2) took 20 ms (client timeout 20 ms). Trace:
W20260927 13:46:58.147840 16221 rpcz_store.cc:269] 0927 13:46:58.127205 (+     0us) service_pool.cc:170] Inserting onto call queue
0927 13:46:58.147566 (+ 20361us) service_pool.cc:214] Skipping call since client already timed out
0927 13:46:58.147624 (+    58us) inbound_call.cc:173] Queueing failure response
Metrics: {}
[       OK ] Parameters/TestRpc.TimedOutOnResponseMetricServiceQueue/SSL_TCP (96 ms)
[ RUN      ] Parameters/TestRpc.RpcPendingConnectionsMetric/SSL_TCP
I20260927 13:46:58.157835 16242 acceptor_pool.cc:254] collecting diagnostics on the listening RPC socket 0.0.0.0:38577 every 8 connection(s)
I20260927 13:46:58.158047 16243 acceptor_pool.cc:254] collecting diagnostics on the listening RPC socket 0.0.0.0:38577 every 8 connection(s)
W20260927 13:46:58.160458 16238 negotiation.cc:337] Failed RPC negotiation. Trace:
0927 13:46:58.159783 (+     0us) reactor.cc:625] Submitting negotiation task for server connection from 127.0.0.1:44720 (local address 127.0.0.1:38577)
0927 13:46:58.159961 (+   178us) server_negotiation.cc:206] Beginning negotiation
0927 13:46:58.159966 (+     5us) server_negotiation.cc:399] Waiting for connection header
0927 13:46:58.160111 (+   145us) negotiation.cc:327] Negotiation complete: Network error: Server connection negotiation failed: server connection from 127.0.0.1:44720: BlockingRecv error: recv got EOF from 127.0.0.1:44720 (error 108)
Metrics: {"server-negotiator.queue_time_us":69}
[       OK ] Parameters/TestRpc.RpcPendingConnectionsMetric/SSL_TCP (21 ms)
[ RUN      ] Parameters/TestRpc.TestRpcContextClientDeadline/SSL_TCP
I20260927 13:46:58.189759 16258 acceptor_pool.cc:254] collecting diagnostics on the listening RPC socket 0.0.0.0:40297 every 8 connection(s)
I20260927 13:46:58.189966 16259 acceptor_pool.cc:254] collecting diagnostics on the listening RPC socket 0.0.0.0:40297 every 8 connection(s)
[       OK ] Parameters/TestRpc.TestRpcContextClientDeadline/SSL_TCP (69 ms)
[ RUN      ] Parameters/TestRpc.TestApplicationFeatureFlagUnsupportedServer/SSL_TCP
I20260927 13:46:58.258128 16283 acceptor_pool.cc:254] collecting diagnostics on the listening RPC socket 0.0.0.0:36217 every 8 connection(s)
I20260927 13:46:58.258481 16284 acceptor_pool.cc:254] collecting diagnostics on the listening RPC socket 0.0.0.0:36217 every 8 connection(s)
[       OK ] Parameters/TestRpc.TestApplicationFeatureFlagUnsupportedServer/SSL_TCP (62 ms)
[ RUN      ] Parameters/TestRpc.TestCancellationAsync/SSL_TCP
I20260927 13:46:58.338670 16308 acceptor_pool.cc:254] collecting diagnostics on the listening RPC socket 0.0.0.0:34027 every 8 connection(s)
I20260927 13:46:58.338961 16309 acceptor_pool.cc:254] collecting diagnostics on the listening RPC socket 0.0.0.0:34027 every 8 connection(s)
I20260927 13:46:58.339897 15876 rpc-test.cc:1716] Connecting to 0.0.0.0:34027
I20260927 13:46:58.369585 15876 test_util.cc:268] Using random seed: 787242001
I20260927 13:46:58.408095 16312 rpc-test-base.h:240] got call: sleep_micros: 500 pattern: 4294967295 num_repetitions: 2097152 sidecar_idx: 0
I20260927 13:46:58.435278 16311 rpc-test-base.h:240] got call: sleep_micros: 500 pattern: 4294967295 num_repetitions: 2097152 sidecar_idx: 0
I20260927 13:46:58.462212 16310 rpc-test-base.h:240] got call: sleep_micros: 500 pattern: 4294967295 num_repetitions: 2097152 sidecar_idx: 0
I20260927 13:46:58.493726 16312 rpc-test-base.h:240] got call: sleep_micros: 500 pattern: 4294967295 num_repetitions: 2097152 sidecar_idx: 0
I20260927 13:46:58.532066 16310 rpc-test-base.h:240] got call: sleep_micros: 500 pattern: 4294967295 num_repetitions: 2097152 sidecar_idx: 0
I20260927 13:46:58.557844 16312 rpc-test-base.h:240] got call: sleep_micros: 500 pattern: 4294967295 num_repetitions: 2097152 sidecar_idx: 0
W20260927 13:46:58.584355 16307 connection.cc:196] Error closing socket: Network error: TlsSocket::Close: Broken pipe
W20260927 13:46:58.585203 16307 connection.cc:441] server connection from 127.0.0.1:55866 torn down before Call kudu.rpc.GenericCalculatorService.SleepWithSidecar from 127.0.0.1:55866 (request call id 7) could send its response
W20260927 13:46:58.598918 16307 connection.cc:441] server connection from 127.0.0.1:55866 torn down before Call kudu.rpc.GenericCalculatorService.SleepWithSidecar from 127.0.0.1:55866 (request call id 8) could send its response
[       OK ] Parameters/TestRpc.TestCancellationAsync/SSL_TCP (297 ms)
[ RUN      ] Parameters/TestRpc.TestPerformanceBySocketType/SSL_TCP
I20260927 13:46:58.622151 16333 acceptor_pool.cc:254] collecting diagnostics on the listening RPC socket 0.0.0.0:41501 every 8 connection(s)
I20260927 13:46:58.622401 16334 acceptor_pool.cc:254] collecting diagnostics on the listening RPC socket 0.0.0.0:41501 every 8 connection(s)
I20260927 13:46:58.623324 15876 rpc-test.cc:1846] Connecting to 0.0.0.0:41501
I20260927 13:47:01.962509 15876 rpc-test.cc:1859] Sending 1024MB via ssl-enabled tcp socket: real 3.300s	user 3.120s	sys 2.348s
I20260927 13:47:05.483199 15876 rpc-test.cc:1859] Sending 1024MB via ssl-enabled tcp socket: real 3.521s	user 3.180s	sys 2.649s
I20260927 13:47:08.756546 15876 rpc-test.cc:1859] Sending 1024MB via ssl-enabled tcp socket: real 3.273s	user 3.128s	sys 2.302s
I20260927 13:47:12.010911 15876 rpc-test.cc:1859] Sending 1024MB via ssl-enabled tcp socket: real 3.254s	user 2.978s	sys 2.451s
I20260927 13:47:15.231789 15876 rpc-test.cc:1859] Sending 1024MB via ssl-enabled tcp socket: real 3.221s	user 2.835s	sys 2.480s
[       OK ] Parameters/TestRpc.TestPerformanceBySocketType/SSL_TCP (16638 ms)
[----------] 20 tests from Parameters/TestRpc (52124 ms total)

[----------] 1 test from Parameters/TestRpcSocketTxRxQueue
[ RUN      ] Parameters/TestRpcSocketTxRxQueue.OverCapacity/0
W20260927 13:47:15.552399 16386 negotiation.cc:337] Failed RPC negotiation. Trace:
0927 13:47:15.266499 (+     0us) reactor.cc:625] Submitting negotiation task for client connection to 0.0.0.0:40041 (local address 127.0.0.1:57000)
0927 13:47:15.266681 (+   182us) negotiation.cc:107] Waiting for socket to connect
0927 13:47:15.266707 (+    26us) client_negotiation.cc:174] Beginning negotiation
0927 13:47:15.266806 (+    99us) client_negotiation.cc:252] Sending NEGOTIATE NegotiatePB request
0927 13:47:15.552008 (+285202us) negotiation.cc:327] Negotiation complete: Network error: Client connection negotiation failed: client connection to 0.0.0.0:40041: BlockingRecv error: recv error from unknown peer: Transport endpoint is not connected (error 107)
Metrics: {"client-negotiator.queue_time_us":68}
W20260927 13:47:15.552611 16368 negotiation.cc:337] Failed RPC negotiation. Trace:
0927 13:47:15.259480 (+     0us) reactor.cc:625] Submitting negotiation task for client connection to 0.0.0.0:40041 (local address 127.0.0.1:56972)
0927 13:47:15.259667 (+   187us) negotiation.cc:107] Waiting for socket to connect
0927 13:47:15.259695 (+    28us) client_negotiation.cc:174] Beginning negotiation
0927 13:47:15.259789 (+    94us) client_negotiation.cc:252] Sending NEGOTIATE NegotiatePB request
0927 13:47:15.551827 (+292038us) negotiation.cc:327] Negotiation complete: Network error: Client connection negotiation failed: client connection to 0.0.0.0:40041: BlockingRecv error: recv error from unknown peer: Transport endpoint is not connected (error 107)
Metrics: {"client-negotiator.queue_time_us":64}
W20260927 13:47:15.553418 16350 negotiation.cc:337] Failed RPC negotiation. Trace:
0927 13:47:15.253314 (+     0us) reactor.cc:625] Submitting negotiation task for client connection to 0.0.0.0:40041 (local address 127.0.0.1:56954)
0927 13:47:15.253614 (+   300us) negotiation.cc:107] Waiting for socket to connect
0927 13:47:15.253633 (+    19us) client_negotiation.cc:174] Beginning negotiation
0927 13:47:15.253761 (+   128us) client_negotiation.cc:252] Sending NEGOTIATE NegotiatePB request
0927 13:47:15.551721 (+297960us) negotiation.cc:327] Negotiation complete: Network error: Client connection negotiation failed: client connection to 0.0.0.0:40041: BlockingRecv error: recv error from unknown peer: Transport endpoint is not connected (error 107)
Metrics: {"client-negotiator.queue_time_us":128}
W20260927 13:47:15.553689 16377 negotiation.cc:337] Failed RPC negotiation. Trace:
0927 13:47:15.262508 (+     0us) reactor.cc:625] Submitting negotiation task for client connection to 0.0.0.0:40041 (local address 127.0.0.1:56986)
0927 13:47:15.262691 (+   183us) negotiation.cc:107] Waiting for socket to connect
0927 13:47:15.262709 (+    18us) client_negotiation.cc:174] Beginning negotiation
0927 13:47:15.262810 (+   101us) client_negotiation.cc:252] Sending NEGOTIATE NegotiatePB request
0927 13:47:15.551721 (+288911us) negotiation.cc:327] Negotiation complete: Network error: Client connection negotiation failed: client connection to 0.0.0.0:40041: BlockingRecv error: recv error from unknown peer: Transport endpoint is not connected (error 107)
Metrics: {"client-negotiator.queue_time_us":67}
W20260927 13:47:15.555354 16395 negotiation.cc:337] Failed RPC negotiation. Trace:
0927 13:47:15.269329 (+     0us) reactor.cc:625] Submitting negotiation task for client connection to 0.0.0.0:40041 (local address 127.0.0.1:57014)
0927 13:47:15.269576 (+   247us) negotiation.cc:107] Waiting for socket to connect
0927 13:47:15.269591 (+    15us) client_negotiation.cc:174] Beginning negotiation
0927 13:47:15.269678 (+    87us) client_negotiation.cc:252] Sending NEGOTIATE NegotiatePB request
0927 13:47:15.553930 (+284252us) negotiation.cc:327] Negotiation complete: Network error: Client connection negotiation failed: client connection to 0.0.0.0:40041: BlockingRecv error: recv error from unknown peer: Transport endpoint is not connected (error 107)
Metrics: {"client-negotiator.queue_time_us":59}
W20260927 13:47:15.555401 16359 negotiation.cc:337] Failed RPC negotiation. Trace:
0927 13:47:15.256611 (+     0us) reactor.cc:625] Submitting negotiation task for client connection to 0.0.0.0:40041 (local address 127.0.0.1:56964)
0927 13:47:15.256805 (+   194us) negotiation.cc:107] Waiting for socket to connect
0927 13:47:15.256822 (+    17us) client_negotiation.cc:174] Beginning negotiation
0927 13:47:15.256930 (+   108us) client_negotiation.cc:252] Sending NEGOTIATE NegotiatePB request
0927 13:47:15.551721 (+294791us) negotiation.cc:327] Negotiation complete: Network error: Client connection negotiation failed: client connection to 0.0.0.0:40041: BlockingRecv error: recv error from unknown peer: Transport endpoint is not connected (error 107)
Metrics: {"client-negotiator.queue_time_us":53}
[       OK ] Parameters/TestRpcSocketTxRxQueue.OverCapacity/0 (1086 ms)
[----------] 1 test from Parameters/TestRpcSocketTxRxQueue (1086 ms total)

[----------] Global test environment tear-down
[==========] 21 tests from 2 test suites ran. (53210 ms total)
[  PASSED  ] 20 tests.
[  FAILED  ] 1 test, listed below:
[  FAILED  ] Parameters/TestRpc.TestCallWithChainCertAndChainCA/SSL_TCP, where GetParam() = (true, false)

 1 FAILED TEST