Diagnosed failure
Parameters/TestRpc.TestCallWithChainCertAndChainCA/SSL_TCP: /data0/somelongdirectorytoavoidrpathissues/src/kudu/src/kudu/rpc/rpc-test.cc:270: Failure
Failed
Bad status: Runtime error: could not verify certificate chain (error with cert: subject=CN = localhost, ST = sadfjas, C = AS, emailAddress = sdflkdsajf, O = lskdfjlsad, OU = sldfkja, issuer=C = AS, ST = ASDfkjdhf, L = lskdjf, O = saldfja, OU = skdjf, CN = localhost, emailAddress = sadjflkadsj): : certificate has expired
Google Test trace:
/data0/somelongdirectorytoavoidrpathissues/src/kudu/src/kudu/rpc/rpc-test.cc:267: Connecting to 0.0.0.0:35625
I20260927 22:50:28.642279 5223 test_util.cc:175] -----------------------------------------------
I20260927 22:50:28.642397 5223 test_util.cc:176] Had fatal failures, leaving test files at /tmp/dist-test-taskw9F_fr/test-tmp/rpc-test.5.Parameters_TestRpc.TestCallWithChainCertAndChainCA_SSL_TCP.1790549428496123-5223-0
Full log
Note: This is test shard 6 of 8.
[==========] Running 21 tests from 2 test suites.
[----------] Global test environment set-up.
[----------] 20 tests from Parameters/TestRpc
[ RUN ] Parameters/TestRpc.TestMessengerCreateDestroy/SSL_TCP
WARNING: Logging before InitGoogleLogging() is written to STDERR
I20260927 22:50:28.564030 5223 rpc-test.cc:169] started messenger TestCreateDestroy
[ OK ] Parameters/TestRpc.TestMessengerCreateDestroy/SSL_TCP (52 ms)
[ RUN ] Parameters/TestRpc.TestNegotiationDeadlock/SSL_TCP
I20260927 22:50:28.594288 5243 acceptor_pool.cc:254] collecting diagnostics on the listening RPC socket 0.0.0.0:37547 every 8 connection(s)
I20260927 22:50:28.594525 5244 acceptor_pool.cc:254] collecting diagnostics on the listening RPC socket 0.0.0.0:37547 every 8 connection(s)
[ OK ] Parameters/TestRpc.TestNegotiationDeadlock/SSL_TCP (47 ms)
[ RUN ] Parameters/TestRpc.TestCallWithChainCertAndChainCA/SSL_TCP
I20260927 22:50:28.631116 5259 acceptor_pool.cc:254] collecting diagnostics on the listening RPC socket 0.0.0.0:35625 every 8 connection(s)
I20260927 22:50:28.631481 5260 acceptor_pool.cc:254] collecting diagnostics on the listening RPC socket 0.0.0.0:35625 every 8 connection(s)
/data0/somelongdirectorytoavoidrpathissues/src/kudu/src/kudu/rpc/rpc-test.cc:270: Failure
Failed
Bad status: Runtime error: could not verify certificate chain (error with cert: subject=CN = localhost, ST = sadfjas, C = AS, emailAddress = sdflkdsajf, O = lskdfjlsad, OU = sldfkja, issuer=C = AS, ST = ASDfkjdhf, L = lskdjf, O = saldfja, OU = skdjf, CN = localhost, emailAddress = sadjflkadsj): : certificate has expired
Google Test trace:
/data0/somelongdirectorytoavoidrpathissues/src/kudu/src/kudu/rpc/rpc-test.cc:267: Connecting to 0.0.0.0:35625
I20260927 22:50:28.642279 5223 test_util.cc:175] -----------------------------------------------
I20260927 22:50:28.642397 5223 test_util.cc:176] Had fatal failures, leaving test files at /tmp/dist-test-taskw9F_fr/test-tmp/rpc-test.5.Parameters_TestRpc.TestCallWithChainCertAndChainCA_SSL_TCP.1790549428496123-5223-0
[ FAILED ] Parameters/TestRpc.TestCallWithChainCertAndChainCA/SSL_TCP, where GetParam() = (true, false) (27 ms)
[ RUN ] Parameters/TestRpc.TestCallWithPasswordProtectedKey/SSL_TCP
I20260927 22:50:28.675186 5284 acceptor_pool.cc:254] collecting diagnostics on the listening RPC socket 0.0.0.0:43237 every 8 connection(s)
I20260927 22:50:28.675442 5285 acceptor_pool.cc:254] collecting diagnostics on the listening RPC socket 0.0.0.0:43237 every 8 connection(s)
[ OK ] Parameters/TestRpc.TestCallWithPasswordProtectedKey/SSL_TCP (68 ms)
[ RUN ] Parameters/TestRpc.TestCallToBadServer/SSL_TCP
I20260927 22:50:28.723798 5223 rpc-test.cc:394] Status: Network error: Client connection negotiation failed: client connection to 0.0.0.0:0: connect: Connection refused (error 111)
I20260927 22:50:28.724602 5223 rpc-test.cc:394] Status: Network error: Client connection negotiation failed: client connection to 0.0.0.0:0: connect: Connection refused (error 111)
I20260927 22:50:28.725262 5223 rpc-test.cc:394] Status: Network error: Client connection negotiation failed: client connection to 0.0.0.0:0: connect: Connection refused (error 111)
I20260927 22:50:28.725966 5223 rpc-test.cc:394] Status: Network error: Client connection negotiation failed: client connection to 0.0.0.0:0: connect: Connection refused (error 111)
I20260927 22:50:28.726598 5223 rpc-test.cc:394] Status: Network error: Client connection negotiation failed: client connection to 0.0.0.0:0: connect: Connection refused (error 111)
[ OK ] Parameters/TestRpc.TestCallToBadServer/SSL_TCP (17 ms)
[ RUN ] Parameters/TestRpc.TestWrongService/SSL_TCP
I20260927 22:50:28.739593 5319 acceptor_pool.cc:254] collecting diagnostics on the listening RPC socket 0.0.0.0:33323 every 8 connection(s)
I20260927 22:50:28.739851 5320 acceptor_pool.cc:254] collecting diagnostics on the listening RPC socket 0.0.0.0:33323 every 8 connection(s)
I20260927 22:50:28.759588 5317 messenger.cc:345] service WrongServiceName not registered on TestServer
[ OK ] Parameters/TestRpc.TestWrongService/SSL_TCP (36 ms)
[ RUN ] Parameters/TestRpc.TestConnectionKeepalive/SSL_TCP
I20260927 22:50:28.791209 5342 acceptor_pool.cc:254] collecting diagnostics on the listening RPC socket 0.0.0.0:39975 every 8 connection(s)
I20260927 22:50:28.791519 5343 acceptor_pool.cc:254] collecting diagnostics on the listening RPC socket 0.0.0.0:39975 every 8 connection(s)
I20260927 22:50:28.792454 5223 rpc-test.cc:488] Connecting to 0.0.0.0:39975
[ OK ] Parameters/TestRpc.TestConnectionKeepalive/SSL_TCP (1058 ms)
[ RUN ] Parameters/TestRpc.TestClientConnectionMetrics/SSL_TCP
I20260927 22:50:29.839041 5367 acceptor_pool.cc:254] collecting diagnostics on the listening RPC socket 0.0.0.0:39557 every 8 connection(s)
I20260927 22:50:29.839396 5368 acceptor_pool.cc:254] collecting diagnostics on the listening RPC socket 0.0.0.0:39557 every 8 connection(s)
I20260927 22:50:29.840302 5223 rpc-test.cc:569] Connecting to 0.0.0.0:39557
[ OK ] Parameters/TestRpc.TestClientConnectionMetrics/SSL_TCP (19674 ms)
[ RUN ] Parameters/TestRpc.TestCredentialsPolicy/SSL_TCP
I20260927 22:50:49.517511 5390 acceptor_pool.cc:254] collecting diagnostics on the listening RPC socket 0.0.0.0:38371 every 8 connection(s)
I20260927 22:50:49.517748 5391 acceptor_pool.cc:254] collecting diagnostics on the listening RPC socket 0.0.0.0:38371 every 8 connection(s)
I20260927 22:50:49.518770 5223 rpc-test.cc:700] Connecting to 0.0.0.0:38371
[ OK ] Parameters/TestRpc.TestCredentialsPolicy/SSL_TCP (57 ms)
[ RUN ] Parameters/TestRpc.TestCallLongerThanKeepalive/SSL_TCP
I20260927 22:50:49.577122 5415 acceptor_pool.cc:254] collecting diagnostics on the listening RPC socket 0.0.0.0:36401 every 8 connection(s)
I20260927 22:50:49.577345 5416 acceptor_pool.cc:254] collecting diagnostics on the listening RPC socket 0.0.0.0:36401 every 8 connection(s)
I20260927 22:50:49.605016 5419 rpc-test-base.h:222] got call: sleep_micros: 3000000 deferred: true
I20260927 22:50:52.606884 5419 rpcz_store.cc:275] Call kudu.rpc.GenericCalculatorService.Sleep from 127.0.0.1:58976 (request call id 0) took 3002 ms. Trace:
I20260927 22:50:52.607074 5419 rpcz_store.cc:276] 0927 22:50:49.604886 (+ 0us) service_pool.cc:170] Inserting onto call queue
0927 22:50:49.604957 (+ 71us) service_pool.cc:227] Handling call
0927 22:50:52.606840 (+3001883us) inbound_call.cc:173] Queueing success response
Metrics: {}
[ OK ] Parameters/TestRpc.TestCallLongerThanKeepalive/SSL_TCP (3057 ms)
[ RUN ] Parameters/TestRpc.TestRpcSidecar/SSL_TCP
I20260927 22:50:52.627822 5440 acceptor_pool.cc:254] collecting diagnostics on the listening RPC socket 0.0.0.0:46493 every 8 connection(s)
I20260927 22:50:52.628041 5441 acceptor_pool.cc:254] collecting diagnostics on the listening RPC socket 0.0.0.0:46493 every 8 connection(s)
[ OK ] Parameters/TestRpc.TestRpcSidecar/SSL_TCP (119 ms)
[ RUN ] Parameters/TestRpc.TestRpcSidecarLimits/SSL_TCP
I20260927 22:50:54.872601 5465 acceptor_pool.cc:254] collecting diagnostics on the listening RPC socket 0.0.0.0:35473 every 8 connection(s)
I20260927 22:50:54.872931 5466 acceptor_pool.cc:254] collecting diagnostics on the listening RPC socket 0.0.0.0:35473 every 8 connection(s)
W20260927 22:50:54.913116 5223 serialization.cc:72] Serialized kudu.rpc_test.PushStringsRequestPB (2147483654 bytes) is larger than the maximum configured RPC message size (52428800 bytes). Sending anyway, but peer may reject the data.
W20260927 22:50:54.919874 5463 connection.cc:535] server connection from 127.0.0.1:45498 recv error: Network error: RPC frame had a length of 2147483714, but we only support messages up to 52428800 bytes long.
W20260927 22:50:54.919996 5463 connection.cc:158] shutting down server connection from 127.0.0.1:45498 with pending inbound data: 4/2147483714 bytes received; last active 0 ns ago: status Network error: RPC frame had a length of 2147483714, but we only support messages up to 52428800 bytes long.
W20260927 22:50:54.920522 5478 connection.cc:196] Error closing socket: Network error: TlsSocket::Close: Connection reset by peer
I20260927 22:50:54.939072 5490 acceptor_pool.cc:254] collecting diagnostics on the listening RPC socket 0.0.0.0:36665 every 8 connection(s)
I20260927 22:50:54.939586 5491 acceptor_pool.cc:254] collecting diagnostics on the listening RPC socket 0.0.0.0:36665 every 8 connection(s)
W20260927 22:50:59.982290 5487 connection.cc:577] server connection from 127.0.0.1:46156: received bad data: 'Corruption: Invalid packet: message had a length of 2147483710, but we only support messages up to 2147483647 bytes
'
[ OK ] Parameters/TestRpc.TestRpcSidecarLimits/SSL_TCP (7721 ms)
[ RUN ] Parameters/TestRpc.TestCallTimeoutDoesntAffectNegotiation/SSL_TCP
I20260927 22:51:00.480020 5515 acceptor_pool.cc:254] collecting diagnostics on the listening RPC socket 0.0.0.0:41307 every 8 connection(s)
I20260927 22:51:00.480327 5516 acceptor_pool.cc:254] collecting diagnostics on the listening RPC socket 0.0.0.0:41307 every 8 connection(s)
W20260927 22:51:00.520295 5511 negotiation.cc:266] Injecting 500ms delay in negotiation
I20260927 22:51:00.570693 5223 rpc-test-base.h:595] status: Timed out: connection negotiation to 0.0.0.0:41307 for RPC Sleep timed out after 0.050s (ON_OUTBOUND_QUEUE), seconds elapsed: 0.0511464
[ OK ] Parameters/TestRpc.TestCallTimeoutDoesntAffectNegotiation/SSL_TCP (581 ms)
[ RUN ] Parameters/TestRpc.TestRpcHandlerLatencyMetric/SSL_TCP
I20260927 22:51:01.054006 5540 acceptor_pool.cc:254] collecting diagnostics on the listening RPC socket 0.0.0.0:42151 every 8 connection(s)
I20260927 22:51:01.054412 5541 acceptor_pool.cc:254] collecting diagnostics on the listening RPC socket 0.0.0.0:42151 every 8 connection(s)
I20260927 22:51:01.099020 5223 rpc-test.cc:1236] Sleep() min lat: 20714
I20260927 22:51:01.099128 5223 rpc-test.cc:1237] Sleep() mean lat: 20714
I20260927 22:51:01.099184 5223 rpc-test.cc:1238] Sleep() max lat: 20714
I20260927 22:51:01.099216 5223 rpc-test.cc:1239] Sleep() #calls: 1
[ OK ] Parameters/TestRpc.TestRpcHandlerLatencyMetric/SSL_TCP (67 ms)
[ RUN ] Parameters/TestRpc.TimedOutOnResponseMetricServiceQueue/SSL_TCP
I20260927 22:51:01.124181 5566 acceptor_pool.cc:254] collecting diagnostics on the listening RPC socket 0.0.0.0:36781 every 8 connection(s)
I20260927 22:51:01.124400 5567 acceptor_pool.cc:254] collecting diagnostics on the listening RPC socket 0.0.0.0:36781 every 8 connection(s)
W20260927 22:51:01.203246 5568 rpcz_store.cc:267] Call kudu.rpc_test.CalculatorService.Sleep from 127.0.0.1:59396 (request call id 2) took 20 ms (client timeout 20 ms). Trace:
W20260927 22:51:01.203469 5568 rpcz_store.cc:269] 0927 22:51:01.182681 (+ 0us) service_pool.cc:170] Inserting onto call queue
0927 22:51:01.203042 (+ 20361us) service_pool.cc:214] Skipping call since client already timed out
0927 22:51:01.203149 (+ 107us) inbound_call.cc:173] Queueing failure response
Metrics: {}
[ OK ] Parameters/TestRpc.TimedOutOnResponseMetricServiceQueue/SSL_TCP (103 ms)
[ RUN ] Parameters/TestRpc.RpcPendingConnectionsMetric/SSL_TCP
I20260927 22:51:01.213074 5589 acceptor_pool.cc:254] collecting diagnostics on the listening RPC socket 0.0.0.0:34463 every 8 connection(s)
I20260927 22:51:01.213308 5590 acceptor_pool.cc:254] collecting diagnostics on the listening RPC socket 0.0.0.0:34463 every 8 connection(s)
W20260927 22:51:01.215538 5585 negotiation.cc:337] Failed RPC negotiation. Trace:
0927 22:51:01.214871 (+ 0us) reactor.cc:625] Submitting negotiation task for server connection from 127.0.0.1:60354 (local address 127.0.0.1:34463)
0927 22:51:01.215030 (+ 159us) server_negotiation.cc:206] Beginning negotiation
0927 22:51:01.215034 (+ 4us) server_negotiation.cc:399] Waiting for connection header
0927 22:51:01.215159 (+ 125us) negotiation.cc:327] Negotiation complete: Network error: Server connection negotiation failed: server connection from 127.0.0.1:60354: BlockingRecv error: recv got EOF from 127.0.0.1:60354 (error 108)
Metrics: {"server-negotiator.queue_time_us":50}
[ OK ] Parameters/TestRpc.RpcPendingConnectionsMetric/SSL_TCP (20 ms)
[ RUN ] Parameters/TestRpc.TestRpcContextClientDeadline/SSL_TCP
I20260927 22:51:01.243268 5605 acceptor_pool.cc:254] collecting diagnostics on the listening RPC socket 0.0.0.0:41681 every 8 connection(s)
I20260927 22:51:01.243541 5606 acceptor_pool.cc:254] collecting diagnostics on the listening RPC socket 0.0.0.0:41681 every 8 connection(s)
[ OK ] Parameters/TestRpc.TestRpcContextClientDeadline/SSL_TCP (73 ms)
[ RUN ] Parameters/TestRpc.TestApplicationFeatureFlagUnsupportedServer/SSL_TCP
I20260927 22:51:01.315156 5630 acceptor_pool.cc:254] collecting diagnostics on the listening RPC socket 0.0.0.0:37623 every 8 connection(s)
I20260927 22:51:01.315449 5631 acceptor_pool.cc:254] collecting diagnostics on the listening RPC socket 0.0.0.0:37623 every 8 connection(s)
[ OK ] Parameters/TestRpc.TestApplicationFeatureFlagUnsupportedServer/SSL_TCP (37 ms)
[ RUN ] Parameters/TestRpc.TestCancellationAsync/SSL_TCP
I20260927 22:51:01.362807 5655 acceptor_pool.cc:254] collecting diagnostics on the listening RPC socket 0.0.0.0:45315 every 8 connection(s)
I20260927 22:51:01.363040 5656 acceptor_pool.cc:254] collecting diagnostics on the listening RPC socket 0.0.0.0:45315 every 8 connection(s)
I20260927 22:51:01.364220 5223 rpc-test.cc:1716] Connecting to 0.0.0.0:45315
I20260927 22:51:01.373994 5223 test_util.cc:268] Using random seed: -929491955
I20260927 22:51:01.408572 5659 rpc-test-base.h:240] got call: sleep_micros: 500 pattern: 4294967295 num_repetitions: 2097152 sidecar_idx: 0
I20260927 22:51:01.428610 5658 rpc-test-base.h:240] got call: sleep_micros: 500 pattern: 4294967295 num_repetitions: 2097152 sidecar_idx: 0
I20260927 22:51:01.453856 5657 rpc-test-base.h:240] got call: sleep_micros: 500 pattern: 4294967295 num_repetitions: 2097152 sidecar_idx: 0
I20260927 22:51:01.490278 5659 rpc-test-base.h:240] got call: sleep_micros: 500 pattern: 4294967295 num_repetitions: 2097152 sidecar_idx: 0
I20260927 22:51:01.516131 5657 rpc-test-base.h:240] got call: sleep_micros: 500 pattern: 4294967295 num_repetitions: 2097152 sidecar_idx: 0
I20260927 22:51:01.541410 5658 rpc-test-base.h:240] got call: sleep_micros: 500 pattern: 4294967295 num_repetitions: 2097152 sidecar_idx: 0
W20260927 22:51:01.574640 5654 connection.cc:698] server connection from 127.0.0.1:33350 send error: Network error: failed to write to TLS socket: Broken pipe
W20260927 22:51:01.574829 5654 connection.cc:441] server connection from 127.0.0.1:33350 torn down before Call kudu.rpc.GenericCalculatorService.SleepWithSidecar from 127.0.0.1:33350 (request call id 9) could send its response
W20260927 22:51:01.575145 5654 connection.cc:196] Error closing socket: Network error: TlsSocket::Close: Success
W20260927 22:51:01.588086 5654 connection.cc:441] server connection from 127.0.0.1:33350 torn down before Call kudu.rpc.GenericCalculatorService.SleepWithSidecar from 127.0.0.1:33350 (request call id 8) could send its response
[ OK ] Parameters/TestRpc.TestCancellationAsync/SSL_TCP (252 ms)
[ RUN ] Parameters/TestRpc.TestPerformanceBySocketType/SSL_TCP
I20260927 22:51:01.608085 5680 acceptor_pool.cc:254] collecting diagnostics on the listening RPC socket 0.0.0.0:43483 every 8 connection(s)
I20260927 22:51:01.608345 5681 acceptor_pool.cc:254] collecting diagnostics on the listening RPC socket 0.0.0.0:43483 every 8 connection(s)
I20260927 22:51:01.609297 5223 rpc-test.cc:1846] Connecting to 0.0.0.0:43483
I20260927 22:51:04.558717 5223 rpc-test.cc:1859] Sending 1024MB via ssl-enabled tcp socket: real 2.933s user 2.795s sys 2.062s
I20260927 22:51:07.468535 5223 rpc-test.cc:1859] Sending 1024MB via ssl-enabled tcp socket: real 2.910s user 2.641s sys 2.191s
I20260927 22:51:10.396781 5223 rpc-test.cc:1859] Sending 1024MB via ssl-enabled tcp socket: real 2.928s user 2.572s sys 2.239s
I20260927 22:51:13.382481 5223 rpc-test.cc:1859] Sending 1024MB via ssl-enabled tcp socket: real 2.986s user 2.750s sys 2.175s
I20260927 22:51:16.313117 5223 rpc-test.cc:1859] Sending 1024MB via ssl-enabled tcp socket: real 2.930s user 2.537s sys 2.302s
[ OK ] Parameters/TestRpc.TestPerformanceBySocketType/SSL_TCP (14731 ms)
[----------] 20 tests from Parameters/TestRpc (47808 ms total)
[----------] 1 test from Parameters/TestRpcSocketTxRxQueue
[ RUN ] Parameters/TestRpcSocketTxRxQueue.OverCapacity/0
W20260927 22:51:16.628916 5697 negotiation.cc:337] Failed RPC negotiation. Trace:
0927 22:51:16.334726 (+ 0us) reactor.cc:625] Submitting negotiation task for client connection to 0.0.0.0:40923 (local address 127.0.0.1:58816)
0927 22:51:16.334929 (+ 203us) negotiation.cc:107] Waiting for socket to connect
0927 22:51:16.334949 (+ 20us) client_negotiation.cc:174] Beginning negotiation
0927 22:51:16.335076 (+ 127us) client_negotiation.cc:252] Sending NEGOTIATE NegotiatePB request
0927 22:51:16.627725 (+292649us) negotiation.cc:327] Negotiation complete: Network error: Client connection negotiation failed: client connection to 0.0.0.0:40923: BlockingRecv error: recv error from unknown peer: Transport endpoint is not connected (error 107)
Metrics: {"client-negotiator.queue_time_us":61}
W20260927 22:51:16.629087 5733 negotiation.cc:337] Failed RPC negotiation. Trace:
0927 22:51:16.346221 (+ 0us) reactor.cc:625] Submitting negotiation task for client connection to 0.0.0.0:40923 (local address 127.0.0.1:58840)
0927 22:51:16.346480 (+ 259us) negotiation.cc:107] Waiting for socket to connect
0927 22:51:16.346498 (+ 18us) client_negotiation.cc:174] Beginning negotiation
0927 22:51:16.346609 (+ 111us) client_negotiation.cc:252] Sending NEGOTIATE NegotiatePB request
0927 22:51:16.628269 (+281660us) negotiation.cc:327] Negotiation complete: Network error: Client connection negotiation failed: client connection to 0.0.0.0:40923: BlockingRecv error: recv error from unknown peer: Transport endpoint is not connected (error 107)
Metrics: {"client-negotiator.queue_time_us":98}
W20260927 22:51:16.628846 5715 negotiation.cc:337] Failed RPC negotiation. Trace:
0927 22:51:16.340953 (+ 0us) reactor.cc:625] Submitting negotiation task for client connection to 0.0.0.0:40923 (local address 127.0.0.1:58822)
0927 22:51:16.341129 (+ 176us) negotiation.cc:107] Waiting for socket to connect
0927 22:51:16.341143 (+ 14us) client_negotiation.cc:174] Beginning negotiation
0927 22:51:16.341229 (+ 86us) client_negotiation.cc:252] Sending NEGOTIATE NegotiatePB request
0927 22:51:16.627725 (+286496us) negotiation.cc:327] Negotiation complete: Network error: Client connection negotiation failed: client connection to 0.0.0.0:40923: BlockingRecv error: recv error from unknown peer: Transport endpoint is not connected (error 107)
Metrics: {"client-negotiator.queue_time_us":74}
W20260927 22:51:16.628899 5742 negotiation.cc:337] Failed RPC negotiation. Trace:
0927 22:51:16.349047 (+ 0us) reactor.cc:625] Submitting negotiation task for client connection to 0.0.0.0:40923 (local address 127.0.0.1:58856)
0927 22:51:16.349232 (+ 185us) negotiation.cc:107] Waiting for socket to connect
0927 22:51:16.349248 (+ 16us) client_negotiation.cc:174] Beginning negotiation
0927 22:51:16.349338 (+ 90us) client_negotiation.cc:252] Sending NEGOTIATE NegotiatePB request
0927 22:51:16.628202 (+278864us) negotiation.cc:327] Negotiation complete: Network error: Client connection negotiation failed: client connection to 0.0.0.0:40923: BlockingRecv error: recv error from unknown peer: Transport endpoint is not connected (error 107)
Metrics: {"client-negotiator.queue_time_us":53}
W20260927 22:51:16.629886 5706 negotiation.cc:337] Failed RPC negotiation. Trace:
0927 22:51:16.337852 (+ 0us) reactor.cc:625] Submitting negotiation task for client connection to 0.0.0.0:40923 (local address 127.0.0.1:58820)
0927 22:51:16.338045 (+ 193us) negotiation.cc:107] Waiting for socket to connect
0927 22:51:16.338064 (+ 19us) client_negotiation.cc:174] Beginning negotiation
0927 22:51:16.338156 (+ 92us) client_negotiation.cc:252] Sending NEGOTIATE NegotiatePB request
0927 22:51:16.627726 (+289570us) negotiation.cc:327] Negotiation complete: Network error: Client connection negotiation failed: client connection to 0.0.0.0:40923: BlockingRecv error: recv error from unknown peer: Transport endpoint is not connected (error 107)
Metrics: {"client-negotiator.queue_time_us":62}
W20260927 22:51:16.630146 5724 negotiation.cc:337] Failed RPC negotiation. Trace:
0927 22:51:16.343475 (+ 0us) reactor.cc:625] Submitting negotiation task for client connection to 0.0.0.0:40923 (local address 127.0.0.1:58838)
0927 22:51:16.343600 (+ 125us) negotiation.cc:107] Waiting for socket to connect
0927 22:51:16.343635 (+ 35us) client_negotiation.cc:174] Beginning negotiation
0927 22:51:16.343745 (+ 110us) client_negotiation.cc:252] Sending NEGOTIATE NegotiatePB request
0927 22:51:16.628730 (+284985us) negotiation.cc:327] Negotiation complete: Network error: Client connection negotiation failed: client connection to 0.0.0.0:40923: BlockingRecv error: recv error from unknown peer: Transport endpoint is not connected (error 107)
Metrics: {"client-negotiator.queue_time_us":32}
[ OK ] Parameters/TestRpcSocketTxRxQueue.OverCapacity/0 (1077 ms)
[----------] 1 test from Parameters/TestRpcSocketTxRxQueue (1077 ms total)
[----------] Global test environment tear-down
[==========] 21 tests from 2 test suites ran. (48886 ms total)
[ PASSED ] 20 tests.
[ FAILED ] 1 test, listed below:
[ FAILED ] Parameters/TestRpc.TestCallWithChainCertAndChainCA/SSL_TCP, where GetParam() = (true, false)
1 FAILED TEST