Diagnosed failure
Parameters/TestRpc.TestCallWithChainCertAndChainCA/SSL_UnixSocket: /data0/somelongdirectorytoavoidrpathissues/src/kudu/src/kudu/rpc/rpc-test.cc:270: Failure
Failed
Bad status: Runtime error: could not verify certificate chain (error with cert: subject=CN = localhost, ST = sadfjas, C = AS, emailAddress = sdflkdsajf, O = lskdfjlsad, OU = sldfkja, issuer=C = AS, ST = ASDfkjdhf, L = lskdjf, O = saldfja, OU = skdjf, CN = localhost, emailAddress = sadjflkadsj): : certificate has expired
Google Test trace:
/data0/somelongdirectorytoavoidrpathissues/src/kudu/src/kudu/rpc/rpc-test.cc:267: Connecting to unix:/tmp/dist-test-tasklzN09c/test-tmp/rpc-test-685536840cf84c01beec32134b91aae2.sock
I20260927 22:50:26.057633 6158 test_util.cc:175] -----------------------------------------------
I20260927 22:50:26.057714 6158 test_util.cc:176] Had fatal failures, leaving test files at /tmp/dist-test-tasklzN09c/test-tmp/rpc-test.6.Parameters_TestRpc.TestCallWithChainCertAndChainCA_SSL_UnixSocket.1790549425921701-6158-0
Full log
Note: This is test shard 7 of 8.
[==========] Running 21 tests from 2 test suites.
[----------] Global test environment set-up.
[----------] 20 tests from Parameters/TestRpc
[ RUN ] Parameters/TestRpc.TestMessengerCreateDestroy/SSL_UnixSocket
WARNING: Logging before InitGoogleLogging() is written to STDERR
I20260927 22:50:25.986217 6158 rpc-test.cc:169] started messenger TestCreateDestroy
[ OK ] Parameters/TestRpc.TestMessengerCreateDestroy/SSL_UnixSocket (48 ms)
[ RUN ] Parameters/TestRpc.TestNegotiationDeadlock/SSL_UnixSocket
I20260927 22:50:26.007368 6178 acceptor_pool.cc:254] collecting diagnostics on the listening RPC socket unix:/tmp/dist-test-tasklzN09c/test-tmp/rpc-test-62f3c47cbf244d3fbf48131bff8e4539.sock every 8 connection(s)
I20260927 22:50:26.007601 6179 acceptor_pool.cc:254] collecting diagnostics on the listening RPC socket unix:/tmp/dist-test-tasklzN09c/test-tmp/rpc-test-62f3c47cbf244d3fbf48131bff8e4539.sock every 8 connection(s)
[ OK ] Parameters/TestRpc.TestNegotiationDeadlock/SSL_UnixSocket (37 ms)
[ RUN ] Parameters/TestRpc.TestCallWithChainCertAndChainCA/SSL_UnixSocket
I20260927 22:50:26.046290 6194 acceptor_pool.cc:254] collecting diagnostics on the listening RPC socket unix:/tmp/dist-test-tasklzN09c/test-tmp/rpc-test-685536840cf84c01beec32134b91aae2.sock every 8 connection(s)
I20260927 22:50:26.046638 6195 acceptor_pool.cc:254] collecting diagnostics on the listening RPC socket unix:/tmp/dist-test-tasklzN09c/test-tmp/rpc-test-685536840cf84c01beec32134b91aae2.sock every 8 connection(s)
/data0/somelongdirectorytoavoidrpathissues/src/kudu/src/kudu/rpc/rpc-test.cc:270: Failure
Failed
Bad status: Runtime error: could not verify certificate chain (error with cert: subject=CN = localhost, ST = sadfjas, C = AS, emailAddress = sdflkdsajf, O = lskdfjlsad, OU = sldfkja, issuer=C = AS, ST = ASDfkjdhf, L = lskdjf, O = saldfja, OU = skdjf, CN = localhost, emailAddress = sadjflkadsj): : certificate has expired
Google Test trace:
/data0/somelongdirectorytoavoidrpathissues/src/kudu/src/kudu/rpc/rpc-test.cc:267: Connecting to unix:/tmp/dist-test-tasklzN09c/test-tmp/rpc-test-685536840cf84c01beec32134b91aae2.sock
I20260927 22:50:26.057633 6158 test_util.cc:175] -----------------------------------------------
I20260927 22:50:26.057714 6158 test_util.cc:176] Had fatal failures, leaving test files at /tmp/dist-test-tasklzN09c/test-tmp/rpc-test.6.Parameters_TestRpc.TestCallWithChainCertAndChainCA_SSL_UnixSocket.1790549425921701-6158-0
[ FAILED ] Parameters/TestRpc.TestCallWithChainCertAndChainCA/SSL_UnixSocket, where GetParam() = (true, true) (30 ms)
[ RUN ] Parameters/TestRpc.TestCallWithPasswordProtectedKey/SSL_UnixSocket
I20260927 22:50:26.077173 6219 acceptor_pool.cc:254] collecting diagnostics on the listening RPC socket unix:/tmp/dist-test-tasklzN09c/test-tmp/rpc-test-7a9c451a6ef6406e80eb22ec75082948.sock every 8 connection(s)
I20260927 22:50:26.077410 6220 acceptor_pool.cc:254] collecting diagnostics on the listening RPC socket unix:/tmp/dist-test-tasklzN09c/test-tmp/rpc-test-7a9c451a6ef6406e80eb22ec75082948.sock every 8 connection(s)
W20260927 22:50:26.107613 6216 connection.cc:196] Error closing socket: Network error: TlsSocket::Close: Broken pipe
[ OK ] Parameters/TestRpc.TestCallWithPasswordProtectedKey/SSL_UnixSocket (52 ms)
[ RUN ] Parameters/TestRpc.TestCallToBadServer/SSL_UnixSocket
I20260927 22:50:26.123535 6158 rpc-test.cc:394] Status: Network error: Client connection negotiation failed: client connection to 0.0.0.0:0: connect: Connection refused (error 111)
I20260927 22:50:26.124245 6158 rpc-test.cc:394] Status: Network error: Client connection negotiation failed: client connection to 0.0.0.0:0: connect: Connection refused (error 111)
I20260927 22:50:26.124923 6158 rpc-test.cc:394] Status: Network error: Client connection negotiation failed: client connection to 0.0.0.0:0: connect: Connection refused (error 111)
I20260927 22:50:26.125499 6158 rpc-test.cc:394] Status: Network error: Client connection negotiation failed: client connection to 0.0.0.0:0: connect: Connection refused (error 111)
I20260927 22:50:26.126108 6158 rpc-test.cc:394] Status: Network error: Client connection negotiation failed: client connection to 0.0.0.0:0: connect: Connection refused (error 111)
[ OK ] Parameters/TestRpc.TestCallToBadServer/SSL_UnixSocket (17 ms)
[ RUN ] Parameters/TestRpc.TestWrongService/SSL_UnixSocket
I20260927 22:50:26.158794 6254 acceptor_pool.cc:254] collecting diagnostics on the listening RPC socket unix:/tmp/dist-test-tasklzN09c/test-tmp/rpc-test-d5465b2ec7ad48e7805908dd54239000.sock every 8 connection(s)
I20260927 22:50:26.159036 6255 acceptor_pool.cc:254] collecting diagnostics on the listening RPC socket unix:/tmp/dist-test-tasklzN09c/test-tmp/rpc-test-d5465b2ec7ad48e7805908dd54239000.sock every 8 connection(s)
I20260927 22:50:26.182530 6251 messenger.cc:345] service WrongServiceName not registered on TestServer
[ OK ] Parameters/TestRpc.TestWrongService/SSL_UnixSocket (59 ms)
[ RUN ] Parameters/TestRpc.TestConnectionKeepalive/SSL_UnixSocket
I20260927 22:50:26.210988 6277 acceptor_pool.cc:254] collecting diagnostics on the listening RPC socket unix:/tmp/dist-test-tasklzN09c/test-tmp/rpc-test-91ef2049d3ff4703ab153509b534fa3b.sock every 8 connection(s)
I20260927 22:50:26.211227 6278 acceptor_pool.cc:254] collecting diagnostics on the listening RPC socket unix:/tmp/dist-test-tasklzN09c/test-tmp/rpc-test-91ef2049d3ff4703ab153509b534fa3b.sock every 8 connection(s)
I20260927 22:50:26.212076 6158 rpc-test.cc:488] Connecting to unix:/tmp/dist-test-tasklzN09c/test-tmp/rpc-test-91ef2049d3ff4703ab153509b534fa3b.sock
W20260927 22:50:26.689206 6290 connection.cc:196] Error closing socket: Network error: TlsSocket::Close: Broken pipe
[ OK ] Parameters/TestRpc.TestConnectionKeepalive/SSL_UnixSocket (1063 ms)
[ RUN ] Parameters/TestRpc.TestClientConnectionMetrics/SSL_UnixSocket
I20260927 22:50:27.268589 6302 acceptor_pool.cc:254] collecting diagnostics on the listening RPC socket unix:/tmp/dist-test-tasklzN09c/test-tmp/rpc-test-11725395b1dd4ca095cfb8a275e0e20e.sock every 8 connection(s)
I20260927 22:50:27.268855 6303 acceptor_pool.cc:254] collecting diagnostics on the listening RPC socket unix:/tmp/dist-test-tasklzN09c/test-tmp/rpc-test-11725395b1dd4ca095cfb8a275e0e20e.sock every 8 connection(s)
I20260927 22:50:27.269831 6158 rpc-test.cc:569] Connecting to unix:/tmp/dist-test-tasklzN09c/test-tmp/rpc-test-11725395b1dd4ca095cfb8a275e0e20e.sock
[ OK ] Parameters/TestRpc.TestClientConnectionMetrics/SSL_UnixSocket (21285 ms)
[ RUN ] Parameters/TestRpc.TestCredentialsPolicy/SSL_UnixSocket
I20260927 22:50:48.555831 6325 acceptor_pool.cc:254] collecting diagnostics on the listening RPC socket unix:/tmp/dist-test-tasklzN09c/test-tmp/rpc-test-f11ac9f6d6034ab0a4a0b3861066c722.sock every 8 connection(s)
I20260927 22:50:48.556046 6326 acceptor_pool.cc:254] collecting diagnostics on the listening RPC socket unix:/tmp/dist-test-tasklzN09c/test-tmp/rpc-test-f11ac9f6d6034ab0a4a0b3861066c722.sock every 8 connection(s)
I20260927 22:50:48.557078 6158 rpc-test.cc:700] Connecting to unix:/tmp/dist-test-tasklzN09c/test-tmp/rpc-test-f11ac9f6d6034ab0a4a0b3861066c722.sock
W20260927 22:50:48.597028 6324 connection.cc:196] Error closing socket: Network error: TlsSocket::Close: Broken pipe
[ OK ] Parameters/TestRpc.TestCredentialsPolicy/SSL_UnixSocket (70 ms)
[ RUN ] Parameters/TestRpc.TestCallLongerThanKeepalive/SSL_UnixSocket
I20260927 22:50:48.630227 6350 acceptor_pool.cc:254] collecting diagnostics on the listening RPC socket unix:/tmp/dist-test-tasklzN09c/test-tmp/rpc-test-eeae5837ac1d472eaebada52c85f257a.sock every 8 connection(s)
I20260927 22:50:48.630455 6351 acceptor_pool.cc:254] collecting diagnostics on the listening RPC socket unix:/tmp/dist-test-tasklzN09c/test-tmp/rpc-test-eeae5837ac1d472eaebada52c85f257a.sock every 8 connection(s)
I20260927 22:50:48.644687 6354 rpc-test-base.h:222] got call: sleep_micros: 3000000 deferred: true
I20260927 22:50:51.646340 6354 rpcz_store.cc:275] Call kudu.rpc.GenericCalculatorService.Sleep from unix:<unnamed> (request call id 0) took 3001 ms. Trace:
I20260927 22:50:51.646490 6354 rpcz_store.cc:276] 0927 22:50:48.644590 (+ 0us) service_pool.cc:170] Inserting onto call queue
0927 22:50:48.644648 (+ 58us) service_pool.cc:227] Handling call
0927 22:50:51.646295 (+3001647us) inbound_call.cc:173] Queueing success response
Metrics: {}
W20260927 22:50:51.648762 6347 connection.cc:196] Error closing socket: Network error: TlsSocket::Close: Broken pipe
[ OK ] Parameters/TestRpc.TestCallLongerThanKeepalive/SSL_UnixSocket (3046 ms)
[ RUN ] Parameters/TestRpc.TestRpcSidecar/SSL_UnixSocket
I20260927 22:50:51.663272 6375 acceptor_pool.cc:254] collecting diagnostics on the listening RPC socket unix:/tmp/dist-test-tasklzN09c/test-tmp/rpc-test-1596c32855ee4fc8b2cdd56b8689129d.sock every 8 connection(s)
I20260927 22:50:51.663511 6376 acceptor_pool.cc:254] collecting diagnostics on the listening RPC socket unix:/tmp/dist-test-tasklzN09c/test-tmp/rpc-test-1596c32855ee4fc8b2cdd56b8689129d.sock every 8 connection(s)
W20260927 22:50:51.756208 6372 connection.cc:196] Error closing socket: Network error: TlsSocket::Close: Broken pipe
[ OK ] Parameters/TestRpc.TestRpcSidecar/SSL_UnixSocket (106 ms)
[ RUN ] Parameters/TestRpc.TestRpcSidecarLimits/SSL_UnixSocket
I20260927 22:50:53.854303 6400 acceptor_pool.cc:254] collecting diagnostics on the listening RPC socket unix:/tmp/dist-test-tasklzN09c/test-tmp/rpc-test-b285420a36b54f5e9d7d8ccf79b30faa.sock every 8 connection(s)
I20260927 22:50:53.854573 6401 acceptor_pool.cc:254] collecting diagnostics on the listening RPC socket unix:/tmp/dist-test-tasklzN09c/test-tmp/rpc-test-b285420a36b54f5e9d7d8ccf79b30faa.sock every 8 connection(s)
W20260927 22:50:53.875388 6158 serialization.cc:72] Serialized kudu.rpc_test.PushStringsRequestPB (2147483654 bytes) is larger than the maximum configured RPC message size (52428800 bytes). Sending anyway, but peer may reject the data.
W20260927 22:50:53.880916 6397 connection.cc:535] server connection from unix:<unnamed> recv error: Network error: RPC frame had a length of 2147483714, but we only support messages up to 52428800 bytes long.
W20260927 22:50:53.881022 6397 connection.cc:158] shutting down server connection from unix:<unnamed> with pending inbound data: 4/2147483714 bytes received; last active 0 ns ago: status Network error: RPC frame had a length of 2147483714, but we only support messages up to 52428800 bytes long.
W20260927 22:50:53.881428 6413 connection.cc:196] Error closing socket: Network error: TlsSocket::Close: Broken pipe
I20260927 22:50:53.897953 6425 acceptor_pool.cc:254] collecting diagnostics on the listening RPC socket unix:/tmp/dist-test-tasklzN09c/test-tmp/rpc-test-b285420a36b54f5e9d7d8ccf79b30faa.sock every 8 connection(s)
I20260927 22:50:53.898182 6426 acceptor_pool.cc:254] collecting diagnostics on the listening RPC socket unix:/tmp/dist-test-tasklzN09c/test-tmp/rpc-test-b285420a36b54f5e9d7d8ccf79b30faa.sock every 8 connection(s)
W20260927 22:50:59.566385 6422 connection.cc:577] server connection from unix:<unnamed>: received bad data: 'Corruption: Invalid packet: message had a length of 2147483710, but we only support messages up to 2147483647 bytes
'
W20260927 22:50:59.566984 6438 connection.cc:196] Error closing socket: Network error: TlsSocket::Close: Broken pipe
[ OK ] Parameters/TestRpc.TestRpcSidecarLimits/SSL_UnixSocket (8270 ms)
[ RUN ] Parameters/TestRpc.TestCallTimeoutDoesntAffectNegotiation/SSL_UnixSocket
I20260927 22:51:00.069739 6450 acceptor_pool.cc:254] collecting diagnostics on the listening RPC socket unix:/tmp/dist-test-tasklzN09c/test-tmp/rpc-test-1e7ce25c87664bc3bc83da244cee1f04.sock every 8 connection(s)
I20260927 22:51:00.070011 6451 acceptor_pool.cc:254] collecting diagnostics on the listening RPC socket unix:/tmp/dist-test-tasklzN09c/test-tmp/rpc-test-1e7ce25c87664bc3bc83da244cee1f04.sock every 8 connection(s)
W20260927 22:51:00.090137 6446 negotiation.cc:266] Injecting 500ms delay in negotiation
I20260927 22:51:00.140524 6158 rpc-test-base.h:595] status: Timed out: connection negotiation to unix:/tmp/dist-test-tasklzN09c/test-tmp/rpc-test-1e7ce25c87664bc3bc83da244cee1f04.sock for RPC Sleep timed out after 0.050s (ON_OUTBOUND_QUEUE), seconds elapsed: 0.0510269
[ OK ] Parameters/TestRpc.TestCallTimeoutDoesntAffectNegotiation/SSL_UnixSocket (570 ms)
[ RUN ] Parameters/TestRpc.TestRpcHandlerLatencyMetric/SSL_UnixSocket
I20260927 22:51:00.615674 6475 acceptor_pool.cc:254] collecting diagnostics on the listening RPC socket unix:/tmp/dist-test-tasklzN09c/test-tmp/rpc-test-2530ef61149145aab999d45de22f0190.sock every 8 connection(s)
I20260927 22:51:00.615885 6476 acceptor_pool.cc:254] collecting diagnostics on the listening RPC socket unix:/tmp/dist-test-tasklzN09c/test-tmp/rpc-test-2530ef61149145aab999d45de22f0190.sock every 8 connection(s)
I20260927 22:51:00.667253 6158 rpc-test.cc:1236] Sleep() min lat: 20610
I20260927 22:51:00.667357 6158 rpc-test.cc:1237] Sleep() mean lat: 20610
I20260927 22:51:00.667397 6158 rpc-test.cc:1238] Sleep() max lat: 20610
I20260927 22:51:00.667415 6158 rpc-test.cc:1239] Sleep() #calls: 1
W20260927 22:51:00.668527 6472 connection.cc:196] Error closing socket: Network error: TlsSocket::Close: Broken pipe
[ OK ] Parameters/TestRpc.TestRpcHandlerLatencyMetric/SSL_UnixSocket (72 ms)
[ RUN ] Parameters/TestRpc.TimedOutOnResponseMetricServiceQueue/SSL_UnixSocket
I20260927 22:51:00.683501 6501 acceptor_pool.cc:254] collecting diagnostics on the listening RPC socket unix:/tmp/dist-test-tasklzN09c/test-tmp/rpc-test-7c6870fb6f2b444b82b471c7ef9884e7.sock every 8 connection(s)
I20260927 22:51:00.683725 6502 acceptor_pool.cc:254] collecting diagnostics on the listening RPC socket unix:/tmp/dist-test-tasklzN09c/test-tmp/rpc-test-7c6870fb6f2b444b82b471c7ef9884e7.sock every 8 connection(s)
W20260927 22:51:00.744248 6503 rpcz_store.cc:267] Call kudu.rpc_test.CalculatorService.Sleep from unix:<unnamed> (request call id 2) took 20 ms (client timeout 20 ms). Trace:
W20260927 22:51:00.744437 6503 rpcz_store.cc:269] 0927 22:51:00.723765 (+ 0us) service_pool.cc:170] Inserting onto call queue
0927 22:51:00.744153 (+ 20388us) service_pool.cc:214] Skipping call since client already timed out
0927 22:51:00.744228 (+ 75us) inbound_call.cc:173] Queueing failure response
Metrics: {}
[ OK ] Parameters/TestRpc.TimedOutOnResponseMetricServiceQueue/SSL_UnixSocket (76 ms)
[ RUN ] Parameters/TestRpc.RpcPendingConnectionsMetric/SSL_UnixSocket
I20260927 22:51:00.753854 6524 acceptor_pool.cc:254] collecting diagnostics on the listening RPC socket 0.0.0.0:43087 every 8 connection(s)
I20260927 22:51:00.754129 6525 acceptor_pool.cc:254] collecting diagnostics on the listening RPC socket 0.0.0.0:43087 every 8 connection(s)
W20260927 22:51:00.756244 6520 negotiation.cc:337] Failed RPC negotiation. Trace:
0927 22:51:00.755673 (+ 0us) reactor.cc:625] Submitting negotiation task for server connection from 127.0.0.1:44820 (local address 127.0.0.1:43087)
0927 22:51:00.755814 (+ 141us) server_negotiation.cc:206] Beginning negotiation
0927 22:51:00.755818 (+ 4us) server_negotiation.cc:399] Waiting for connection header
0927 22:51:00.755952 (+ 134us) negotiation.cc:327] Negotiation complete: Network error: Server connection negotiation failed: server connection from 127.0.0.1:44820: BlockingRecv error: recv got EOF from 127.0.0.1:44820 (error 108)
Metrics: {"server-negotiator.queue_time_us":51}
[ OK ] Parameters/TestRpc.RpcPendingConnectionsMetric/SSL_UnixSocket (19 ms)
[ RUN ] Parameters/TestRpc.TestRpcContextClientDeadline/SSL_UnixSocket
I20260927 22:51:00.794637 6540 acceptor_pool.cc:254] collecting diagnostics on the listening RPC socket unix:/tmp/dist-test-tasklzN09c/test-tmp/rpc-test-df991482ebcf43cc894b86309e89d61e.sock every 8 connection(s)
I20260927 22:51:00.794864 6541 acceptor_pool.cc:254] collecting diagnostics on the listening RPC socket unix:/tmp/dist-test-tasklzN09c/test-tmp/rpc-test-df991482ebcf43cc894b86309e89d61e.sock every 8 connection(s)
[ OK ] Parameters/TestRpc.TestRpcContextClientDeadline/SSL_UnixSocket (66 ms)
[ RUN ] Parameters/TestRpc.TestApplicationFeatureFlagUnsupportedServer/SSL_UnixSocket
I20260927 22:51:00.864022 6565 acceptor_pool.cc:254] collecting diagnostics on the listening RPC socket unix:/tmp/dist-test-tasklzN09c/test-tmp/rpc-test-d832478bbe684dba92deb380485cc23a.sock every 8 connection(s)
I20260927 22:51:00.864251 6566 acceptor_pool.cc:254] collecting diagnostics on the listening RPC socket unix:/tmp/dist-test-tasklzN09c/test-tmp/rpc-test-d832478bbe684dba92deb380485cc23a.sock every 8 connection(s)
[ OK ] Parameters/TestRpc.TestApplicationFeatureFlagUnsupportedServer/SSL_UnixSocket (65 ms)
[ RUN ] Parameters/TestRpc.TestCancellationAsync/SSL_UnixSocket
I20260927 22:51:00.917498 6590 acceptor_pool.cc:254] collecting diagnostics on the listening RPC socket unix:/tmp/dist-test-tasklzN09c/test-tmp/rpc-test-d9b8e52bec2b44719f051eb8c085af10.sock every 8 connection(s)
I20260927 22:51:00.917716 6591 acceptor_pool.cc:254] collecting diagnostics on the listening RPC socket unix:/tmp/dist-test-tasklzN09c/test-tmp/rpc-test-d9b8e52bec2b44719f051eb8c085af10.sock every 8 connection(s)
I20260927 22:51:00.918561 6158 rpc-test.cc:1716] Connecting to unix:/tmp/dist-test-tasklzN09c/test-tmp/rpc-test-d9b8e52bec2b44719f051eb8c085af10.sock
I20260927 22:51:00.931109 6158 test_util.cc:268] Using random seed: -929934832
I20260927 22:51:00.975088 6594 rpc-test-base.h:240] got call: sleep_micros: 500 pattern: 4294967295 num_repetitions: 2097152 sidecar_idx: 0
I20260927 22:51:01.006798 6593 rpc-test-base.h:240] got call: sleep_micros: 500 pattern: 4294967295 num_repetitions: 2097152 sidecar_idx: 0
I20260927 22:51:01.034118 6594 rpc-test-base.h:240] got call: sleep_micros: 500 pattern: 4294967295 num_repetitions: 2097152 sidecar_idx: 0
I20260927 22:51:01.067960 6593 rpc-test-base.h:240] got call: sleep_micros: 500 pattern: 4294967295 num_repetitions: 2097152 sidecar_idx: 0
I20260927 22:51:01.098927 6594 rpc-test-base.h:240] got call: sleep_micros: 500 pattern: 4294967295 num_repetitions: 2097152 sidecar_idx: 0
I20260927 22:51:01.133606 6593 rpc-test-base.h:240] got call: sleep_micros: 500 pattern: 4294967295 num_repetitions: 2097152 sidecar_idx: 0
I20260927 22:51:01.162638 6594 rpc-test-base.h:240] got call: sleep_micros: 500 pattern: 4294967295 num_repetitions: 2097152 sidecar_idx: 0
W20260927 22:51:01.164973 6587 connection.cc:196] Error closing socket: Network error: TlsSocket::Close: Broken pipe
W20260927 22:51:01.192979 6587 connection.cc:441] server connection from unix:<unnamed> torn down before Call kudu.rpc.GenericCalculatorService.SleepWithSidecar from unix:<unnamed> (request call id 8) could send its response
W20260927 22:51:01.209805 6587 connection.cc:441] server connection from unix:<unnamed> torn down before Call kudu.rpc.GenericCalculatorService.SleepWithSidecar from unix:<unnamed> (request call id 9) could send its response
[ OK ] Parameters/TestRpc.TestCancellationAsync/SSL_UnixSocket (312 ms)
[ RUN ] Parameters/TestRpc.TestPerformanceBySocketType/SSL_UnixSocket
I20260927 22:51:01.237586 6615 acceptor_pool.cc:254] collecting diagnostics on the listening RPC socket unix:/tmp/dist-test-tasklzN09c/test-tmp/rpc-test-039d19250d4b4a0a81575df75bc213d7.sock every 8 connection(s)
I20260927 22:51:01.237793 6616 acceptor_pool.cc:254] collecting diagnostics on the listening RPC socket unix:/tmp/dist-test-tasklzN09c/test-tmp/rpc-test-039d19250d4b4a0a81575df75bc213d7.sock every 8 connection(s)
I20260927 22:51:01.238833 6158 rpc-test.cc:1846] Connecting to unix:/tmp/dist-test-tasklzN09c/test-tmp/rpc-test-039d19250d4b4a0a81575df75bc213d7.sock
I20260927 22:51:04.281216 6158 rpc-test.cc:1859] Sending 1024MB via ssl-enabled unix socket: real 3.031s user 2.995s sys 2.162s
I20260927 22:51:07.390239 6158 rpc-test.cc:1859] Sending 1024MB via ssl-enabled unix socket: real 3.109s user 2.949s sys 2.298s
I20260927 22:51:10.574965 6158 rpc-test.cc:1859] Sending 1024MB via ssl-enabled unix socket: real 3.185s user 3.206s sys 2.219s
I20260927 22:51:13.837185 6158 rpc-test.cc:1859] Sending 1024MB via ssl-enabled unix socket: real 3.262s user 3.158s sys 2.368s
I20260927 22:51:17.088212 6158 rpc-test.cc:1859] Sending 1024MB via ssl-enabled unix socket: real 3.251s user 3.153s sys 2.378s
W20260927 22:51:17.089982 6612 connection.cc:196] Error closing socket: Network error: TlsSocket::Close: Broken pipe
[ OK ] Parameters/TestRpc.TestPerformanceBySocketType/SSL_UnixSocket (15882 ms)
[----------] 20 tests from Parameters/TestRpc (51155 ms total)
[----------] 1 test from Parameters/TestRpcSocketTxRxQueue
[ RUN ] Parameters/TestRpcSocketTxRxQueue.AcceptorRxQueueSizeMetric/0
I20260927 22:51:17.100754 6640 acceptor_pool.cc:254] collecting diagnostics on the listening RPC socket 0.0.0.0:46641 every 1 connection(s)
I20260927 22:51:17.101011 6641 acceptor_pool.cc:254] collecting diagnostics on the listening RPC socket 0.0.0.0:46641 every 1 connection(s)
W20260927 22:51:17.102828 6636 negotiation.cc:337] Failed RPC negotiation. Trace:
0927 22:51:17.102414 (+ 0us) reactor.cc:625] Submitting negotiation task for server connection from 127.0.0.1:44782 (local address 127.0.0.1:46641)
0927 22:51:17.102593 (+ 179us) server_negotiation.cc:206] Beginning negotiation
0927 22:51:17.102597 (+ 4us) server_negotiation.cc:399] Waiting for connection header
0927 22:51:17.102716 (+ 119us) negotiation.cc:327] Negotiation complete: Network error: Server connection negotiation failed: server connection from 127.0.0.1:44782: BlockingRecv error: recv got EOF from 127.0.0.1:44782 (error 108)
Metrics: {"server-negotiator.queue_time_us":56}
[ OK ] Parameters/TestRpcSocketTxRxQueue.AcceptorRxQueueSizeMetric/0 (10 ms)
[----------] 1 test from Parameters/TestRpcSocketTxRxQueue (10 ms total)
[----------] Global test environment tear-down
[==========] 21 tests from 2 test suites ran. (51166 ms total)
[ PASSED ] 20 tests.
[ FAILED ] 1 test, listed below:
[ FAILED ] Parameters/TestRpc.TestCallWithChainCertAndChainCA/SSL_UnixSocket, where GetParam() = (true, true)
1 FAILED TEST