Diagnosed failure

Parameters/TestRpc.TestCallWithChainCertAndRootCA/SSL_TCP: /data0/somelongdirectorytoavoidrpathissues/src/kudu/src/kudu/rpc/rpc-test.cc:303: Failure
Failed
Bad status: Runtime error: could not verify certificate chain (error with cert: subject=CN = localhost, ST = sadfjas, C = AS, emailAddress = sdflkdsajf, O = lskdfjlsad, OU = sldfkja, issuer=C = AS, ST = ASDfkjdhf, L = lskdjf, O = saldfja, OU = skdjf, CN = localhost, emailAddress = sadjflkadsj): : certificate has expired
Google Test trace:
/data0/somelongdirectorytoavoidrpathissues/src/kudu/src/kudu/rpc/rpc-test.cc:300: Connecting to 0.0.0.0:44827
I20260928 19:29:00.875429   390 test_util.cc:175] -----------------------------------------------
I20260928 19:29:00.875617   390 test_util.cc:176] Had fatal failures, leaving test files at /tmp/dist-test-taskSTZrNs/test-tmp/rpc-test.1.Parameters_TestRpc.TestCallWithChainCertAndRootCA_SSL_TCP.1790623739239591-390-0

Full log

Note: This is test shard 2 of 8.
[==========] Running 21 tests from 2 test suites.
[----------] Global test environment set-up.
[----------] 1 test from TestRpc
[ RUN      ] TestRpc.TestMethodsByName
[       OK ] TestRpc.TestMethodsByName (6 ms)
[----------] 1 test from TestRpc (7 ms total)

[----------] 20 tests from Parameters/TestRpc
[ RUN      ] Parameters/TestRpc.TestAcceptorPoolStartStop/SSL_TCP
WARNING: Logging before InitGoogleLogging() is written to STDERR
I20260928 19:28:59.358976   405 acceptor_pool.cc:254] collecting diagnostics on the listening RPC socket 0.0.0.0:43975 every 8 connection(s)
I20260928 19:28:59.360476   406 acceptor_pool.cc:254] collecting diagnostics on the listening RPC socket 0.0.0.0:43975 every 8 connection(s)
W20260928 19:29:00.361099   390 thread.cc:536] Waited for 1000ms trying to join with acceptor (tid 406)
I20260928 19:29:00.542430   417 acceptor_pool.cc:254] collecting diagnostics on the listening RPC socket 0.0.0.0:40017 every 8 connection(s)
I20260928 19:29:00.544387   418 acceptor_pool.cc:254] collecting diagnostics on the listening RPC socket 0.0.0.0:40017 every 8 connection(s)
I20260928 19:29:00.597728   428 acceptor_pool.cc:254] collecting diagnostics on the listening RPC socket 0.0.0.0:35319 every 8 connection(s)
I20260928 19:29:00.599210   429 acceptor_pool.cc:254] collecting diagnostics on the listening RPC socket 0.0.0.0:35319 every 8 connection(s)
I20260928 19:29:00.620631   439 acceptor_pool.cc:254] collecting diagnostics on the listening RPC socket 0.0.0.0:34097 every 8 connection(s)
I20260928 19:29:00.621335   440 acceptor_pool.cc:254] collecting diagnostics on the listening RPC socket 0.0.0.0:34097 every 8 connection(s)
I20260928 19:29:00.661190   450 acceptor_pool.cc:254] collecting diagnostics on the listening RPC socket 0.0.0.0:38375 every 8 connection(s)
I20260928 19:29:00.661791   451 acceptor_pool.cc:254] collecting diagnostics on the listening RPC socket 0.0.0.0:38375 every 8 connection(s)
[       OK ] Parameters/TestRpc.TestAcceptorPoolStartStop/SSL_TCP (1364 ms)
[ RUN      ] Parameters/TestRpc.TestCall/SSL_TCP
I20260928 19:29:00.694393   463 acceptor_pool.cc:254] collecting diagnostics on the listening RPC socket 0.0.0.0:33363 every 8 connection(s)
I20260928 19:29:00.695748   464 acceptor_pool.cc:254] collecting diagnostics on the listening RPC socket 0.0.0.0:33363 every 8 connection(s)
I20260928 19:29:00.701614   390 rpc-test.cc:234] Connecting to 0.0.0.0:33363
[       OK ] Parameters/TestRpc.TestCall/SSL_TCP (168 ms)
[ RUN      ] Parameters/TestRpc.TestCallWithChainCertAndRootCA/SSL_TCP
I20260928 19:29:00.853863   488 acceptor_pool.cc:254] collecting diagnostics on the listening RPC socket 0.0.0.0:44827 every 8 connection(s)
I20260928 19:29:00.854592   489 acceptor_pool.cc:254] collecting diagnostics on the listening RPC socket 0.0.0.0:44827 every 8 connection(s)
/data0/somelongdirectorytoavoidrpathissues/src/kudu/src/kudu/rpc/rpc-test.cc:303: Failure
Failed
Bad status: Runtime error: could not verify certificate chain (error with cert: subject=CN = localhost, ST = sadfjas, C = AS, emailAddress = sdflkdsajf, O = lskdfjlsad, OU = sldfkja, issuer=C = AS, ST = ASDfkjdhf, L = lskdjf, O = saldfja, OU = skdjf, CN = localhost, emailAddress = sadjflkadsj): : certificate has expired
Google Test trace:
/data0/somelongdirectorytoavoidrpathissues/src/kudu/src/kudu/rpc/rpc-test.cc:300: Connecting to 0.0.0.0:44827
I20260928 19:29:00.875429   390 test_util.cc:175] -----------------------------------------------
I20260928 19:29:00.875617   390 test_util.cc:176] Had fatal failures, leaving test files at /tmp/dist-test-taskSTZrNs/test-tmp/rpc-test.1.Parameters_TestRpc.TestCallWithChainCertAndRootCA_SSL_TCP.1790623739239591-390-0
[  FAILED  ] Parameters/TestRpc.TestCallWithChainCertAndRootCA/SSL_TCP, where GetParam() = (true, false) (41 ms)
[ RUN      ] Parameters/TestRpc.TestCallWithBadPasswordProtectedKey/SSL_TCP
[       OK ] Parameters/TestRpc.TestCallWithBadPasswordProtectedKey/SSL_TCP (31 ms)
[ RUN      ] Parameters/TestRpc.TestInvalidMethodCall/SSL_TCP
I20260928 19:29:00.934504   525 acceptor_pool.cc:254] collecting diagnostics on the listening RPC socket 0.0.0.0:42175 every 8 connection(s)
I20260928 19:29:00.935477   526 acceptor_pool.cc:254] collecting diagnostics on the listening RPC socket 0.0.0.0:42175 every 8 connection(s)
I20260928 19:29:00.939253   390 rpc-test.cc:406] Connecting to 0.0.0.0:42175
[       OK ] Parameters/TestRpc.TestInvalidMethodCall/SSL_TCP (67 ms)
[ RUN      ] Parameters/TestRpc.TestHighFDs/SSL_TCP
I20260928 19:29:01.202703   550 acceptor_pool.cc:254] collecting diagnostics on the listening RPC socket 0.0.0.0:35577 every 8 connection(s)
I20260928 19:29:01.203485   551 acceptor_pool.cc:254] collecting diagnostics on the listening RPC socket 0.0.0.0:35577 every 8 connection(s)
[       OK ] Parameters/TestRpc.TestHighFDs/SSL_TCP (281 ms)
[ RUN      ] Parameters/TestRpc.TestConnectionAlwaysKeepalive/SSL_TCP
I20260928 19:29:01.273221   573 acceptor_pool.cc:254] collecting diagnostics on the listening RPC socket 0.0.0.0:44205 every 8 connection(s)
I20260928 19:29:01.274015   574 acceptor_pool.cc:254] collecting diagnostics on the listening RPC socket 0.0.0.0:44205 every 8 connection(s)
I20260928 19:29:01.277262   390 rpc-test.cc:532] Connecting to 0.0.0.0:44205
[       OK ] Parameters/TestRpc.TestConnectionAlwaysKeepalive/SSL_TCP (3066 ms)
[ RUN      ] Parameters/TestRpc.TestReopenOutboundConnections/SSL_TCP
I20260928 19:29:04.364605   596 acceptor_pool.cc:254] collecting diagnostics on the listening RPC socket 0.0.0.0:45807 every 8 connection(s)
I20260928 19:29:04.365334   597 acceptor_pool.cc:254] collecting diagnostics on the listening RPC socket 0.0.0.0:45807 every 8 connection(s)
I20260928 19:29:04.368475   390 rpc-test.cc:658] Connecting to 0.0.0.0:45807
[       OK ] Parameters/TestRpc.TestReopenOutboundConnections/SSL_TCP (469 ms)
[ RUN      ] Parameters/TestRpc.TestConnectionNetworkPlane/SSL_TCP
I20260928 19:29:04.818492   619 acceptor_pool.cc:254] collecting diagnostics on the listening RPC socket 0.0.0.0:34395 every 8 connection(s)
I20260928 19:29:04.819242   620 acceptor_pool.cc:254] collecting diagnostics on the listening RPC socket 0.0.0.0:34395 every 8 connection(s)
I20260928 19:29:04.822854   390 rpc-test.cc:772] Connecting to 0.0.0.0:34395
[       OK ] Parameters/TestRpc.TestConnectionNetworkPlane/SSL_TCP (103 ms)
[ RUN      ] Parameters/TestRpc.TestTCPKeepalive/SSL_TCP
I20260928 19:29:04.930315   644 acceptor_pool.cc:254] collecting diagnostics on the listening RPC socket 0.0.0.0:34031 every 8 connection(s)
I20260928 19:29:04.931563   645 acceptor_pool.cc:254] collecting diagnostics on the listening RPC socket 0.0.0.0:34031 every 8 connection(s)
I20260928 19:29:04.967377   648 rpc-test-base.h:222] got call: sleep_micros: 8000000 deferred: true
I20260928 19:29:12.971611   648 rpcz_store.cc:275] Call kudu.rpc.GenericCalculatorService.Sleep from 127.0.0.1:48990 (request call id 0) took 8004 ms. Trace:
I20260928 19:29:12.972138   648 rpcz_store.cc:276] 0928 19:29:04.967016 (+     0us) service_pool.cc:170] Inserting onto call queue
0928 19:29:04.967221 (+   205us) service_pool.cc:227] Handling call
0928 19:29:12.971442 (+8004221us) inbound_call.cc:173] Queueing success response
Metrics: {}
[       OK ] Parameters/TestRpc.TestTCPKeepalive/SSL_TCP (8090 ms)
[ RUN      ] Parameters/TestRpc.TestMaxSmallSidecars/SSL_TCP
I20260928 19:29:13.017844   670 acceptor_pool.cc:254] collecting diagnostics on the listening RPC socket 0.0.0.0:40445 every 8 connection(s)
I20260928 19:29:13.018800   671 acceptor_pool.cc:254] collecting diagnostics on the listening RPC socket 0.0.0.0:40445 every 8 connection(s)
[       OK ] Parameters/TestRpc.TestMaxSmallSidecars/SSL_TCP (208 ms)
[ RUN      ] Parameters/TestRpc.TestCallTimeout/SSL_TCP
I20260928 19:29:13.211781   695 acceptor_pool.cc:254] collecting diagnostics on the listening RPC socket 0.0.0.0:41095 every 8 connection(s)
I20260928 19:29:13.212503   696 acceptor_pool.cc:254] collecting diagnostics on the listening RPC socket 0.0.0.0:41095 every 8 connection(s)
I20260928 19:29:13.233656   390 rpc-test-base.h:595] status: Timed out: connection negotiation to 0.0.0.0:41095 for RPC Sleep timed out after 0.000s (ON_OUTBOUND_QUEUE), seconds elapsed: 0.00253281
I20260928 19:29:13.242127   699 rpc-test-base.h:222] got call: sleep_micros: 700000
I20260928 19:29:13.434950   390 rpc-test-base.h:595] status: Timed out: Sleep RPC to 0.0.0.0:41095 timed out after 0.200s (SENT), seconds elapsed: 0.20086
I20260928 19:29:13.436604   698 rpc-test-base.h:222] got call: sleep_micros: 2000000
W20260928 19:29:13.942902   699 rpcz_store.cc:267] Call kudu.rpc.GenericCalculatorService.Sleep from 127.0.0.1:52832 (request call id 1) took 701 ms (client timeout 200 ms). Trace:
W20260928 19:29:13.943265   699 rpcz_store.cc:269] 0928 19:29:13.241937 (+     0us) service_pool.cc:170] Inserting onto call queue
0928 19:29:13.242056 (+   119us) service_pool.cc:227] Handling call
0928 19:29:13.942839 (+700783us) inbound_call.cc:173] Queueing success response
Metrics: {}
I20260928 19:29:14.937511   390 rpc-test-base.h:595] status: Timed out: Sleep RPC to 0.0.0.0:41095 timed out after 1.500s (SENT), seconds elapsed: 1.50219
W20260928 19:29:15.437145   698 rpcz_store.cc:267] Call kudu.rpc.GenericCalculatorService.Sleep from 127.0.0.1:52832 (request call id 2) took 2000 ms (client timeout 1500 ms). Trace:
W20260928 19:29:15.437455   698 rpcz_store.cc:269] 0928 19:29:13.436293 (+     0us) service_pool.cc:170] Inserting onto call queue
0928 19:29:13.436436 (+   143us) service_pool.cc:227] Handling call
0928 19:29:15.437092 (+2000656us) inbound_call.cc:173] Queueing success response
Metrics: {}
W20260928 19:29:15.437973   692 connection.cc:441] server connection from 127.0.0.1:52832 torn down before Call kudu.rpc.GenericCalculatorService.Sleep from 127.0.0.1:52832 (request call id 2) could send its response
[       OK ] Parameters/TestRpc.TestCallTimeout/SSL_TCP (2247 ms)
[ RUN      ] Parameters/TestRpc.TestServerShutsDown/SSL_TCP
I20260928 19:29:15.445573   390 rpc-test.cc:1125] Connecting to 0.0.0.0:41591
W20260928 19:29:15.454152   712 negotiation.cc:337] Failed RPC negotiation. Trace:
0928 19:29:15.452695 (+     0us) reactor.cc:625] Submitting negotiation task for client connection to 0.0.0.0:41591 (local address 127.0.0.1:48102)
0928 19:29:15.453112 (+   417us) negotiation.cc:107] Waiting for socket to connect
0928 19:29:15.453141 (+    29us) client_negotiation.cc:174] Beginning negotiation
0928 19:29:15.453354 (+   213us) client_negotiation.cc:252] Sending NEGOTIATE NegotiatePB request
0928 19:29:15.453574 (+   220us) negotiation.cc:327] Negotiation complete: Network error: Client connection negotiation failed: client connection to 0.0.0.0:41591: BlockingWrite error: write error: Broken pipe (error 32)
Metrics: {"client-negotiator.queue_time_us":106}
[       OK ] Parameters/TestRpc.TestServerShutsDown/SSL_TCP (12 ms)
[ RUN      ] Parameters/TestRpc.TimedOutOnResponseMetric/SSL_TCP
I20260928 19:29:15.489321   729 acceptor_pool.cc:254] collecting diagnostics on the listening RPC socket 0.0.0.0:35257 every 8 connection(s)
I20260928 19:29:15.490056   730 acceptor_pool.cc:254] collecting diagnostics on the listening RPC socket 0.0.0.0:35257 every 8 connection(s)
W20260928 19:29:15.734404   733 rpcz_store.cc:267] Call kudu.rpc_test.CalculatorService.Sleep from 127.0.0.1:53398 (request call id 3) took 50 ms (client timeout 25 ms). Trace:
W20260928 19:29:15.734831   733 rpcz_store.cc:269] 0928 19:29:15.683775 (+     0us) service_pool.cc:170] Inserting onto call queue
0928 19:29:15.683916 (+   141us) service_pool.cc:227] Handling call
0928 19:29:15.734328 (+ 50412us) inbound_call.cc:173] Queueing success response
Related trace 'test_child':
Metrics: {"test_sleep_us":50000,"child_traces":[["test_child",{"related_trace_metric":1}]]}
W20260928 19:29:15.794118   733 rpcz_store.cc:267] Call kudu.rpc_test.CalculatorService.Sleep from 127.0.0.1:53398 (request call id 4) took 50 ms (client timeout 50 ms). Trace:
W20260928 19:29:15.794452   733 rpcz_store.cc:269] 0928 19:29:15.743500 (+     0us) service_pool.cc:170] Inserting onto call queue
0928 19:29:15.743665 (+   165us) service_pool.cc:227] Handling call
0928 19:29:15.794060 (+ 50395us) inbound_call.cc:173] Queueing success response
Related trace 'test_child':
Metrics: {"test_sleep_us":50000,"child_traces":[["test_child",{"related_trace_metric":1}]]}
[       OK ] Parameters/TestRpc.TimedOutOnResponseMetric/SSL_TCP (348 ms)
[ RUN      ] Parameters/TestRpc.AcceptorDispatchingTimesMetric/SSL_TCP
I20260928 19:29:15.817397   754 acceptor_pool.cc:254] collecting diagnostics on the listening RPC socket 0.0.0.0:34047 every 8 connection(s)
I20260928 19:29:15.818179   755 acceptor_pool.cc:254] collecting diagnostics on the listening RPC socket 0.0.0.0:34047 every 8 connection(s)
W20260928 19:29:15.824615   750 negotiation.cc:337] Failed RPC negotiation. Trace:
0928 19:29:15.822361 (+     0us) reactor.cc:625] Submitting negotiation task for server connection from 127.0.0.1:36514 (local address 127.0.0.1:34047)
0928 19:29:15.823019 (+   658us) server_negotiation.cc:206] Beginning negotiation
0928 19:29:15.823048 (+    29us) server_negotiation.cc:399] Waiting for connection header
0928 19:29:15.823431 (+   383us) negotiation.cc:327] Negotiation complete: Network error: Server connection negotiation failed: server connection from 127.0.0.1:36514: BlockingRecv error: recv got EOF from 127.0.0.1:36514 (error 108)
Metrics: {"server-negotiator.queue_time_us":105}
[       OK ] Parameters/TestRpc.AcceptorDispatchingTimesMetric/SSL_TCP (22 ms)
[ RUN      ] Parameters/TestRpc.TestRpcCallbackDestroysMessenger/SSL_TCP
[       OK ] Parameters/TestRpc.TestRpcCallbackDestroysMessenger/SSL_TCP (28 ms)
[ RUN      ] Parameters/TestRpc.TestApplicationFeatureFlag/SSL_TCP
I20260928 19:29:15.892146   779 acceptor_pool.cc:254] collecting diagnostics on the listening RPC socket 0.0.0.0:35487 every 8 connection(s)
I20260928 19:29:15.893051   780 acceptor_pool.cc:254] collecting diagnostics on the listening RPC socket 0.0.0.0:35487 every 8 connection(s)
W20260928 19:29:15.925976   778 messenger.cc:357] Unable to handle RPC call: Not implemented: call requires unsupported application feature flags: 99
[       OK ] Parameters/TestRpc.TestApplicationFeatureFlag/SSL_TCP (79 ms)
[ RUN      ] Parameters/TestRpc.TestCancellation/SSL_TCP
I20260928 19:29:15.952999   804 acceptor_pool.cc:254] collecting diagnostics on the listening RPC socket 0.0.0.0:36133 every 8 connection(s)
I20260928 19:29:15.953714   805 acceptor_pool.cc:254] collecting diagnostics on the listening RPC socket 0.0.0.0:36133 every 8 connection(s)
I20260928 19:29:15.956959   390 rpc-test.cc:1648] Connecting to 0.0.0.0:36133
I20260928 19:29:16.076103   390 rpc-test-base.h:595] status: Aborted: Sleep RPC to 0.0.0.0:36133 is cancelled in state READY, seconds elapsed: 0.000416339
I20260928 19:29:16.218097   390 rpc-test-base.h:595] status: Aborted: Sleep RPC to 0.0.0.0:36133 is cancelled in state SENT, seconds elapsed: 0.000914344
I20260928 19:29:16.261371   807 rpc-test-base.h:222] got call: sleep_micros: 510000
I20260928 19:29:16.382151   390 rpc-test-base.h:595] status: Aborted: Sleep RPC to 0.0.0.0:36133 is cancelled in state SENT, seconds elapsed: 0.000796956
I20260928 19:29:16.421830   806 rpc-test-base.h:222] got call: sleep_micros: 510000
I20260928 19:29:16.559623   390 rpc-test-base.h:595] status: Aborted: Sleep RPC to 0.0.0.0:36133 is cancelled in state SENT, seconds elapsed: 0.000906813
W20260928 19:29:16.596583   808 rpcz_store.cc:267] Call kudu.rpc.GenericCalculatorService.Sleep from 127.0.0.1:34608 (request call id 11) took 14 ms (client timeout 10 ms). Trace:
W20260928 19:29:16.596925   808 rpcz_store.cc:269] 0928 19:29:16.581540 (+     0us) service_pool.cc:170] Inserting onto call queue
0928 19:29:16.596197 (+ 14657us) service_pool.cc:214] Skipping call since client already timed out
0928 19:29:16.596283 (+    86us) inbound_call.cc:173] Queueing failure response
Metrics: {}
I20260928 19:29:16.597478   808 rpc-test-base.h:222] got call: sleep_micros: 1500000
W20260928 19:29:16.772089   807 rpcz_store.cc:267] Call kudu.rpc.GenericCalculatorService.Sleep from 127.0.0.1:34608 (request call id 3) took 511 ms (client timeout 10 ms). Trace:
W20260928 19:29:16.772478   807 rpcz_store.cc:269] 0928 19:29:16.261098 (+     0us) service_pool.cc:170] Inserting onto call queue
0928 19:29:16.261290 (+   192us) service_pool.cc:227] Handling call
0928 19:29:16.772036 (+510746us) inbound_call.cc:173] Queueing success response
Metrics: {}
W20260928 19:29:16.932497   806 rpcz_store.cc:267] Call kudu.rpc.GenericCalculatorService.Sleep from 127.0.0.1:34608 (request call id 7) took 510 ms (client timeout 10 ms). Trace:
W20260928 19:29:16.932894   806 rpcz_store.cc:269] 0928 19:29:16.421646 (+     0us) service_pool.cc:170] Inserting onto call queue
0928 19:29:16.421774 (+   128us) service_pool.cc:227] Handling call
0928 19:29:16.932443 (+510669us) inbound_call.cc:173] Queueing success response
Metrics: {}
I20260928 19:29:17.562053   390 rpc-test-base.h:595] status: Timed out: Sleep RPC to 0.0.0.0:36133 timed out after 1.000s (SENT), seconds elapsed: 1.00198
I20260928 19:29:17.563446   806 rpc-test-base.h:222] got call: sleep_micros: 1500000
W20260928 19:29:18.098094   808 rpcz_store.cc:267] Call kudu.rpc.GenericCalculatorService.Sleep from 127.0.0.1:34608 (request call id 12) took 1516 ms (client timeout 1000 ms). Trace:
W20260928 19:29:18.098420   808 rpcz_store.cc:269] 0928 19:29:16.581754 (+     0us) service_pool.cc:170] Inserting onto call queue
0928 19:29:16.597442 (+ 15688us) service_pool.cc:227] Handling call
0928 19:29:18.098042 (+1500600us) inbound_call.cc:173] Queueing success response
Metrics: {}
I20260928 19:29:18.564074   390 rpc-test-base.h:595] status: Timed out: Sleep RPC to 0.0.0.0:36133 timed out after 1.000s (SENT), seconds elapsed: 1.00171
W20260928 19:29:18.565445   801 messenger.cc:357] Unable to handle RPC call: Not implemented: call requires unsupported application feature flags: 99, 1
W20260928 19:29:18.566960   801 messenger.cc:357] Unable to handle RPC call: Not implemented: call requires unsupported application feature flags: 99, 1
W20260928 19:29:19.064020   806 rpcz_store.cc:267] Call kudu.rpc.GenericCalculatorService.Sleep from 127.0.0.1:34608 (request call id 13) took 1500 ms (client timeout 1000 ms). Trace:
W20260928 19:29:19.064389   806 rpcz_store.cc:269] 0928 19:29:17.563261 (+     0us) service_pool.cc:170] Inserting onto call queue
0928 19:29:17.563389 (+   128us) service_pool.cc:227] Handling call
0928 19:29:19.063966 (+1500577us) inbound_call.cc:173] Queueing success response
Metrics: {}
W20260928 19:29:19.065037   801 connection.cc:441] server connection from 127.0.0.1:34608 torn down before Call kudu.rpc.GenericCalculatorService.Sleep from 127.0.0.1:34608 (request call id 13) could send its response
[       OK ] Parameters/TestRpc.TestCancellation/SSL_TCP (3136 ms)
[ RUN      ] Parameters/TestRpc.TestCancellationMultiThreads/SSL_TCP
I20260928 19:29:19.096839   829 acceptor_pool.cc:254] collecting diagnostics on the listening RPC socket 0.0.0.0:38231 every 8 connection(s)
I20260928 19:29:19.097527   830 acceptor_pool.cc:254] collecting diagnostics on the listening RPC socket 0.0.0.0:38231 every 8 connection(s)
I20260928 19:29:19.100805   390 rpc-test.cc:1808] Connecting to 0.0.0.0:38231
I20260928 19:29:19.242908   843 test_util.cc:268] Using random seed: 353932920
I20260928 19:29:19.244469   844 test_util.cc:268] Using random seed: 353934492
I20260928 19:29:19.246064   845 test_util.cc:268] Using random seed: 353936089
I20260928 19:29:19.247319   846 test_util.cc:268] Using random seed: 353937329
I20260928 19:29:19.249059   847 test_util.cc:268] Using random seed: 353938935
I20260928 19:29:19.250412   848 test_util.cc:268] Using random seed: 353940286
I20260928 19:29:19.252017   849 test_util.cc:268] Using random seed: 353941899
I20260928 19:29:19.253918   850 test_util.cc:268] Using random seed: 353943829
I20260928 19:29:19.256140   851 test_util.cc:268] Using random seed: 353946041
I20260928 19:29:19.257654   852 test_util.cc:268] Using random seed: 353947262
I20260928 19:29:19.258975   853 test_util.cc:268] Using random seed: 353948882
I20260928 19:29:19.260708   854 test_util.cc:268] Using random seed: 353950596
I20260928 19:29:19.262606   855 test_util.cc:268] Using random seed: 353952473
I20260928 19:29:19.264688   856 test_util.cc:268] Using random seed: 353954588
I20260928 19:29:19.266561   857 test_util.cc:268] Using random seed: 353956019
I20260928 19:29:19.267997   858 test_util.cc:268] Using random seed: 353957907
I20260928 19:29:19.269944   859 test_util.cc:268] Using random seed: 353959811
I20260928 19:29:19.271912   860 test_util.cc:268] Using random seed: 353961775
I20260928 19:29:19.275516   861 test_util.cc:268] Using random seed: 353965342
I20260928 19:29:19.277752   862 test_util.cc:268] Using random seed: 353967638
I20260928 19:29:19.280521   863 test_util.cc:268] Using random seed: 353970386
I20260928 19:29:19.282446   864 test_util.cc:268] Using random seed: 353972339
I20260928 19:29:19.284341   865 test_util.cc:268] Using random seed: 353974250
I20260928 19:29:19.287350   866 test_util.cc:268] Using random seed: 353977083
I20260928 19:29:19.288862   867 test_util.cc:268] Using random seed: 353978776
I20260928 19:29:19.290829   868 test_util.cc:268] Using random seed: 353980718
I20260928 19:29:19.292717   869 test_util.cc:268] Using random seed: 353982613
I20260928 19:29:19.294616   870 test_util.cc:268] Using random seed: 353984475
I20260928 19:29:19.296329   871 test_util.cc:268] Using random seed: 353986272
I20260928 19:29:19.297431   872 test_util.cc:268] Using random seed: 353987368
[       OK ] Parameters/TestRpc.TestCancellationMultiThreads/SSL_TCP (18435 ms)
[ RUN      ] Parameters/TestRpc.TestCallId/SSL_TCP
I20260928 19:29:37.534523   886 acceptor_pool.cc:254] collecting diagnostics on the listening RPC socket 0.0.0.0:32855 every 8 connection(s)
I20260928 19:29:37.535157   887 acceptor_pool.cc:254] collecting diagnostics on the listening RPC socket 0.0.0.0:32855 every 8 connection(s)
[       OK ] Parameters/TestRpc.TestCallId/SSL_TCP (87 ms)
[----------] 20 tests from Parameters/TestRpc (38294 ms total)

[----------] Global test environment tear-down
[==========] 21 tests from 2 test suites ran. (38301 ms total)
[  PASSED  ] 20 tests.
[  FAILED  ] 1 test, listed below:
[  FAILED  ] Parameters/TestRpc.TestCallWithChainCertAndRootCA/SSL_TCP, where GetParam() = (true, false)

 1 FAILED TEST