Diagnosed failure
Parameters/TestRpc.TestCallWithChainCertAndChainCA/SSL_UnixSocket: /data0/somelongdirectorytoavoidrpathissues/src/kudu/src/kudu/rpc/rpc-test.cc:270: Failure
Failed
Bad status: Runtime error: could not verify certificate chain (error with cert: subject=CN = localhost, ST = sadfjas, C = AS, emailAddress = sdflkdsajf, O = lskdfjlsad, OU = sldfkja, issuer=C = AS, ST = ASDfkjdhf, L = lskdjf, O = saldfja, OU = skdjf, CN = localhost, emailAddress = sadjflkadsj): : certificate has expired
Google Test trace:
/data0/somelongdirectorytoavoidrpathissues/src/kudu/src/kudu/rpc/rpc-test.cc:267: Connecting to unix:/tmp/dist-test-taskrIXwTe/test-tmp/rpc-test-9483bbc6902146e8bac85929035693e2.sock
I20260927 13:46:19.341516 3453 test_util.cc:175] -----------------------------------------------
I20260927 13:46:19.341629 3453 test_util.cc:176] Had fatal failures, leaving test files at /tmp/dist-test-taskrIXwTe/test-tmp/rpc-test.6.Parameters_TestRpc.TestCallWithChainCertAndChainCA_SSL_UnixSocket.1790516779217020-3453-0
Full log
Note: This is test shard 7 of 8.
[==========] Running 21 tests from 2 test suites.
[----------] Global test environment set-up.
[----------] 20 tests from Parameters/TestRpc
[ RUN ] Parameters/TestRpc.TestMessengerCreateDestroy/SSL_UnixSocket
WARNING: Logging before InitGoogleLogging() is written to STDERR
I20260927 13:46:19.272019 3453 rpc-test.cc:169] started messenger TestCreateDestroy
[ OK ] Parameters/TestRpc.TestMessengerCreateDestroy/SSL_UnixSocket (38 ms)
[ RUN ] Parameters/TestRpc.TestNegotiationDeadlock/SSL_UnixSocket
I20260927 13:46:19.292593 3473 acceptor_pool.cc:254] collecting diagnostics on the listening RPC socket unix:/tmp/dist-test-taskrIXwTe/test-tmp/rpc-test-3bca9fc4fb7f42f7b2398a86c90e33cb.sock every 8 connection(s)
I20260927 13:46:19.292941 3474 acceptor_pool.cc:254] collecting diagnostics on the listening RPC socket unix:/tmp/dist-test-taskrIXwTe/test-tmp/rpc-test-3bca9fc4fb7f42f7b2398a86c90e33cb.sock every 8 connection(s)
[ OK ] Parameters/TestRpc.TestNegotiationDeadlock/SSL_UnixSocket (38 ms)
[ RUN ] Parameters/TestRpc.TestCallWithChainCertAndChainCA/SSL_UnixSocket
I20260927 13:46:19.327596 3489 acceptor_pool.cc:254] collecting diagnostics on the listening RPC socket unix:/tmp/dist-test-taskrIXwTe/test-tmp/rpc-test-9483bbc6902146e8bac85929035693e2.sock every 8 connection(s)
I20260927 13:46:19.328038 3490 acceptor_pool.cc:254] collecting diagnostics on the listening RPC socket unix:/tmp/dist-test-taskrIXwTe/test-tmp/rpc-test-9483bbc6902146e8bac85929035693e2.sock every 8 connection(s)
/data0/somelongdirectorytoavoidrpathissues/src/kudu/src/kudu/rpc/rpc-test.cc:270: Failure
Failed
Bad status: Runtime error: could not verify certificate chain (error with cert: subject=CN = localhost, ST = sadfjas, C = AS, emailAddress = sdflkdsajf, O = lskdfjlsad, OU = sldfkja, issuer=C = AS, ST = ASDfkjdhf, L = lskdjf, O = saldfja, OU = skdjf, CN = localhost, emailAddress = sadjflkadsj): : certificate has expired
Google Test trace:
/data0/somelongdirectorytoavoidrpathissues/src/kudu/src/kudu/rpc/rpc-test.cc:267: Connecting to unix:/tmp/dist-test-taskrIXwTe/test-tmp/rpc-test-9483bbc6902146e8bac85929035693e2.sock
I20260927 13:46:19.341516 3453 test_util.cc:175] -----------------------------------------------
I20260927 13:46:19.341629 3453 test_util.cc:176] Had fatal failures, leaving test files at /tmp/dist-test-taskrIXwTe/test-tmp/rpc-test.6.Parameters_TestRpc.TestCallWithChainCertAndChainCA_SSL_UnixSocket.1790516779217020-3453-0
[ FAILED ] Parameters/TestRpc.TestCallWithChainCertAndChainCA/SSL_UnixSocket, where GetParam() = (true, true) (27 ms)
[ RUN ] Parameters/TestRpc.TestCallWithPasswordProtectedKey/SSL_UnixSocket
I20260927 13:46:19.358821 3514 acceptor_pool.cc:254] collecting diagnostics on the listening RPC socket unix:/tmp/dist-test-taskrIXwTe/test-tmp/rpc-test-4979535a970c47f7a77cc89b56838c2d.sock every 8 connection(s)
I20260927 13:46:19.359109 3515 acceptor_pool.cc:254] collecting diagnostics on the listening RPC socket unix:/tmp/dist-test-taskrIXwTe/test-tmp/rpc-test-4979535a970c47f7a77cc89b56838c2d.sock every 8 connection(s)
W20260927 13:46:19.392185 3511 connection.cc:196] Error closing socket: Network error: TlsSocket::Close: Broken pipe
[ OK ] Parameters/TestRpc.TestCallWithPasswordProtectedKey/SSL_UnixSocket (55 ms)
[ RUN ] Parameters/TestRpc.TestCallToBadServer/SSL_UnixSocket
I20260927 13:46:19.412797 3453 rpc-test.cc:394] Status: Network error: Client connection negotiation failed: client connection to 0.0.0.0:0: connect: Connection refused (error 111)
I20260927 13:46:19.413642 3453 rpc-test.cc:394] Status: Network error: Client connection negotiation failed: client connection to 0.0.0.0:0: connect: Connection refused (error 111)
I20260927 13:46:19.414505 3453 rpc-test.cc:394] Status: Network error: Client connection negotiation failed: client connection to 0.0.0.0:0: connect: Connection refused (error 111)
I20260927 13:46:19.415238 3453 rpc-test.cc:394] Status: Network error: Client connection negotiation failed: client connection to 0.0.0.0:0: connect: Connection refused (error 111)
I20260927 13:46:19.416051 3453 rpc-test.cc:394] Status: Network error: Client connection negotiation failed: client connection to 0.0.0.0:0: connect: Connection refused (error 111)
[ OK ] Parameters/TestRpc.TestCallToBadServer/SSL_UnixSocket (21 ms)
[ RUN ] Parameters/TestRpc.TestWrongService/SSL_UnixSocket
I20260927 13:46:19.455807 3549 acceptor_pool.cc:254] collecting diagnostics on the listening RPC socket unix:/tmp/dist-test-taskrIXwTe/test-tmp/rpc-test-d4355639d5374cbdbc34c58d00755663.sock every 8 connection(s)
I20260927 13:46:19.456086 3550 acceptor_pool.cc:254] collecting diagnostics on the listening RPC socket unix:/tmp/dist-test-taskrIXwTe/test-tmp/rpc-test-d4355639d5374cbdbc34c58d00755663.sock every 8 connection(s)
I20260927 13:46:19.488349 3546 messenger.cc:345] service WrongServiceName not registered on TestServer
[ OK ] Parameters/TestRpc.TestWrongService/SSL_UnixSocket (75 ms)
[ RUN ] Parameters/TestRpc.TestConnectionKeepalive/SSL_UnixSocket
I20260927 13:46:19.524021 3572 acceptor_pool.cc:254] collecting diagnostics on the listening RPC socket unix:/tmp/dist-test-taskrIXwTe/test-tmp/rpc-test-b92e7d4171b1429eaa68a145aee8657a.sock every 8 connection(s)
I20260927 13:46:19.524264 3573 acceptor_pool.cc:254] collecting diagnostics on the listening RPC socket unix:/tmp/dist-test-taskrIXwTe/test-tmp/rpc-test-b92e7d4171b1429eaa68a145aee8657a.sock every 8 connection(s)
I20260927 13:46:19.525166 3453 rpc-test.cc:488] Connecting to unix:/tmp/dist-test-taskrIXwTe/test-tmp/rpc-test-b92e7d4171b1429eaa68a145aee8657a.sock
W20260927 13:46:19.996801 3585 connection.cc:196] Error closing socket: Network error: TlsSocket::Close: Broken pipe
[ OK ] Parameters/TestRpc.TestConnectionKeepalive/SSL_UnixSocket (1075 ms)
[ RUN ] Parameters/TestRpc.TestClientConnectionMetrics/SSL_UnixSocket
I20260927 13:46:20.594583 3597 acceptor_pool.cc:254] collecting diagnostics on the listening RPC socket unix:/tmp/dist-test-taskrIXwTe/test-tmp/rpc-test-27b9643e35514b4ea43f3da6644dcca2.sock every 8 connection(s)
I20260927 13:46:20.594936 3598 acceptor_pool.cc:254] collecting diagnostics on the listening RPC socket unix:/tmp/dist-test-taskrIXwTe/test-tmp/rpc-test-27b9643e35514b4ea43f3da6644dcca2.sock every 8 connection(s)
I20260927 13:46:20.595950 3453 rpc-test.cc:569] Connecting to unix:/tmp/dist-test-taskrIXwTe/test-tmp/rpc-test-27b9643e35514b4ea43f3da6644dcca2.sock
W20260927 13:46:43.301749 3594 connection.cc:196] Error closing socket: Network error: TlsSocket::Close: Broken pipe
[ OK ] Parameters/TestRpc.TestClientConnectionMetrics/SSL_UnixSocket (22738 ms)
[ RUN ] Parameters/TestRpc.TestCredentialsPolicy/SSL_UnixSocket
I20260927 13:46:43.331722 3620 acceptor_pool.cc:254] collecting diagnostics on the listening RPC socket unix:/tmp/dist-test-taskrIXwTe/test-tmp/rpc-test-d8e973a0b63f4936bb2c01ca10eee63e.sock every 8 connection(s)
I20260927 13:46:43.331984 3621 acceptor_pool.cc:254] collecting diagnostics on the listening RPC socket unix:/tmp/dist-test-taskrIXwTe/test-tmp/rpc-test-d8e973a0b63f4936bb2c01ca10eee63e.sock every 8 connection(s)
I20260927 13:46:43.333014 3453 rpc-test.cc:700] Connecting to unix:/tmp/dist-test-taskrIXwTe/test-tmp/rpc-test-d8e973a0b63f4936bb2c01ca10eee63e.sock
W20260927 13:46:43.356124 3619 connection.cc:196] Error closing socket: Network error: TlsSocket::Close: Broken pipe
W20260927 13:46:43.364528 3619 connection.cc:196] Error closing socket: Network error: TlsSocket::Close: Broken pipe
[ OK ] Parameters/TestRpc.TestCredentialsPolicy/SSL_UnixSocket (59 ms)
[ RUN ] Parameters/TestRpc.TestCallLongerThanKeepalive/SSL_UnixSocket
I20260927 13:46:43.385053 3645 acceptor_pool.cc:254] collecting diagnostics on the listening RPC socket unix:/tmp/dist-test-taskrIXwTe/test-tmp/rpc-test-394b7dec60f543b99091c73d5dc007cc.sock every 8 connection(s)
I20260927 13:46:43.385265 3646 acceptor_pool.cc:254] collecting diagnostics on the listening RPC socket unix:/tmp/dist-test-taskrIXwTe/test-tmp/rpc-test-394b7dec60f543b99091c73d5dc007cc.sock every 8 connection(s)
I20260927 13:46:43.418905 3649 rpc-test-base.h:222] got call: sleep_micros: 3000000 deferred: true
I20260927 13:46:46.420811 3649 rpcz_store.cc:275] Call kudu.rpc.GenericCalculatorService.Sleep from unix:<unnamed> (request call id 0) took 3002 ms. Trace:
I20260927 13:46:46.421044 3649 rpcz_store.cc:276] 0927 13:46:43.418729 (+ 0us) service_pool.cc:170] Inserting onto call queue
0927 13:46:43.418851 (+ 122us) service_pool.cc:227] Handling call
0927 13:46:46.420739 (+3001888us) inbound_call.cc:173] Queueing success response
Metrics: {}
[ OK ] Parameters/TestRpc.TestCallLongerThanKeepalive/SSL_UnixSocket (3060 ms)
[ RUN ] Parameters/TestRpc.TestRpcSidecar/SSL_UnixSocket
I20260927 13:46:46.468187 3670 acceptor_pool.cc:254] collecting diagnostics on the listening RPC socket unix:/tmp/dist-test-taskrIXwTe/test-tmp/rpc-test-bc0c5f7f1a2a420489e9b05c6f9be757.sock every 8 connection(s)
I20260927 13:46:46.468479 3671 acceptor_pool.cc:254] collecting diagnostics on the listening RPC socket unix:/tmp/dist-test-taskrIXwTe/test-tmp/rpc-test-bc0c5f7f1a2a420489e9b05c6f9be757.sock every 8 connection(s)
W20260927 13:46:46.584017 3667 connection.cc:196] Error closing socket: Network error: TlsSocket::Close: Broken pipe
[ OK ] Parameters/TestRpc.TestRpcSidecar/SSL_UnixSocket (160 ms)
[ RUN ] Parameters/TestRpc.TestRpcSidecarLimits/SSL_UnixSocket
I20260927 13:46:48.890674 3695 acceptor_pool.cc:254] collecting diagnostics on the listening RPC socket unix:/tmp/dist-test-taskrIXwTe/test-tmp/rpc-test-0b3e6cea54be4e2b881d7252d75bc8d8.sock every 8 connection(s)
I20260927 13:46:48.890935 3696 acceptor_pool.cc:254] collecting diagnostics on the listening RPC socket unix:/tmp/dist-test-taskrIXwTe/test-tmp/rpc-test-0b3e6cea54be4e2b881d7252d75bc8d8.sock every 8 connection(s)
W20260927 13:46:48.909015 3453 serialization.cc:72] Serialized kudu.rpc_test.PushStringsRequestPB (2147483654 bytes) is larger than the maximum configured RPC message size (52428800 bytes). Sending anyway, but peer may reject the data.
W20260927 13:46:48.915829 3692 connection.cc:535] server connection from unix:<unnamed> recv error: Network error: RPC frame had a length of 2147483714, but we only support messages up to 52428800 bytes long.
W20260927 13:46:48.916004 3692 connection.cc:158] shutting down server connection from unix:<unnamed> with pending inbound data: 4/2147483714 bytes received; last active 0 ns ago: status Network error: RPC frame had a length of 2147483714, but we only support messages up to 52428800 bytes long.
W20260927 13:46:48.916446 3708 connection.cc:196] Error closing socket: Network error: TlsSocket::Close: Broken pipe
I20260927 13:46:48.933828 3720 acceptor_pool.cc:254] collecting diagnostics on the listening RPC socket unix:/tmp/dist-test-taskrIXwTe/test-tmp/rpc-test-0b3e6cea54be4e2b881d7252d75bc8d8.sock every 8 connection(s)
I20260927 13:46:48.934041 3721 acceptor_pool.cc:254] collecting diagnostics on the listening RPC socket unix:/tmp/dist-test-taskrIXwTe/test-tmp/rpc-test-0b3e6cea54be4e2b881d7252d75bc8d8.sock every 8 connection(s)
W20260927 13:46:54.976239 3717 connection.cc:577] server connection from unix:<unnamed>: received bad data: 'Corruption: Invalid packet: message had a length of 2147483710, but we only support messages up to 2147483647 bytes
'
W20260927 13:46:54.977020 3733 connection.cc:196] Error closing socket: Network error: TlsSocket::Close: Broken pipe
[ OK ] Parameters/TestRpc.TestRpcSidecarLimits/SSL_UnixSocket (8858 ms)
[ RUN ] Parameters/TestRpc.TestCallTimeoutDoesntAffectNegotiation/SSL_UnixSocket
I20260927 13:46:55.466737 3745 acceptor_pool.cc:254] collecting diagnostics on the listening RPC socket unix:/tmp/dist-test-taskrIXwTe/test-tmp/rpc-test-70e5367c642845638c8461fdd11cb9dc.sock every 8 connection(s)
I20260927 13:46:55.467020 3746 acceptor_pool.cc:254] collecting diagnostics on the listening RPC socket unix:/tmp/dist-test-taskrIXwTe/test-tmp/rpc-test-70e5367c642845638c8461fdd11cb9dc.sock every 8 connection(s)
W20260927 13:46:55.475558 3741 negotiation.cc:266] Injecting 500ms delay in negotiation
I20260927 13:46:55.526015 3453 rpc-test-base.h:595] status: Timed out: connection negotiation to unix:/tmp/dist-test-taskrIXwTe/test-tmp/rpc-test-70e5367c642845638c8461fdd11cb9dc.sock for RPC Sleep timed out after 0.050s (ON_OUTBOUND_QUEUE), seconds elapsed: 0.0510597
[ OK ] Parameters/TestRpc.TestCallTimeoutDoesntAffectNegotiation/SSL_UnixSocket (539 ms)
[ RUN ] Parameters/TestRpc.TestRpcHandlerLatencyMetric/SSL_UnixSocket
I20260927 13:46:56.011756 3770 acceptor_pool.cc:254] collecting diagnostics on the listening RPC socket unix:/tmp/dist-test-taskrIXwTe/test-tmp/rpc-test-763bfa6b1c7042a7bcd259a49c3fd418.sock every 8 connection(s)
I20260927 13:46:56.012128 3771 acceptor_pool.cc:254] collecting diagnostics on the listening RPC socket unix:/tmp/dist-test-taskrIXwTe/test-tmp/rpc-test-763bfa6b1c7042a7bcd259a49c3fd418.sock every 8 connection(s)
I20260927 13:46:56.065902 3453 rpc-test.cc:1236] Sleep() min lat: 20819
I20260927 13:46:56.066063 3453 rpc-test.cc:1237] Sleep() mean lat: 20819
I20260927 13:46:56.066365 3453 rpc-test.cc:1238] Sleep() max lat: 20819
I20260927 13:46:56.066428 3453 rpc-test.cc:1239] Sleep() #calls: 1
[ OK ] Parameters/TestRpc.TestRpcHandlerLatencyMetric/SSL_UnixSocket (85 ms)
[ RUN ] Parameters/TestRpc.TimedOutOnResponseMetricServiceQueue/SSL_UnixSocket
I20260927 13:46:56.095765 3796 acceptor_pool.cc:254] collecting diagnostics on the listening RPC socket unix:/tmp/dist-test-taskrIXwTe/test-tmp/rpc-test-3d6a30a1b57e430ea6df0c8c530e6322.sock every 8 connection(s)
I20260927 13:46:56.095971 3797 acceptor_pool.cc:254] collecting diagnostics on the listening RPC socket unix:/tmp/dist-test-taskrIXwTe/test-tmp/rpc-test-3d6a30a1b57e430ea6df0c8c530e6322.sock every 8 connection(s)
W20260927 13:46:56.161293 3798 rpcz_store.cc:267] Call kudu.rpc_test.CalculatorService.Sleep from unix:<unnamed> (request call id 2) took 20 ms (client timeout 20 ms). Trace:
W20260927 13:46:56.161465 3798 rpcz_store.cc:269] 0927 13:46:56.140697 (+ 0us) service_pool.cc:170] Inserting onto call queue
0927 13:46:56.161166 (+ 20469us) service_pool.cc:214] Skipping call since client already timed out
0927 13:46:56.161261 (+ 95us) inbound_call.cc:173] Queueing failure response
Metrics: {}
[ OK ] Parameters/TestRpc.TimedOutOnResponseMetricServiceQueue/SSL_UnixSocket (94 ms)
[ RUN ] Parameters/TestRpc.RpcPendingConnectionsMetric/SSL_UnixSocket
I20260927 13:46:56.171494 3819 acceptor_pool.cc:254] collecting diagnostics on the listening RPC socket 0.0.0.0:40305 every 8 connection(s)
I20260927 13:46:56.171679 3820 acceptor_pool.cc:254] collecting diagnostics on the listening RPC socket 0.0.0.0:40305 every 8 connection(s)
W20260927 13:46:56.183616 3815 negotiation.cc:337] Failed RPC negotiation. Trace:
0927 13:46:56.182674 (+ 0us) reactor.cc:625] Submitting negotiation task for server connection from 127.0.0.1:34642 (local address 127.0.0.1:40305)
0927 13:46:56.182889 (+ 215us) server_negotiation.cc:206] Beginning negotiation
0927 13:46:56.182897 (+ 8us) server_negotiation.cc:399] Waiting for connection header
0927 13:46:56.183153 (+ 256us) negotiation.cc:327] Negotiation complete: Network error: Server connection negotiation failed: server connection from 127.0.0.1:34642: BlockingRecv error: recv got EOF from 127.0.0.1:34642 (error 108)
Metrics: {"server-negotiator.queue_time_us":64}
[ OK ] Parameters/TestRpc.RpcPendingConnectionsMetric/SSL_UnixSocket (29 ms)
[ RUN ] Parameters/TestRpc.TestRpcContextClientDeadline/SSL_UnixSocket
I20260927 13:46:56.216109 3835 acceptor_pool.cc:254] collecting diagnostics on the listening RPC socket unix:/tmp/dist-test-taskrIXwTe/test-tmp/rpc-test-b3dd1a1a51954e2f829734ee36c149aa.sock every 8 connection(s)
I20260927 13:46:56.216320 3836 acceptor_pool.cc:254] collecting diagnostics on the listening RPC socket unix:/tmp/dist-test-taskrIXwTe/test-tmp/rpc-test-b3dd1a1a51954e2f829734ee36c149aa.sock every 8 connection(s)
[ OK ] Parameters/TestRpc.TestRpcContextClientDeadline/SSL_UnixSocket (60 ms)
[ RUN ] Parameters/TestRpc.TestApplicationFeatureFlagUnsupportedServer/SSL_UnixSocket
I20260927 13:46:56.284510 3860 acceptor_pool.cc:254] collecting diagnostics on the listening RPC socket unix:/tmp/dist-test-taskrIXwTe/test-tmp/rpc-test-d0419487ef2a49f48f45bfa5fc7fd81c.sock every 8 connection(s)
I20260927 13:46:56.284763 3861 acceptor_pool.cc:254] collecting diagnostics on the listening RPC socket unix:/tmp/dist-test-taskrIXwTe/test-tmp/rpc-test-d0419487ef2a49f48f45bfa5fc7fd81c.sock every 8 connection(s)
[ OK ] Parameters/TestRpc.TestApplicationFeatureFlagUnsupportedServer/SSL_UnixSocket (65 ms)
[ RUN ] Parameters/TestRpc.TestCancellationAsync/SSL_UnixSocket
I20260927 13:46:56.344108 3885 acceptor_pool.cc:254] collecting diagnostics on the listening RPC socket unix:/tmp/dist-test-taskrIXwTe/test-tmp/rpc-test-43ec2bc9b7094372a7f9a689bbcd90f6.sock every 8 connection(s)
I20260927 13:46:56.344336 3886 acceptor_pool.cc:254] collecting diagnostics on the listening RPC socket unix:/tmp/dist-test-taskrIXwTe/test-tmp/rpc-test-43ec2bc9b7094372a7f9a689bbcd90f6.sock every 8 connection(s)
I20260927 13:46:56.345371 3453 rpc-test.cc:1716] Connecting to unix:/tmp/dist-test-taskrIXwTe/test-tmp/rpc-test-43ec2bc9b7094372a7f9a689bbcd90f6.sock
I20260927 13:46:56.362483 3453 test_util.cc:268] Using random seed: 785234910
I20260927 13:46:56.396893 3889 rpc-test-base.h:240] got call: sleep_micros: 500 pattern: 4294967295 num_repetitions: 2097152 sidecar_idx: 0
I20260927 13:46:56.426435 3888 rpc-test-base.h:240] got call: sleep_micros: 500 pattern: 4294967295 num_repetitions: 2097152 sidecar_idx: 0
I20260927 13:46:56.457180 3889 rpc-test-base.h:240] got call: sleep_micros: 500 pattern: 4294967295 num_repetitions: 2097152 sidecar_idx: 0
I20260927 13:46:56.487900 3888 rpc-test-base.h:240] got call: sleep_micros: 500 pattern: 4294967295 num_repetitions: 2097152 sidecar_idx: 0
I20260927 13:46:56.519249 3889 rpc-test-base.h:240] got call: sleep_micros: 500 pattern: 4294967295 num_repetitions: 2097152 sidecar_idx: 0
I20260927 13:46:56.548518 3888 rpc-test-base.h:240] got call: sleep_micros: 500 pattern: 4294967295 num_repetitions: 2097152 sidecar_idx: 0
I20260927 13:46:56.579911 3889 rpc-test-base.h:240] got call: sleep_micros: 500 pattern: 4294967295 num_repetitions: 2097152 sidecar_idx: 0
I20260927 13:46:56.609766 3888 rpc-test-base.h:240] got call: sleep_micros: 500 pattern: 4294967295 num_repetitions: 2097152 sidecar_idx: 0
W20260927 13:46:56.612210 3882 connection.cc:196] Error closing socket: Network error: TlsSocket::Close: Broken pipe
W20260927 13:46:56.625545 3882 connection.cc:441] server connection from unix:<unnamed> torn down before Call kudu.rpc.GenericCalculatorService.SleepWithSidecar from unix:<unnamed> (request call id 8) could send its response
W20260927 13:46:56.645099 3882 connection.cc:441] server connection from unix:<unnamed> torn down before Call kudu.rpc.GenericCalculatorService.SleepWithSidecar from unix:<unnamed> (request call id 9) could send its response
[ OK ] Parameters/TestRpc.TestCancellationAsync/SSL_UnixSocket (325 ms)
[ RUN ] Parameters/TestRpc.TestPerformanceBySocketType/SSL_UnixSocket
I20260927 13:46:56.678885 3910 acceptor_pool.cc:254] collecting diagnostics on the listening RPC socket unix:/tmp/dist-test-taskrIXwTe/test-tmp/rpc-test-ea7747126727412ebf35e01484eb2c35.sock every 8 connection(s)
I20260927 13:46:56.679123 3911 acceptor_pool.cc:254] collecting diagnostics on the listening RPC socket unix:/tmp/dist-test-taskrIXwTe/test-tmp/rpc-test-ea7747126727412ebf35e01484eb2c35.sock every 8 connection(s)
I20260927 13:46:56.680163 3453 rpc-test.cc:1846] Connecting to unix:/tmp/dist-test-taskrIXwTe/test-tmp/rpc-test-ea7747126727412ebf35e01484eb2c35.sock
I20260927 13:47:00.080202 3453 rpc-test.cc:1859] Sending 1024MB via ssl-enabled unix socket: real 3.389s user 3.133s sys 2.589s
I20260927 13:47:03.542919 3453 rpc-test.cc:1859] Sending 1024MB via ssl-enabled unix socket: real 3.463s user 3.491s sys 2.352s
I20260927 13:47:06.980019 3453 rpc-test.cc:1859] Sending 1024MB via ssl-enabled unix socket: real 3.437s user 3.383s sys 2.432s
I20260927 13:47:10.470916 3453 rpc-test.cc:1859] Sending 1024MB via ssl-enabled unix socket: real 3.491s user 3.562s sys 2.335s
I20260927 13:47:13.853068 3453 rpc-test.cc:1859] Sending 1024MB via ssl-enabled unix socket: real 3.382s user 3.332s sys 2.367s
W20260927 13:47:13.854025 3907 connection.cc:196] Error closing socket: Network error: TlsSocket::Close: Broken pipe
[ OK ] Parameters/TestRpc.TestPerformanceBySocketType/SSL_UnixSocket (17212 ms)
[----------] 20 tests from Parameters/TestRpc (54624 ms total)
[----------] 1 test from Parameters/TestRpcSocketTxRxQueue
[ RUN ] Parameters/TestRpcSocketTxRxQueue.AcceptorRxQueueSizeMetric/0
I20260927 13:47:13.869930 3935 acceptor_pool.cc:254] collecting diagnostics on the listening RPC socket 0.0.0.0:38901 every 1 connection(s)
I20260927 13:47:13.870260 3936 acceptor_pool.cc:254] collecting diagnostics on the listening RPC socket 0.0.0.0:38901 every 1 connection(s)
W20260927 13:47:13.872053 3931 negotiation.cc:337] Failed RPC negotiation. Trace:
0927 13:47:13.871642 (+ 0us) reactor.cc:625] Submitting negotiation task for server connection from 127.0.0.1:52280 (local address 127.0.0.1:38901)
0927 13:47:13.871809 (+ 167us) server_negotiation.cc:206] Beginning negotiation
0927 13:47:13.871813 (+ 4us) server_negotiation.cc:399] Waiting for connection header
0927 13:47:13.871931 (+ 118us) negotiation.cc:327] Negotiation complete: Network error: Server connection negotiation failed: server connection from 127.0.0.1:52280: BlockingRecv error: recv got EOF from 127.0.0.1:52280 (error 108)
Metrics: {"server-negotiator.queue_time_us":50}
[ OK ] Parameters/TestRpcSocketTxRxQueue.AcceptorRxQueueSizeMetric/0 (14 ms)
[----------] 1 test from Parameters/TestRpcSocketTxRxQueue (14 ms total)
[----------] Global test environment tear-down
[==========] 21 tests from 2 test suites ran. (54639 ms total)
[ PASSED ] 20 tests.
[ FAILED ] 1 test, listed below:
[ FAILED ] Parameters/TestRpc.TestCallWithChainCertAndChainCA/SSL_UnixSocket, where GetParam() = (true, true)
1 FAILED TEST