Diagnosed failure

Parameters/TestRpc.TestCallWithChainCertAndRootCA/SSL_TCP: /data0/somelongdirectorytoavoidrpathissues/src/kudu/src/kudu/rpc/rpc-test.cc:303: Failure
Failed
Bad status: Runtime error: could not verify certificate chain (error with cert: subject=CN = localhost, ST = sadfjas, C = AS, emailAddress = sdflkdsajf, O = lskdfjlsad, OU = sldfkja, issuer=C = AS, ST = ASDfkjdhf, L = lskdjf, O = saldfja, OU = skdjf, CN = localhost, emailAddress = sadjflkadsj): : certificate has expired
Google Test trace:
/data0/somelongdirectorytoavoidrpathissues/src/kudu/src/kudu/rpc/rpc-test.cc:300: Connecting to 0.0.0.0:41023
I20260925 19:32:34.790571 15935 test_util.cc:175] -----------------------------------------------
I20260925 19:32:34.790781 15935 test_util.cc:176] Had fatal failures, leaving test files at /tmp/dist-test-taskGHqDH5/test-tmp/rpc-test.1.Parameters_TestRpc.TestCallWithChainCertAndRootCA_SSL_TCP.1790364753267550-15935-0

Full log

Note: This is test shard 2 of 8.
[==========] Running 21 tests from 2 test suites.
[----------] Global test environment set-up.
[----------] 1 test from TestRpc
[ RUN      ] TestRpc.TestMethodsByName
[       OK ] TestRpc.TestMethodsByName (6 ms)
[----------] 1 test from TestRpc (6 ms total)

[----------] 20 tests from Parameters/TestRpc
[ RUN      ] Parameters/TestRpc.TestAcceptorPoolStartStop/SSL_TCP
WARNING: Logging before InitGoogleLogging() is written to STDERR
I20260925 19:32:33.380533 15950 acceptor_pool.cc:254] collecting diagnostics on the listening RPC socket 0.0.0.0:39311 every 8 connection(s)
W20260925 19:32:34.382781 15935 thread.cc:536] Waited for 1000ms trying to join with acceptor (tid 15951)
I20260925 19:32:33.382176 15951 acceptor_pool.cc:254] collecting diagnostics on the listening RPC socket 0.0.0.0:39311 every 8 connection(s)
I20260925 19:32:34.555074 15962 acceptor_pool.cc:254] collecting diagnostics on the listening RPC socket 0.0.0.0:40331 every 8 connection(s)
I20260925 19:32:34.556535 15963 acceptor_pool.cc:254] collecting diagnostics on the listening RPC socket 0.0.0.0:40331 every 8 connection(s)
I20260925 19:32:34.575999 15973 acceptor_pool.cc:254] collecting diagnostics on the listening RPC socket 0.0.0.0:36251 every 8 connection(s)
I20260925 19:32:34.577461 15974 acceptor_pool.cc:254] collecting diagnostics on the listening RPC socket 0.0.0.0:36251 every 8 connection(s)
I20260925 19:32:34.600950 15984 acceptor_pool.cc:254] collecting diagnostics on the listening RPC socket 0.0.0.0:39359 every 8 connection(s)
I20260925 19:32:34.601631 15985 acceptor_pool.cc:254] collecting diagnostics on the listening RPC socket 0.0.0.0:39359 every 8 connection(s)
I20260925 19:32:34.625702 15995 acceptor_pool.cc:254] collecting diagnostics on the listening RPC socket 0.0.0.0:44885 every 8 connection(s)
I20260925 19:32:34.626451 15996 acceptor_pool.cc:254] collecting diagnostics on the listening RPC socket 0.0.0.0:44885 every 8 connection(s)
[       OK ] Parameters/TestRpc.TestAcceptorPoolStartStop/SSL_TCP (1304 ms)
[ RUN      ] Parameters/TestRpc.TestCall/SSL_TCP
I20260925 19:32:34.647987 16008 acceptor_pool.cc:254] collecting diagnostics on the listening RPC socket 0.0.0.0:35697 every 8 connection(s)
I20260925 19:32:34.649627 16009 acceptor_pool.cc:254] collecting diagnostics on the listening RPC socket 0.0.0.0:35697 every 8 connection(s)
I20260925 19:32:34.655014 15935 rpc-test.cc:234] Connecting to 0.0.0.0:35697
[       OK ] Parameters/TestRpc.TestCall/SSL_TCP (114 ms)
[ RUN      ] Parameters/TestRpc.TestCallWithChainCertAndRootCA/SSL_TCP
I20260925 19:32:34.768522 16033 acceptor_pool.cc:254] collecting diagnostics on the listening RPC socket 0.0.0.0:41023 every 8 connection(s)
I20260925 19:32:34.769243 16034 acceptor_pool.cc:254] collecting diagnostics on the listening RPC socket 0.0.0.0:41023 every 8 connection(s)
/data0/somelongdirectorytoavoidrpathissues/src/kudu/src/kudu/rpc/rpc-test.cc:303: Failure
Failed
Bad status: Runtime error: could not verify certificate chain (error with cert: subject=CN = localhost, ST = sadfjas, C = AS, emailAddress = sdflkdsajf, O = lskdfjlsad, OU = sldfkja, issuer=C = AS, ST = ASDfkjdhf, L = lskdjf, O = saldfja, OU = skdjf, CN = localhost, emailAddress = sadjflkadsj): : certificate has expired
Google Test trace:
/data0/somelongdirectorytoavoidrpathissues/src/kudu/src/kudu/rpc/rpc-test.cc:300: Connecting to 0.0.0.0:41023
I20260925 19:32:34.790571 15935 test_util.cc:175] -----------------------------------------------
I20260925 19:32:34.790781 15935 test_util.cc:176] Had fatal failures, leaving test files at /tmp/dist-test-taskGHqDH5/test-tmp/rpc-test.1.Parameters_TestRpc.TestCallWithChainCertAndRootCA_SSL_TCP.1790364753267550-15935-0
[  FAILED  ] Parameters/TestRpc.TestCallWithChainCertAndRootCA/SSL_TCP, where GetParam() = (true, false) (45 ms)
[ RUN      ] Parameters/TestRpc.TestCallWithBadPasswordProtectedKey/SSL_TCP
[       OK ] Parameters/TestRpc.TestCallWithBadPasswordProtectedKey/SSL_TCP (30 ms)
[ RUN      ] Parameters/TestRpc.TestInvalidMethodCall/SSL_TCP
I20260925 19:32:34.852157 16070 acceptor_pool.cc:254] collecting diagnostics on the listening RPC socket 0.0.0.0:33759 every 8 connection(s)
I20260925 19:32:34.853006 16071 acceptor_pool.cc:254] collecting diagnostics on the listening RPC socket 0.0.0.0:33759 every 8 connection(s)
I20260925 19:32:34.856316 15935 rpc-test.cc:406] Connecting to 0.0.0.0:33759
[       OK ] Parameters/TestRpc.TestInvalidMethodCall/SSL_TCP (80 ms)
[ RUN      ] Parameters/TestRpc.TestHighFDs/SSL_TCP
I20260925 19:32:35.117056 16095 acceptor_pool.cc:254] collecting diagnostics on the listening RPC socket 0.0.0.0:39555 every 8 connection(s)
I20260925 19:32:35.117769 16096 acceptor_pool.cc:254] collecting diagnostics on the listening RPC socket 0.0.0.0:39555 every 8 connection(s)
[       OK ] Parameters/TestRpc.TestHighFDs/SSL_TCP (276 ms)
[ RUN      ] Parameters/TestRpc.TestConnectionAlwaysKeepalive/SSL_TCP
I20260925 19:32:35.192422 16118 acceptor_pool.cc:254] collecting diagnostics on the listening RPC socket 0.0.0.0:42297 every 8 connection(s)
I20260925 19:32:35.193112 16119 acceptor_pool.cc:254] collecting diagnostics on the listening RPC socket 0.0.0.0:42297 every 8 connection(s)
I20260925 19:32:35.196179 15935 rpc-test.cc:532] Connecting to 0.0.0.0:42297
[       OK ] Parameters/TestRpc.TestConnectionAlwaysKeepalive/SSL_TCP (3052 ms)
[ RUN      ] Parameters/TestRpc.TestReopenOutboundConnections/SSL_TCP
I20260925 19:32:38.257107 16141 acceptor_pool.cc:254] collecting diagnostics on the listening RPC socket 0.0.0.0:40333 every 8 connection(s)
I20260925 19:32:38.257856 16142 acceptor_pool.cc:254] collecting diagnostics on the listening RPC socket 0.0.0.0:40333 every 8 connection(s)
I20260925 19:32:38.261097 15935 rpc-test.cc:658] Connecting to 0.0.0.0:40333
[       OK ] Parameters/TestRpc.TestReopenOutboundConnections/SSL_TCP (374 ms)
[ RUN      ] Parameters/TestRpc.TestConnectionNetworkPlane/SSL_TCP
I20260925 19:32:38.626593 16164 acceptor_pool.cc:254] collecting diagnostics on the listening RPC socket 0.0.0.0:36703 every 8 connection(s)
I20260925 19:32:38.627326 16165 acceptor_pool.cc:254] collecting diagnostics on the listening RPC socket 0.0.0.0:36703 every 8 connection(s)
I20260925 19:32:38.630357 15935 rpc-test.cc:772] Connecting to 0.0.0.0:36703
[       OK ] Parameters/TestRpc.TestConnectionNetworkPlane/SSL_TCP (77 ms)
[ RUN      ] Parameters/TestRpc.TestTCPKeepalive/SSL_TCP
I20260925 19:32:38.701279 16189 acceptor_pool.cc:254] collecting diagnostics on the listening RPC socket 0.0.0.0:46343 every 8 connection(s)
I20260925 19:32:38.701995 16190 acceptor_pool.cc:254] collecting diagnostics on the listening RPC socket 0.0.0.0:46343 every 8 connection(s)
I20260925 19:32:38.725751 16193 rpc-test-base.h:222] got call: sleep_micros: 8000000 deferred: true
I20260925 19:32:46.729777 16193 rpcz_store.cc:275] Call kudu.rpc.GenericCalculatorService.Sleep from 127.0.0.1:39334 (request call id 0) took 8004 ms. Trace:
I20260925 19:32:46.730199 16193 rpcz_store.cc:276] 0925 19:32:38.725498 (+     0us) service_pool.cc:170] Inserting onto call queue
0925 19:32:38.725598 (+   100us) service_pool.cc:227] Handling call
0925 19:32:46.729613 (+8004015us) inbound_call.cc:173] Queueing success response
Metrics: {}
[       OK ] Parameters/TestRpc.TestTCPKeepalive/SSL_TCP (8059 ms)
[ RUN      ] Parameters/TestRpc.TestMaxSmallSidecars/SSL_TCP
I20260925 19:32:46.779913 16215 acceptor_pool.cc:254] collecting diagnostics on the listening RPC socket 0.0.0.0:43571 every 8 connection(s)
I20260925 19:32:46.780715 16216 acceptor_pool.cc:254] collecting diagnostics on the listening RPC socket 0.0.0.0:43571 every 8 connection(s)
[       OK ] Parameters/TestRpc.TestMaxSmallSidecars/SSL_TCP (207 ms)
[ RUN      ] Parameters/TestRpc.TestCallTimeout/SSL_TCP
I20260925 19:32:46.979693 16240 acceptor_pool.cc:254] collecting diagnostics on the listening RPC socket 0.0.0.0:41843 every 8 connection(s)
I20260925 19:32:46.980449 16241 acceptor_pool.cc:254] collecting diagnostics on the listening RPC socket 0.0.0.0:41843 every 8 connection(s)
I20260925 19:32:47.003687 15935 rpc-test-base.h:595] status: Timed out: connection negotiation to 0.0.0.0:41843 for RPC Sleep timed out after 0.000s (ON_OUTBOUND_QUEUE), seconds elapsed: 0.00234919
I20260925 19:32:47.010759 16244 rpc-test-base.h:222] got call: sleep_micros: 700000
I20260925 19:32:47.205468 15935 rpc-test-base.h:595] status: Timed out: Sleep RPC to 0.0.0.0:41843 timed out after 0.200s (SENT), seconds elapsed: 0.201387
I20260925 19:32:47.206943 16243 rpc-test-base.h:222] got call: sleep_micros: 2000000
W20260925 19:32:47.711395 16244 rpcz_store.cc:267] Call kudu.rpc.GenericCalculatorService.Sleep from 127.0.0.1:54440 (request call id 1) took 700 ms (client timeout 200 ms). Trace:
W20260925 19:32:47.711748 16244 rpcz_store.cc:269] 0925 19:32:47.010610 (+     0us) service_pool.cc:170] Inserting onto call queue
0925 19:32:47.010708 (+    98us) service_pool.cc:227] Handling call
0925 19:32:47.711331 (+700623us) inbound_call.cc:173] Queueing success response
Metrics: {}
I20260925 19:32:48.707989 15935 rpc-test-base.h:595] status: Timed out: Sleep RPC to 0.0.0.0:41843 timed out after 1.500s (SENT), seconds elapsed: 1.50218
W20260925 19:32:49.207523 16243 rpcz_store.cc:267] Call kudu.rpc.GenericCalculatorService.Sleep from 127.0.0.1:54440 (request call id 2) took 2000 ms (client timeout 1500 ms). Trace:
W20260925 19:32:49.207931 16243 rpcz_store.cc:269] 0925 19:32:47.206657 (+     0us) service_pool.cc:170] Inserting onto call queue
0925 19:32:47.206788 (+   131us) service_pool.cc:227] Handling call
0925 19:32:49.207463 (+2000675us) inbound_call.cc:173] Queueing success response
Metrics: {}
W20260925 19:32:49.208560 16237 connection.cc:441] server connection from 127.0.0.1:54440 torn down before Call kudu.rpc.GenericCalculatorService.Sleep from 127.0.0.1:54440 (request call id 2) could send its response
[       OK ] Parameters/TestRpc.TestCallTimeout/SSL_TCP (2262 ms)
[ RUN      ] Parameters/TestRpc.TestServerShutsDown/SSL_TCP
I20260925 19:32:49.215622 15935 rpc-test.cc:1125] Connecting to 0.0.0.0:36397
W20260925 19:32:49.225399 16257 negotiation.cc:337] Failed RPC negotiation. Trace:
0925 19:32:49.223913 (+     0us) reactor.cc:625] Submitting negotiation task for client connection to 0.0.0.0:36397 (local address 127.0.0.1:60274)
0925 19:32:49.224347 (+   434us) negotiation.cc:107] Waiting for socket to connect
0925 19:32:49.224377 (+    30us) client_negotiation.cc:174] Beginning negotiation
0925 19:32:49.224598 (+   221us) client_negotiation.cc:252] Sending NEGOTIATE NegotiatePB request
0925 19:32:49.224822 (+   224us) negotiation.cc:327] Negotiation complete: Network error: Client connection negotiation failed: client connection to 0.0.0.0:36397: BlockingWrite error: write error: Broken pipe (error 32)
Metrics: {"client-negotiator.queue_time_us":106}
[       OK ] Parameters/TestRpc.TestServerShutsDown/SSL_TCP (14 ms)
[ RUN      ] Parameters/TestRpc.TimedOutOnResponseMetric/SSL_TCP
I20260925 19:32:49.247349 16274 acceptor_pool.cc:254] collecting diagnostics on the listening RPC socket 0.0.0.0:35179 every 8 connection(s)
I20260925 19:32:49.248045 16275 acceptor_pool.cc:254] collecting diagnostics on the listening RPC socket 0.0.0.0:35179 every 8 connection(s)
W20260925 19:32:49.484586 16278 rpcz_store.cc:267] Call kudu.rpc_test.CalculatorService.Sleep from 127.0.0.1:49632 (request call id 3) took 50 ms (client timeout 25 ms). Trace:
W20260925 19:32:49.484900 16278 rpcz_store.cc:269] 0925 19:32:49.434022 (+     0us) service_pool.cc:170] Inserting onto call queue
0925 19:32:49.434129 (+   107us) service_pool.cc:227] Handling call
0925 19:32:49.484512 (+ 50383us) inbound_call.cc:173] Queueing success response
Related trace 'test_child':
Metrics: {"test_sleep_us":50000,"child_traces":[["test_child",{"related_trace_metric":1}]]}
W20260925 19:32:49.543855 16278 rpcz_store.cc:267] Call kudu.rpc_test.CalculatorService.Sleep from 127.0.0.1:49632 (request call id 4) took 50 ms (client timeout 50 ms). Trace:
W20260925 19:32:49.544157 16278 rpcz_store.cc:269] 0925 19:32:49.493333 (+     0us) service_pool.cc:170] Inserting onto call queue
0925 19:32:49.493474 (+   141us) service_pool.cc:227] Handling call
0925 19:32:49.543799 (+ 50325us) inbound_call.cc:173] Queueing success response
Related trace 'test_child':
Metrics: {"test_sleep_us":50000,"child_traces":[["test_child",{"related_trace_metric":1}]]}
[       OK ] Parameters/TestRpc.TimedOutOnResponseMetric/SSL_TCP (324 ms)
[ RUN      ] Parameters/TestRpc.AcceptorDispatchingTimesMetric/SSL_TCP
I20260925 19:32:49.562744 16299 acceptor_pool.cc:254] collecting diagnostics on the listening RPC socket 0.0.0.0:37047 every 8 connection(s)
I20260925 19:32:49.563359 16300 acceptor_pool.cc:254] collecting diagnostics on the listening RPC socket 0.0.0.0:37047 every 8 connection(s)
W20260925 19:32:49.572803 16295 negotiation.cc:337] Failed RPC negotiation. Trace:
0925 19:32:49.567622 (+     0us) reactor.cc:625] Submitting negotiation task for server connection from 127.0.0.1:32878 (local address 127.0.0.1:37047)
0925 19:32:49.571102 (+  3480us) server_negotiation.cc:206] Beginning negotiation
0925 19:32:49.571125 (+    23us) server_negotiation.cc:399] Waiting for connection header
0925 19:32:49.571478 (+   353us) negotiation.cc:327] Negotiation complete: Network error: Server connection negotiation failed: server connection from 127.0.0.1:32878: BlockingRecv error: recv got EOF from 127.0.0.1:32878 (error 108)
Metrics: {"server-negotiator.queue_time_us":171}
[       OK ] Parameters/TestRpc.AcceptorDispatchingTimesMetric/SSL_TCP (23 ms)
[ RUN      ] Parameters/TestRpc.TestRpcCallbackDestroysMessenger/SSL_TCP
[       OK ] Parameters/TestRpc.TestRpcCallbackDestroysMessenger/SSL_TCP (24 ms)
[ RUN      ] Parameters/TestRpc.TestApplicationFeatureFlag/SSL_TCP
I20260925 19:32:49.620111 16324 acceptor_pool.cc:254] collecting diagnostics on the listening RPC socket 0.0.0.0:45779 every 8 connection(s)
I20260925 19:32:49.620814 16325 acceptor_pool.cc:254] collecting diagnostics on the listening RPC socket 0.0.0.0:45779 every 8 connection(s)
W20260925 19:32:49.664228 16323 messenger.cc:357] Unable to handle RPC call: Not implemented: call requires unsupported application feature flags: 99
[       OK ] Parameters/TestRpc.TestApplicationFeatureFlag/SSL_TCP (71 ms)
[ RUN      ] Parameters/TestRpc.TestCancellation/SSL_TCP
I20260925 19:32:49.686040 16349 acceptor_pool.cc:254] collecting diagnostics on the listening RPC socket 0.0.0.0:38705 every 8 connection(s)
I20260925 19:32:49.686787 16350 acceptor_pool.cc:254] collecting diagnostics on the listening RPC socket 0.0.0.0:38705 every 8 connection(s)
I20260925 19:32:49.689908 15935 rpc-test.cc:1648] Connecting to 0.0.0.0:38705
I20260925 19:32:49.796135 15935 rpc-test-base.h:595] status: Aborted: Sleep RPC to 0.0.0.0:38705 is cancelled in state READY, seconds elapsed: 0.000287234
I20260925 19:32:49.935304 15935 rpc-test-base.h:595] status: Aborted: Sleep RPC to 0.0.0.0:38705 is cancelled in state SENT, seconds elapsed: 0.00093847
I20260925 19:32:49.976161 16352 rpc-test-base.h:222] got call: sleep_micros: 510000
I20260925 19:32:50.097029 15935 rpc-test-base.h:595] status: Aborted: Sleep RPC to 0.0.0.0:38705 is cancelled in state SENT, seconds elapsed: 0.000831217
I20260925 19:32:50.139143 16351 rpc-test-base.h:222] got call: sleep_micros: 510000
I20260925 19:32:50.255143 15935 rpc-test-base.h:595] status: Aborted: Sleep RPC to 0.0.0.0:38705 is cancelled in state SENT, seconds elapsed: 0.000833278
W20260925 19:32:50.296361 16353 rpcz_store.cc:267] Call kudu.rpc.GenericCalculatorService.Sleep from 127.0.0.1:36842 (request call id 11) took 14 ms (client timeout 10 ms). Trace:
W20260925 19:32:50.296725 16353 rpcz_store.cc:269] 0925 19:32:50.281387 (+     0us) service_pool.cc:170] Inserting onto call queue
0925 19:32:50.296069 (+ 14682us) service_pool.cc:214] Skipping call since client already timed out
0925 19:32:50.296181 (+   112us) inbound_call.cc:173] Queueing failure response
Metrics: {}
I20260925 19:32:50.297211 16353 rpc-test-base.h:222] got call: sleep_micros: 1500000
W20260925 19:32:50.486752 16352 rpcz_store.cc:267] Call kudu.rpc.GenericCalculatorService.Sleep from 127.0.0.1:36842 (request call id 3) took 510 ms (client timeout 10 ms). Trace:
W20260925 19:32:50.487066 16352 rpcz_store.cc:269] 0925 19:32:49.975974 (+     0us) service_pool.cc:170] Inserting onto call queue
0925 19:32:49.976105 (+   131us) service_pool.cc:227] Handling call
0925 19:32:50.486699 (+510594us) inbound_call.cc:173] Queueing success response
Metrics: {}
W20260925 19:32:50.649888 16351 rpcz_store.cc:267] Call kudu.rpc.GenericCalculatorService.Sleep from 127.0.0.1:36842 (request call id 7) took 511 ms (client timeout 10 ms). Trace:
W20260925 19:32:50.650235 16351 rpcz_store.cc:269] 0925 19:32:50.138886 (+     0us) service_pool.cc:170] Inserting onto call queue
0925 19:32:50.139056 (+   170us) service_pool.cc:227] Handling call
0925 19:32:50.649832 (+510776us) inbound_call.cc:173] Queueing success response
Metrics: {}
I20260925 19:32:51.257167 15935 rpc-test-base.h:595] status: Timed out: Sleep RPC to 0.0.0.0:38705 timed out after 1.000s (SENT), seconds elapsed: 1.00163
I20260925 19:32:51.258428 16351 rpc-test-base.h:222] got call: sleep_micros: 1500000
W20260925 19:32:51.797729 16353 rpcz_store.cc:267] Call kudu.rpc.GenericCalculatorService.Sleep from 127.0.0.1:36842 (request call id 12) took 1516 ms (client timeout 1000 ms). Trace:
W20260925 19:32:51.798063 16353 rpcz_store.cc:269] 0925 19:32:50.281740 (+     0us) service_pool.cc:170] Inserting onto call queue
0925 19:32:50.297174 (+ 15434us) service_pool.cc:227] Handling call
0925 19:32:51.797677 (+1500503us) inbound_call.cc:173] Queueing success response
Metrics: {}
I20260925 19:32:52.259440 15935 rpc-test-base.h:595] status: Timed out: Sleep RPC to 0.0.0.0:38705 timed out after 1.000s (SENT), seconds elapsed: 1.00199
W20260925 19:32:52.260805 16346 messenger.cc:357] Unable to handle RPC call: Not implemented: call requires unsupported application feature flags: 99, 1
W20260925 19:32:52.262156 16346 messenger.cc:357] Unable to handle RPC call: Not implemented: call requires unsupported application feature flags: 99, 1
W20260925 19:32:52.758955 16351 rpcz_store.cc:267] Call kudu.rpc.GenericCalculatorService.Sleep from 127.0.0.1:36842 (request call id 13) took 1500 ms (client timeout 1000 ms). Trace:
W20260925 19:32:52.759267 16351 rpcz_store.cc:269] 0925 19:32:51.258237 (+     0us) service_pool.cc:170] Inserting onto call queue
0925 19:32:51.258347 (+   110us) service_pool.cc:227] Handling call
0925 19:32:52.758893 (+1500546us) inbound_call.cc:173] Queueing success response
Metrics: {}
W20260925 19:32:52.759790 16346 connection.cc:441] server connection from 127.0.0.1:36842 torn down before Call kudu.rpc.GenericCalculatorService.Sleep from 127.0.0.1:36842 (request call id 13) could send its response
[       OK ] Parameters/TestRpc.TestCancellation/SSL_TCP (3093 ms)
[ RUN      ] Parameters/TestRpc.TestCancellationMultiThreads/SSL_TCP
I20260925 19:32:52.797736 16374 acceptor_pool.cc:254] collecting diagnostics on the listening RPC socket 0.0.0.0:39921 every 8 connection(s)
I20260925 19:32:52.798504 16375 acceptor_pool.cc:254] collecting diagnostics on the listening RPC socket 0.0.0.0:39921 every 8 connection(s)
I20260925 19:32:52.801578 15935 rpc-test.cc:1808] Connecting to 0.0.0.0:39921
I20260925 19:32:52.946233 16388 test_util.cc:268] Using random seed: -934325988
I20260925 19:32:52.947306 16389 test_util.cc:268] Using random seed: -934324908
I20260925 19:32:52.948618 16390 test_util.cc:268] Using random seed: -934323601
I20260925 19:32:52.949942 16391 test_util.cc:268] Using random seed: -934322294
I20260925 19:32:52.951581 16392 test_util.cc:268] Using random seed: -934320805
I20260925 19:32:52.952942 16393 test_util.cc:268] Using random seed: -934319391
I20260925 19:32:52.954569 16394 test_util.cc:268] Using random seed: -934317811
I20260925 19:32:52.956070 16395 test_util.cc:268] Using random seed: -934316281
I20260925 19:32:52.957778 16396 test_util.cc:268] Using random seed: -934314599
I20260925 19:32:52.959165 16397 test_util.cc:268] Using random seed: -934313181
I20260925 19:32:52.960443 16398 test_util.cc:268] Using random seed: -934311872
I20260925 19:32:52.961804 16399 test_util.cc:268] Using random seed: -934310539
I20260925 19:32:52.963241 16400 test_util.cc:268] Using random seed: -934309191
I20260925 19:32:52.964865 16401 test_util.cc:268] Using random seed: -934307520
I20260925 19:32:52.966476 16402 test_util.cc:268] Using random seed: -934305943
I20260925 19:32:52.968056 16403 test_util.cc:268] Using random seed: -934304327
I20260925 19:32:52.971242 16404 test_util.cc:268] Using random seed: -934301094
I20260925 19:32:52.975284 16405 test_util.cc:268] Using random seed: -934297162
I20260925 19:32:52.979194 16406 test_util.cc:268] Using random seed: -934293155
I20260925 19:32:52.981114 16407 test_util.cc:268] Using random seed: -934291269
I20260925 19:32:52.983672 16408 test_util.cc:268] Using random seed: -934288712
I20260925 19:32:52.985351 16409 test_util.cc:268] Using random seed: -934287152
I20260925 19:32:52.987356 16410 test_util.cc:268] Using random seed: -934285047
I20260925 19:32:52.989379 16411 test_util.cc:268] Using random seed: -934283011
I20260925 19:32:52.990984 16412 test_util.cc:268] Using random seed: -934281404
I20260925 19:32:52.992914 16413 test_util.cc:268] Using random seed: -934279464
I20260925 19:32:52.994500 16414 test_util.cc:268] Using random seed: -934277905
I20260925 19:32:52.996042 16415 test_util.cc:268] Using random seed: -934276313
I20260925 19:32:52.997570 16416 test_util.cc:268] Using random seed: -934274842
I20260925 19:32:52.999143 16417 test_util.cc:268] Using random seed: -934273224
[       OK ] Parameters/TestRpc.TestCancellationMultiThreads/SSL_TCP (17318 ms)
[ RUN      ] Parameters/TestRpc.TestCallId/SSL_TCP
I20260925 19:33:10.107424 16431 acceptor_pool.cc:254] collecting diagnostics on the listening RPC socket 0.0.0.0:39533 every 8 connection(s)
I20260925 19:33:10.108186 16432 acceptor_pool.cc:254] collecting diagnostics on the listening RPC socket 0.0.0.0:39533 every 8 connection(s)
[       OK ] Parameters/TestRpc.TestCallId/SSL_TCP (88 ms)
[----------] 20 tests from Parameters/TestRpc (36847 ms total)

[----------] Global test environment tear-down
[==========] 21 tests from 2 test suites ran. (36854 ms total)
[  PASSED  ] 20 tests.
[  FAILED  ] 1 test, listed below:
[  FAILED  ] Parameters/TestRpc.TestCallWithChainCertAndRootCA/SSL_TCP, where GetParam() = (true, false)

 1 FAILED TEST