Diagnosed failure

Parameters/TestRpc.TestCallWithChainCertAndRootCA/SSL_TCP: /data0/somelongdirectorytoavoidrpathissues/src/kudu/src/kudu/rpc/rpc-test.cc:303: Failure
Failed
Bad status: Runtime error: could not verify certificate chain (error with cert: subject=CN = localhost, ST = sadfjas, C = AS, emailAddress = sdflkdsajf, O = lskdfjlsad, OU = sldfkja, issuer=C = AS, ST = ASDfkjdhf, L = lskdjf, O = saldfja, OU = skdjf, CN = localhost, emailAddress = sadjflkadsj): : certificate has expired
Google Test trace:
/data0/somelongdirectorytoavoidrpathissues/src/kudu/src/kudu/rpc/rpc-test.cc:300: Connecting to 0.0.0.0:44631
I20260923 14:34:16.572314 22597 test_util.cc:175] -----------------------------------------------
I20260923 14:34:16.572557 22597 test_util.cc:176] Had fatal failures, leaving test files at /tmp/dist-test-taskqSOnul/test-tmp/rpc-test.1.Parameters_TestRpc.TestCallWithChainCertAndRootCA_SSL_TCP.1790174055018907-22597-0

Full log

Note: This is test shard 2 of 8.
[==========] Running 21 tests from 2 test suites.
[----------] Global test environment set-up.
[----------] 1 test from TestRpc
[ RUN      ] TestRpc.TestMethodsByName
[       OK ] TestRpc.TestMethodsByName (8 ms)
[----------] 1 test from TestRpc (8 ms total)

[----------] 20 tests from Parameters/TestRpc
[ RUN      ] Parameters/TestRpc.TestAcceptorPoolStartStop/SSL_TCP
WARNING: Logging before InitGoogleLogging() is written to STDERR
I20260923 14:34:15.154812 22612 acceptor_pool.cc:254] collecting diagnostics on the listening RPC socket 0.0.0.0:44665 every 8 connection(s)
I20260923 14:34:15.156544 22613 acceptor_pool.cc:254] collecting diagnostics on the listening RPC socket 0.0.0.0:44665 every 8 connection(s)
I20260923 14:34:16.306679 22624 acceptor_pool.cc:254] collecting diagnostics on the listening RPC socket 0.0.0.0:44091 every 8 connection(s)
I20260923 14:34:16.308306 22625 acceptor_pool.cc:254] collecting diagnostics on the listening RPC socket 0.0.0.0:44091 every 8 connection(s)
I20260923 14:34:16.337715 22635 acceptor_pool.cc:254] collecting diagnostics on the listening RPC socket 0.0.0.0:44451 every 8 connection(s)
I20260923 14:34:16.339330 22636 acceptor_pool.cc:254] collecting diagnostics on the listening RPC socket 0.0.0.0:44451 every 8 connection(s)
I20260923 14:34:16.358659 22646 acceptor_pool.cc:254] collecting diagnostics on the listening RPC socket 0.0.0.0:46191 every 8 connection(s)
I20260923 14:34:16.359449 22647 acceptor_pool.cc:254] collecting diagnostics on the listening RPC socket 0.0.0.0:46191 every 8 connection(s)
I20260923 14:34:16.378798 22657 acceptor_pool.cc:254] collecting diagnostics on the listening RPC socket 0.0.0.0:46107 every 8 connection(s)
I20260923 14:34:16.379593 22658 acceptor_pool.cc:254] collecting diagnostics on the listening RPC socket 0.0.0.0:46107 every 8 connection(s)
[       OK ] Parameters/TestRpc.TestAcceptorPoolStartStop/SSL_TCP (1299 ms)
[ RUN      ] Parameters/TestRpc.TestCall/SSL_TCP
I20260923 14:34:16.405553 22670 acceptor_pool.cc:254] collecting diagnostics on the listening RPC socket 0.0.0.0:33765 every 8 connection(s)
I20260923 14:34:16.408262 22671 acceptor_pool.cc:254] collecting diagnostics on the listening RPC socket 0.0.0.0:33765 every 8 connection(s)
I20260923 14:34:16.416296 22597 rpc-test.cc:234] Connecting to 0.0.0.0:33765
[       OK ] Parameters/TestRpc.TestCall/SSL_TCP (137 ms)
[ RUN      ] Parameters/TestRpc.TestCallWithChainCertAndRootCA/SSL_TCP
I20260923 14:34:16.549484 22695 acceptor_pool.cc:254] collecting diagnostics on the listening RPC socket 0.0.0.0:44631 every 8 connection(s)
I20260923 14:34:16.550251 22696 acceptor_pool.cc:254] collecting diagnostics on the listening RPC socket 0.0.0.0:44631 every 8 connection(s)
/data0/somelongdirectorytoavoidrpathissues/src/kudu/src/kudu/rpc/rpc-test.cc:303: Failure
Failed
Bad status: Runtime error: could not verify certificate chain (error with cert: subject=CN = localhost, ST = sadfjas, C = AS, emailAddress = sdflkdsajf, O = lskdfjlsad, OU = sldfkja, issuer=C = AS, ST = ASDfkjdhf, L = lskdjf, O = saldfja, OU = skdjf, CN = localhost, emailAddress = sadjflkadsj): : certificate has expired
Google Test trace:
/data0/somelongdirectorytoavoidrpathissues/src/kudu/src/kudu/rpc/rpc-test.cc:300: Connecting to 0.0.0.0:44631
I20260923 14:34:16.572314 22597 test_util.cc:175] -----------------------------------------------
I20260923 14:34:16.572557 22597 test_util.cc:176] Had fatal failures, leaving test files at /tmp/dist-test-taskqSOnul/test-tmp/rpc-test.1.Parameters_TestRpc.TestCallWithChainCertAndRootCA_SSL_TCP.1790174055018907-22597-0
[  FAILED  ] Parameters/TestRpc.TestCallWithChainCertAndRootCA/SSL_TCP, where GetParam() = (true, false) (51 ms)
[ RUN      ] Parameters/TestRpc.TestCallWithBadPasswordProtectedKey/SSL_TCP
[       OK ] Parameters/TestRpc.TestCallWithBadPasswordProtectedKey/SSL_TCP (37 ms)
[ RUN      ] Parameters/TestRpc.TestInvalidMethodCall/SSL_TCP
I20260923 14:34:16.642194 22732 acceptor_pool.cc:254] collecting diagnostics on the listening RPC socket 0.0.0.0:45929 every 8 connection(s)
I20260923 14:34:16.643059 22733 acceptor_pool.cc:254] collecting diagnostics on the listening RPC socket 0.0.0.0:45929 every 8 connection(s)
I20260923 14:34:16.646998 22597 rpc-test.cc:406] Connecting to 0.0.0.0:45929
[       OK ] Parameters/TestRpc.TestInvalidMethodCall/SSL_TCP (79 ms)
[ RUN      ] Parameters/TestRpc.TestHighFDs/SSL_TCP
I20260923 14:34:16.892941 22757 acceptor_pool.cc:254] collecting diagnostics on the listening RPC socket 0.0.0.0:40813 every 8 connection(s)
I20260923 14:34:16.893698 22758 acceptor_pool.cc:254] collecting diagnostics on the listening RPC socket 0.0.0.0:40813 every 8 connection(s)
[       OK ] Parameters/TestRpc.TestHighFDs/SSL_TCP (267 ms)
[ RUN      ] Parameters/TestRpc.TestConnectionAlwaysKeepalive/SSL_TCP
I20260923 14:34:16.972039 22780 acceptor_pool.cc:254] collecting diagnostics on the listening RPC socket 0.0.0.0:38463 every 8 connection(s)
I20260923 14:34:16.972776 22781 acceptor_pool.cc:254] collecting diagnostics on the listening RPC socket 0.0.0.0:38463 every 8 connection(s)
I20260923 14:34:16.976174 22597 rpc-test.cc:532] Connecting to 0.0.0.0:38463
[       OK ] Parameters/TestRpc.TestConnectionAlwaysKeepalive/SSL_TCP (3068 ms)
[ RUN      ] Parameters/TestRpc.TestReopenOutboundConnections/SSL_TCP
I20260923 14:34:20.047461 22803 acceptor_pool.cc:254] collecting diagnostics on the listening RPC socket 0.0.0.0:46533 every 8 connection(s)
I20260923 14:34:20.048280 22804 acceptor_pool.cc:254] collecting diagnostics on the listening RPC socket 0.0.0.0:46533 every 8 connection(s)
I20260923 14:34:20.052683 22597 rpc-test.cc:658] Connecting to 0.0.0.0:46533
[       OK ] Parameters/TestRpc.TestReopenOutboundConnections/SSL_TCP (439 ms)
[ RUN      ] Parameters/TestRpc.TestConnectionNetworkPlane/SSL_TCP
I20260923 14:34:20.494705 22826 acceptor_pool.cc:254] collecting diagnostics on the listening RPC socket 0.0.0.0:33573 every 8 connection(s)
I20260923 14:34:20.495536 22827 acceptor_pool.cc:254] collecting diagnostics on the listening RPC socket 0.0.0.0:33573 every 8 connection(s)
I20260923 14:34:20.499086 22597 rpc-test.cc:772] Connecting to 0.0.0.0:33573
[       OK ] Parameters/TestRpc.TestConnectionNetworkPlane/SSL_TCP (80 ms)
[ RUN      ] Parameters/TestRpc.TestTCPKeepalive/SSL_TCP
I20260923 14:34:20.562801 22851 acceptor_pool.cc:254] collecting diagnostics on the listening RPC socket 0.0.0.0:35233 every 8 connection(s)
I20260923 14:34:20.563568 22852 acceptor_pool.cc:254] collecting diagnostics on the listening RPC socket 0.0.0.0:35233 every 8 connection(s)
I20260923 14:34:20.624404 22855 rpc-test-base.h:222] got call: sleep_micros: 8000000 deferred: true
I20260923 14:34:28.629094 22855 rpcz_store.cc:275] Call kudu.rpc.GenericCalculatorService.Sleep from 127.0.0.1:44482 (request call id 0) took 8004 ms. Trace:
I20260923 14:34:28.629585 22855 rpcz_store.cc:276] 0923 14:34:20.624101 (+     0us) service_pool.cc:170] Inserting onto call queue
0923 14:34:20.624210 (+   109us) service_pool.cc:227] Handling call
0923 14:34:28.628874 (+8004664us) inbound_call.cc:173] Queueing success response
Metrics: {}
[       OK ] Parameters/TestRpc.TestTCPKeepalive/SSL_TCP (8098 ms)
[ RUN      ] Parameters/TestRpc.TestMaxSmallSidecars/SSL_TCP
I20260923 14:34:28.679744 22877 acceptor_pool.cc:254] collecting diagnostics on the listening RPC socket 0.0.0.0:33271 every 8 connection(s)
I20260923 14:34:28.680583 22878 acceptor_pool.cc:254] collecting diagnostics on the listening RPC socket 0.0.0.0:33271 every 8 connection(s)
[       OK ] Parameters/TestRpc.TestMaxSmallSidecars/SSL_TCP (227 ms)
[ RUN      ] Parameters/TestRpc.TestCallTimeout/SSL_TCP
I20260923 14:34:28.902406 22902 acceptor_pool.cc:254] collecting diagnostics on the listening RPC socket 0.0.0.0:41907 every 8 connection(s)
I20260923 14:34:28.903172 22903 acceptor_pool.cc:254] collecting diagnostics on the listening RPC socket 0.0.0.0:41907 every 8 connection(s)
I20260923 14:34:28.937664 22597 rpc-test-base.h:595] status: Timed out: connection negotiation to 0.0.0.0:41907 for RPC Sleep timed out after 0.000s (ON_OUTBOUND_QUEUE), seconds elapsed: 0.00263988
I20260923 14:34:28.946064 22906 rpc-test-base.h:222] got call: sleep_micros: 700000
I20260923 14:34:29.139060 22597 rpc-test-base.h:595] status: Timed out: Sleep RPC to 0.0.0.0:41907 timed out after 0.200s (SENT), seconds elapsed: 0.200938
I20260923 14:34:29.141067 22905 rpc-test-base.h:222] got call: sleep_micros: 2000000
W20260923 14:34:29.646885 22906 rpcz_store.cc:267] Call kudu.rpc.GenericCalculatorService.Sleep from 127.0.0.1:46786 (request call id 1) took 701 ms (client timeout 200 ms). Trace:
W20260923 14:34:29.647356 22906 rpcz_store.cc:269] 0923 14:34:28.945876 (+     0us) service_pool.cc:170] Inserting onto call queue
0923 14:34:28.945993 (+   117us) service_pool.cc:227] Handling call
0923 14:34:29.646797 (+700804us) inbound_call.cc:173] Queueing success response
Metrics: {}
I20260923 14:34:30.640259 22597 rpc-test-base.h:595] status: Timed out: Sleep RPC to 0.0.0.0:41907 timed out after 1.500s (SENT), seconds elapsed: 1.5007
W20260923 14:34:31.141780 22905 rpcz_store.cc:267] Call kudu.rpc.GenericCalculatorService.Sleep from 127.0.0.1:46786 (request call id 2) took 2001 ms (client timeout 1500 ms). Trace:
W20260923 14:34:31.142180 22905 rpcz_store.cc:269] 0923 14:34:29.140676 (+     0us) service_pool.cc:170] Inserting onto call queue
0923 14:34:29.140844 (+   168us) service_pool.cc:227] Handling call
0923 14:34:31.141699 (+2000855us) inbound_call.cc:173] Queueing success response
Metrics: {}
W20260923 14:34:31.142822 22899 connection.cc:441] server connection from 127.0.0.1:46786 torn down before Call kudu.rpc.GenericCalculatorService.Sleep from 127.0.0.1:46786 (request call id 2) could send its response
[       OK ] Parameters/TestRpc.TestCallTimeout/SSL_TCP (2277 ms)
[ RUN      ] Parameters/TestRpc.TestServerShutsDown/SSL_TCP
I20260923 14:34:31.151032 22597 rpc-test.cc:1125] Connecting to 0.0.0.0:33851
W20260923 14:34:31.161880 22919 negotiation.cc:337] Failed RPC negotiation. Trace:
0923 14:34:31.160117 (+     0us) reactor.cc:625] Submitting negotiation task for client connection to 0.0.0.0:33851 (local address 127.0.0.1:33866)
0923 14:34:31.160639 (+   522us) negotiation.cc:107] Waiting for socket to connect
0923 14:34:31.160674 (+    35us) client_negotiation.cc:174] Beginning negotiation
0923 14:34:31.160925 (+   251us) client_negotiation.cc:252] Sending NEGOTIATE NegotiatePB request
0923 14:34:31.161195 (+   270us) negotiation.cc:327] Negotiation complete: Network error: Client connection negotiation failed: client connection to 0.0.0.0:33851: BlockingWrite error: write error: Broken pipe (error 32)
Metrics: {"client-negotiator.queue_time_us":140}
[       OK ] Parameters/TestRpc.TestServerShutsDown/SSL_TCP (15 ms)
[ RUN      ] Parameters/TestRpc.TimedOutOnResponseMetric/SSL_TCP
I20260923 14:34:31.184425 22936 acceptor_pool.cc:254] collecting diagnostics on the listening RPC socket 0.0.0.0:39669 every 8 connection(s)
I20260923 14:34:31.185180 22937 acceptor_pool.cc:254] collecting diagnostics on the listening RPC socket 0.0.0.0:39669 every 8 connection(s)
W20260923 14:34:31.438328 22940 rpcz_store.cc:267] Call kudu.rpc_test.CalculatorService.Sleep from 127.0.0.1:54850 (request call id 3) took 50 ms (client timeout 25 ms). Trace:
W20260923 14:34:31.438740 22940 rpcz_store.cc:269] 0923 14:34:31.387568 (+     0us) service_pool.cc:170] Inserting onto call queue
0923 14:34:31.387731 (+   163us) service_pool.cc:227] Handling call
0923 14:34:31.438216 (+ 50485us) inbound_call.cc:173] Queueing success response
Related trace 'test_child':
Metrics: {"test_sleep_us":50000,"child_traces":[["test_child",{"related_trace_metric":1}]]}
W20260923 14:34:31.498710 22940 rpcz_store.cc:267] Call kudu.rpc_test.CalculatorService.Sleep from 127.0.0.1:54850 (request call id 4) took 50 ms (client timeout 50 ms). Trace:
W20260923 14:34:31.499027 22940 rpcz_store.cc:269] 0923 14:34:31.448022 (+     0us) service_pool.cc:170] Inserting onto call queue
0923 14:34:31.448177 (+   155us) service_pool.cc:227] Handling call
0923 14:34:31.498603 (+ 50426us) inbound_call.cc:173] Queueing success response
Related trace 'test_child':
Metrics: {"test_sleep_us":50000,"child_traces":[["test_child",{"related_trace_metric":1}]]}
[       OK ] Parameters/TestRpc.TimedOutOnResponseMetric/SSL_TCP (342 ms)
[ RUN      ] Parameters/TestRpc.AcceptorDispatchingTimesMetric/SSL_TCP
I20260923 14:34:31.520704 22961 acceptor_pool.cc:254] collecting diagnostics on the listening RPC socket 0.0.0.0:46283 every 8 connection(s)
I20260923 14:34:31.521447 22962 acceptor_pool.cc:254] collecting diagnostics on the listening RPC socket 0.0.0.0:46283 every 8 connection(s)
W20260923 14:34:31.526877 22957 negotiation.cc:337] Failed RPC negotiation. Trace:
0923 14:34:31.525573 (+     0us) reactor.cc:625] Submitting negotiation task for server connection from 127.0.0.1:60226 (local address 127.0.0.1:46283)
0923 14:34:31.526044 (+   471us) server_negotiation.cc:206] Beginning negotiation
0923 14:34:31.526063 (+    19us) server_negotiation.cc:399] Waiting for connection header
0923 14:34:31.526344 (+   281us) negotiation.cc:327] Negotiation complete: Network error: Server connection negotiation failed: server connection from 127.0.0.1:60226: BlockingRecv error: recv got EOF from 127.0.0.1:60226 (error 108)
Metrics: {"server-negotiator.queue_time_us":131}
[       OK ] Parameters/TestRpc.AcceptorDispatchingTimesMetric/SSL_TCP (24 ms)
[ RUN      ] Parameters/TestRpc.TestRpcCallbackDestroysMessenger/SSL_TCP
[       OK ] Parameters/TestRpc.TestRpcCallbackDestroysMessenger/SSL_TCP (33 ms)
[ RUN      ] Parameters/TestRpc.TestApplicationFeatureFlag/SSL_TCP
I20260923 14:34:31.587736 22986 acceptor_pool.cc:254] collecting diagnostics on the listening RPC socket 0.0.0.0:45839 every 8 connection(s)
I20260923 14:34:31.588459 22987 acceptor_pool.cc:254] collecting diagnostics on the listening RPC socket 0.0.0.0:45839 every 8 connection(s)
W20260923 14:34:31.622298 22984 messenger.cc:357] Unable to handle RPC call: Not implemented: call requires unsupported application feature flags: 99
[       OK ] Parameters/TestRpc.TestApplicationFeatureFlag/SSL_TCP (64 ms)
[ RUN      ] Parameters/TestRpc.TestCancellation/SSL_TCP
I20260923 14:34:31.652634 23011 acceptor_pool.cc:254] collecting diagnostics on the listening RPC socket 0.0.0.0:37221 every 8 connection(s)
I20260923 14:34:31.653417 23012 acceptor_pool.cc:254] collecting diagnostics on the listening RPC socket 0.0.0.0:37221 every 8 connection(s)
I20260923 14:34:31.656900 22597 rpc-test.cc:1648] Connecting to 0.0.0.0:37221
I20260923 14:34:31.763584 22597 rpc-test-base.h:595] status: Aborted: Sleep RPC to 0.0.0.0:37221 is cancelled in state READY, seconds elapsed: 0.000460417
I20260923 14:34:31.911782 22597 rpc-test-base.h:595] status: Aborted: Sleep RPC to 0.0.0.0:37221 is cancelled in state SENT, seconds elapsed: 0.00103961
I20260923 14:34:31.953969 23014 rpc-test-base.h:222] got call: sleep_micros: 510000
I20260923 14:34:32.096374 22597 rpc-test-base.h:595] status: Aborted: Sleep RPC to 0.0.0.0:37221 is cancelled in state SENT, seconds elapsed: 0.00102254
I20260923 14:34:32.138803 23013 rpc-test-base.h:222] got call: sleep_micros: 510000
I20260923 14:34:32.274984 22597 rpc-test-base.h:595] status: Aborted: Sleep RPC to 0.0.0.0:37221 is cancelled in state SENT, seconds elapsed: 0.00122062
W20260923 14:34:32.316105 23015 rpcz_store.cc:267] Call kudu.rpc.GenericCalculatorService.Sleep from 127.0.0.1:41094 (request call id 11) took 16 ms (client timeout 10 ms). Trace:
W20260923 14:34:32.316509 23015 rpcz_store.cc:269] 0923 14:34:32.299659 (+     0us) service_pool.cc:170] Inserting onto call queue
0923 14:34:32.315817 (+ 16158us) service_pool.cc:214] Skipping call since client already timed out
0923 14:34:32.315916 (+    99us) inbound_call.cc:173] Queueing failure response
Metrics: {}
I20260923 14:34:32.317058 23015 rpc-test-base.h:222] got call: sleep_micros: 1500000
W20260923 14:34:32.464778 23014 rpcz_store.cc:267] Call kudu.rpc.GenericCalculatorService.Sleep from 127.0.0.1:41094 (request call id 3) took 511 ms (client timeout 10 ms). Trace:
W20260923 14:34:32.465220 23014 rpcz_store.cc:269] 0923 14:34:31.953756 (+     0us) service_pool.cc:170] Inserting onto call queue
0923 14:34:31.953891 (+   135us) service_pool.cc:227] Handling call
0923 14:34:32.464696 (+510805us) inbound_call.cc:173] Queueing success response
Metrics: {}
W20260923 14:34:32.649626 23013 rpcz_store.cc:267] Call kudu.rpc.GenericCalculatorService.Sleep from 127.0.0.1:41094 (request call id 7) took 511 ms (client timeout 10 ms). Trace:
W20260923 14:34:32.650015 23013 rpcz_store.cc:269] 0923 14:34:32.138568 (+     0us) service_pool.cc:170] Inserting onto call queue
0923 14:34:32.138725 (+   157us) service_pool.cc:227] Handling call
0923 14:34:32.649543 (+510818us) inbound_call.cc:173] Queueing success response
Metrics: {}
I20260923 14:34:33.277478 22597 rpc-test-base.h:595] status: Timed out: Sleep RPC to 0.0.0.0:37221 timed out after 1.000s (SENT), seconds elapsed: 1.00192
I20260923 14:34:33.279042 23013 rpc-test-base.h:222] got call: sleep_micros: 1500000
W20260923 14:34:33.817659 23015 rpcz_store.cc:267] Call kudu.rpc.GenericCalculatorService.Sleep from 127.0.0.1:41094 (request call id 12) took 1517 ms (client timeout 1000 ms). Trace:
W20260923 14:34:33.818008 23015 rpcz_store.cc:269] 0923 14:34:32.299987 (+     0us) service_pool.cc:170] Inserting onto call queue
0923 14:34:32.317021 (+ 17034us) service_pool.cc:227] Handling call
0923 14:34:33.817579 (+1500558us) inbound_call.cc:173] Queueing success response
Metrics: {}
I20260923 14:34:34.279248 22597 rpc-test-base.h:595] status: Timed out: Sleep RPC to 0.0.0.0:37221 timed out after 1.000s (SENT), seconds elapsed: 1.00139
W20260923 14:34:34.281121 23008 messenger.cc:357] Unable to handle RPC call: Not implemented: call requires unsupported application feature flags: 99, 1
W20260923 14:34:34.282876 23008 messenger.cc:357] Unable to handle RPC call: Not implemented: call requires unsupported application feature flags: 99, 1
W20260923 14:34:34.779716 23013 rpcz_store.cc:267] Call kudu.rpc.GenericCalculatorService.Sleep from 127.0.0.1:41094 (request call id 13) took 1500 ms (client timeout 1000 ms). Trace:
W20260923 14:34:34.780092 23013 rpcz_store.cc:269] 0923 14:34:33.278818 (+     0us) service_pool.cc:170] Inserting onto call queue
0923 14:34:33.278978 (+   160us) service_pool.cc:227] Handling call
0923 14:34:34.779636 (+1500658us) inbound_call.cc:173] Queueing success response
Metrics: {}
W20260923 14:34:34.780743 23008 connection.cc:441] server connection from 127.0.0.1:41094 torn down before Call kudu.rpc.GenericCalculatorService.Sleep from 127.0.0.1:41094 (request call id 13) could send its response
[       OK ] Parameters/TestRpc.TestCancellation/SSL_TCP (3155 ms)
[ RUN      ] Parameters/TestRpc.TestCancellationMultiThreads/SSL_TCP
I20260923 14:34:34.807515 23036 acceptor_pool.cc:254] collecting diagnostics on the listening RPC socket 0.0.0.0:38207 every 8 connection(s)
I20260923 14:34:34.808295 23037 acceptor_pool.cc:254] collecting diagnostics on the listening RPC socket 0.0.0.0:38207 every 8 connection(s)
I20260923 14:34:34.811714 22597 rpc-test.cc:1808] Connecting to 0.0.0.0:38207
I20260923 14:34:34.958717 23050 test_util.cc:268] Using random seed: 1641214803
I20260923 14:34:34.959946 23051 test_util.cc:268] Using random seed: 1641216044
I20260923 14:34:34.961480 23052 test_util.cc:268] Using random seed: 1641217580
I20260923 14:34:34.963078 23053 test_util.cc:268] Using random seed: 1641219154
I20260923 14:34:34.965014 23054 test_util.cc:268] Using random seed: 1641220920
I20260923 14:34:34.966514 23055 test_util.cc:268] Using random seed: 1641222498
I20260923 14:34:34.967962 23056 test_util.cc:268] Using random seed: 1641223953
I20260923 14:34:34.969645 23057 test_util.cc:268] Using random seed: 1641225619
I20260923 14:34:34.971256 23058 test_util.cc:268] Using random seed: 1641227174
I20260923 14:34:34.973001 23059 test_util.cc:268] Using random seed: 1641228919
I20260923 14:34:34.974637 23060 test_util.cc:268] Using random seed: 1641230511
I20260923 14:34:34.977452 23061 test_util.cc:268] Using random seed: 1641233341
I20260923 14:34:34.980072 23062 test_util.cc:268] Using random seed: 1641235974
I20260923 14:34:34.987063 23063 test_util.cc:268] Using random seed: 1641242932
I20260923 14:34:34.991564 23064 test_util.cc:268] Using random seed: 1641245426
I20260923 14:34:34.992812 23065 test_util.cc:268] Using random seed: 1641247698
I20260923 14:34:34.995759 23066 test_util.cc:268] Using random seed: 1641251683
I20260923 14:34:34.998363 23067 test_util.cc:268] Using random seed: 1641254281
I20260923 14:34:35.000334 23068 test_util.cc:268] Using random seed: 1641256229
I20260923 14:34:35.003233 23069 test_util.cc:268] Using random seed: 1641259047
I20260923 14:34:35.005062 23070 test_util.cc:268] Using random seed: 1641260918
I20260923 14:34:35.006935 23071 test_util.cc:268] Using random seed: 1641262791
I20260923 14:34:35.008920 23072 test_util.cc:268] Using random seed: 1641264814
I20260923 14:34:35.011256 23073 test_util.cc:268] Using random seed: 1641267096
I20260923 14:34:35.013058 23074 test_util.cc:268] Using random seed: 1641268981
I20260923 14:34:35.014956 23075 test_util.cc:268] Using random seed: 1641270895
I20260923 14:34:35.016870 23076 test_util.cc:268] Using random seed: 1641272796
I20260923 14:34:35.018765 23077 test_util.cc:268] Using random seed: 1641274706
I20260923 14:34:35.020748 23078 test_util.cc:268] Using random seed: 1641276681
I20260923 14:34:35.022508 23079 test_util.cc:268] Using random seed: 1641278417
[       OK ] Parameters/TestRpc.TestCancellationMultiThreads/SSL_TCP (18494 ms)
[ RUN      ] Parameters/TestRpc.TestCallId/SSL_TCP
I20260923 14:34:53.313074 23093 acceptor_pool.cc:254] collecting diagnostics on the listening RPC socket 0.0.0.0:34305 every 8 connection(s)
I20260923 14:34:53.313786 23094 acceptor_pool.cc:254] collecting diagnostics on the listening RPC socket 0.0.0.0:34305 every 8 connection(s)
[       OK ] Parameters/TestRpc.TestCallId/SSL_TCP (91 ms)
[----------] 20 tests from Parameters/TestRpc (38289 ms total)

[----------] Global test environment tear-down
[==========] 21 tests from 2 test suites ran. (38298 ms total)
[  PASSED  ] 20 tests.
[  FAILED  ] 1 test, listed below:
[  FAILED  ] Parameters/TestRpc.TestCallWithChainCertAndRootCA/SSL_TCP, where GetParam() = (true, false)

 1 FAILED TEST