Diagnosed failure
Parameters/TestRpc.TestCallWithChainCertAndChainCA/SSL_UnixSocket: /data0/somelongdirectorytoavoidrpathissues/src/kudu/src/kudu/rpc/rpc-test.cc:270: Failure
Failed
Bad status: Runtime error: could not verify certificate chain (error with cert: subject=CN = localhost, ST = sadfjas, C = AS, emailAddress = sdflkdsajf, O = lskdfjlsad, OU = sldfkja, issuer=C = AS, ST = ASDfkjdhf, L = lskdjf, O = saldfja, OU = skdjf, CN = localhost, emailAddress = sadjflkadsj): : certificate has expired
Google Test trace:
/data0/somelongdirectorytoavoidrpathissues/src/kudu/src/kudu/rpc/rpc-test.cc:267: Connecting to unix:/tmp/dist-test-taskBMqH0o/test-tmp/rpc-test-575f776023f243a1998ccac7bc40ef34.sock
I20260923 23:09:49.569175 7610 test_util.cc:175] -----------------------------------------------
I20260923 23:09:49.569247 7610 test_util.cc:176] Had fatal failures, leaving test files at /tmp/dist-test-taskBMqH0o/test-tmp/rpc-test.6.Parameters_TestRpc.TestCallWithChainCertAndChainCA_SSL_UnixSocket.1790204989500650-7610-0
Full log
Note: This is test shard 7 of 8.
[==========] Running 21 tests from 2 test suites.
[----------] Global test environment set-up.
[----------] 20 tests from Parameters/TestRpc
[ RUN ] Parameters/TestRpc.TestMessengerCreateDestroy/SSL_UnixSocket
WARNING: Logging before InitGoogleLogging() is written to STDERR
I20260923 23:09:49.531152 7610 rpc-test.cc:169] started messenger TestCreateDestroy
[ OK ] Parameters/TestRpc.TestMessengerCreateDestroy/SSL_UnixSocket (29 ms)
[ RUN ] Parameters/TestRpc.TestNegotiationDeadlock/SSL_UnixSocket
I20260923 23:09:49.543684 7630 acceptor_pool.cc:254] collecting diagnostics on the listening RPC socket unix:/tmp/dist-test-taskBMqH0o/test-tmp/rpc-test-d1c76822b557415790aa387a7bff5449.sock every 8 connection(s)
I20260923 23:09:49.543705 7631 acceptor_pool.cc:254] collecting diagnostics on the listening RPC socket unix:/tmp/dist-test-taskBMqH0o/test-tmp/rpc-test-d1c76822b557415790aa387a7bff5449.sock every 8 connection(s)
[ OK ] Parameters/TestRpc.TestNegotiationDeadlock/SSL_UnixSocket (17 ms)
[ RUN ] Parameters/TestRpc.TestCallWithChainCertAndChainCA/SSL_UnixSocket
I20260923 23:09:49.565062 7646 acceptor_pool.cc:254] collecting diagnostics on the listening RPC socket unix:/tmp/dist-test-taskBMqH0o/test-tmp/rpc-test-575f776023f243a1998ccac7bc40ef34.sock every 8 connection(s)
I20260923 23:09:49.565085 7647 acceptor_pool.cc:254] collecting diagnostics on the listening RPC socket unix:/tmp/dist-test-taskBMqH0o/test-tmp/rpc-test-575f776023f243a1998ccac7bc40ef34.sock every 8 connection(s)
/data0/somelongdirectorytoavoidrpathissues/src/kudu/src/kudu/rpc/rpc-test.cc:270: Failure
Failed
Bad status: Runtime error: could not verify certificate chain (error with cert: subject=CN = localhost, ST = sadfjas, C = AS, emailAddress = sdflkdsajf, O = lskdfjlsad, OU = sldfkja, issuer=C = AS, ST = ASDfkjdhf, L = lskdjf, O = saldfja, OU = skdjf, CN = localhost, emailAddress = sadjflkadsj): : certificate has expired
Google Test trace:
/data0/somelongdirectorytoavoidrpathissues/src/kudu/src/kudu/rpc/rpc-test.cc:267: Connecting to unix:/tmp/dist-test-taskBMqH0o/test-tmp/rpc-test-575f776023f243a1998ccac7bc40ef34.sock
I20260923 23:09:49.569175 7610 test_util.cc:175] -----------------------------------------------
I20260923 23:09:49.569247 7610 test_util.cc:176] Had fatal failures, leaving test files at /tmp/dist-test-taskBMqH0o/test-tmp/rpc-test.6.Parameters_TestRpc.TestCallWithChainCertAndChainCA_SSL_UnixSocket.1790204989500650-7610-0
[ FAILED ] Parameters/TestRpc.TestCallWithChainCertAndChainCA/SSL_UnixSocket, where GetParam() = (true, true) (18 ms)
[ RUN ] Parameters/TestRpc.TestCallWithPasswordProtectedKey/SSL_UnixSocket
I20260923 23:09:49.578641 7672 acceptor_pool.cc:254] collecting diagnostics on the listening RPC socket unix:/tmp/dist-test-taskBMqH0o/test-tmp/rpc-test-2859a0e8c2764a73a0f91712dbaa563a.sock every 8 connection(s)
I20260923 23:09:49.578605 7671 acceptor_pool.cc:254] collecting diagnostics on the listening RPC socket unix:/tmp/dist-test-taskBMqH0o/test-tmp/rpc-test-2859a0e8c2764a73a0f91712dbaa563a.sock every 8 connection(s)
W20260923 23:09:49.590059 7668 connection.cc:196] Error closing socket: Network error: TlsSocket::Close: Broken pipe
[ OK ] Parameters/TestRpc.TestCallWithPasswordProtectedKey/SSL_UnixSocket (22 ms)
[ RUN ] Parameters/TestRpc.TestCallToBadServer/SSL_UnixSocket
I20260923 23:09:49.616218 7610 rpc-test.cc:394] Status: Network error: Client connection negotiation failed: client connection to 0.0.0.0:0: connect: Connection refused (error 111)
I20260923 23:09:49.616549 7610 rpc-test.cc:394] Status: Network error: Client connection negotiation failed: client connection to 0.0.0.0:0: connect: Connection refused (error 111)
I20260923 23:09:49.616822 7610 rpc-test.cc:394] Status: Network error: Client connection negotiation failed: client connection to 0.0.0.0:0: connect: Connection refused (error 111)
I20260923 23:09:49.617087 7610 rpc-test.cc:394] Status: Network error: Client connection negotiation failed: client connection to 0.0.0.0:0: connect: Connection refused (error 111)
I20260923 23:09:49.617331 7610 rpc-test.cc:394] Status: Network error: Client connection negotiation failed: client connection to 0.0.0.0:0: connect: Connection refused (error 111)
[ OK ] Parameters/TestRpc.TestCallToBadServer/SSL_UnixSocket (26 ms)
[ RUN ] Parameters/TestRpc.TestWrongService/SSL_UnixSocket
I20260923 23:09:49.629771 7706 acceptor_pool.cc:254] collecting diagnostics on the listening RPC socket unix:/tmp/dist-test-taskBMqH0o/test-tmp/rpc-test-6533c110ee0a41698ee5435392d9320a.sock every 8 connection(s)
I20260923 23:09:49.629781 7707 acceptor_pool.cc:254] collecting diagnostics on the listening RPC socket unix:/tmp/dist-test-taskBMqH0o/test-tmp/rpc-test-6533c110ee0a41698ee5435392d9320a.sock every 8 connection(s)
I20260923 23:09:49.646476 7703 messenger.cc:345] service WrongServiceName not registered on TestServer
W20260923 23:09:49.647140 7703 connection.cc:196] Error closing socket: Network error: TlsSocket::Close: Broken pipe
[ OK ] Parameters/TestRpc.TestWrongService/SSL_UnixSocket (30 ms)
[ RUN ] Parameters/TestRpc.TestConnectionKeepalive/SSL_UnixSocket
I20260923 23:09:49.661278 7729 acceptor_pool.cc:254] collecting diagnostics on the listening RPC socket unix:/tmp/dist-test-taskBMqH0o/test-tmp/rpc-test-a0bbb07519cc455e83cbd275e97b11a2.sock every 8 connection(s)
I20260923 23:09:49.661329 7730 acceptor_pool.cc:254] collecting diagnostics on the listening RPC socket unix:/tmp/dist-test-taskBMqH0o/test-tmp/rpc-test-a0bbb07519cc455e83cbd275e97b11a2.sock every 8 connection(s)
I20260923 23:09:49.661525 7610 rpc-test.cc:488] Connecting to unix:/tmp/dist-test-taskBMqH0o/test-tmp/rpc-test-a0bbb07519cc455e83cbd275e97b11a2.sock
W20260923 23:09:50.149498 7742 connection.cc:196] Error closing socket: Network error: TlsSocket::Close: Broken pipe
[ OK ] Parameters/TestRpc.TestConnectionKeepalive/SSL_UnixSocket (1040 ms)
[ RUN ] Parameters/TestRpc.TestClientConnectionMetrics/SSL_UnixSocket
I20260923 23:09:50.701134 7754 acceptor_pool.cc:254] collecting diagnostics on the listening RPC socket unix:/tmp/dist-test-taskBMqH0o/test-tmp/rpc-test-3f48253b21f24d2187dbe516c4a4dbf5.sock every 8 connection(s)
I20260923 23:09:50.701234 7755 acceptor_pool.cc:254] collecting diagnostics on the listening RPC socket unix:/tmp/dist-test-taskBMqH0o/test-tmp/rpc-test-3f48253b21f24d2187dbe516c4a4dbf5.sock every 8 connection(s)
I20260923 23:09:50.701362 7610 rpc-test.cc:569] Connecting to unix:/tmp/dist-test-taskBMqH0o/test-tmp/rpc-test-3f48253b21f24d2187dbe516c4a4dbf5.sock
W20260923 23:09:59.010247 7751 connection.cc:196] Error closing socket: Network error: TlsSocket::Close: Broken pipe
[ OK ] Parameters/TestRpc.TestClientConnectionMetrics/SSL_UnixSocket (8322 ms)
[ RUN ] Parameters/TestRpc.TestCredentialsPolicy/SSL_UnixSocket
I20260923 23:09:59.022152 7777 acceptor_pool.cc:254] collecting diagnostics on the listening RPC socket unix:/tmp/dist-test-taskBMqH0o/test-tmp/rpc-test-ca6868aa12774534b5498ff023b09e95.sock every 8 connection(s)
I20260923 23:09:59.022264 7778 acceptor_pool.cc:254] collecting diagnostics on the listening RPC socket unix:/tmp/dist-test-taskBMqH0o/test-tmp/rpc-test-ca6868aa12774534b5498ff023b09e95.sock every 8 connection(s)
I20260923 23:09:59.022392 7610 rpc-test.cc:700] Connecting to unix:/tmp/dist-test-taskBMqH0o/test-tmp/rpc-test-ca6868aa12774534b5498ff023b09e95.sock
W20260923 23:09:59.042956 7776 connection.cc:196] Error closing socket: Network error: TlsSocket::Close: Broken pipe
[ OK ] Parameters/TestRpc.TestCredentialsPolicy/SSL_UnixSocket (37 ms)
[ RUN ] Parameters/TestRpc.TestCallLongerThanKeepalive/SSL_UnixSocket
I20260923 23:09:59.066438 7802 acceptor_pool.cc:254] collecting diagnostics on the listening RPC socket unix:/tmp/dist-test-taskBMqH0o/test-tmp/rpc-test-5018d1c43a554d2ab746e24b34264c6c.sock every 8 connection(s)
I20260923 23:09:59.066470 7803 acceptor_pool.cc:254] collecting diagnostics on the listening RPC socket unix:/tmp/dist-test-taskBMqH0o/test-tmp/rpc-test-5018d1c43a554d2ab746e24b34264c6c.sock every 8 connection(s)
I20260923 23:09:59.081525 7806 rpc-test-base.h:222] got call: sleep_micros: 3000000 deferred: true
I20260923 23:10:02.082273 7806 rpcz_store.cc:275] Call kudu.rpc.GenericCalculatorService.Sleep from unix:<unnamed> (request call id 0) took 3000 ms. Trace:
I20260923 23:10:02.082381 7806 rpcz_store.cc:276] 0923 23:09:59.081466 (+ 0us) service_pool.cc:170] Inserting onto call queue
0923 23:09:59.081502 (+ 36us) service_pool.cc:227] Handling call
0923 23:10:02.082256 (+3000754us) inbound_call.cc:173] Queueing success response
Metrics: {}
W20260923 23:10:02.083451 7799 connection.cc:196] Error closing socket: Network error: TlsSocket::Close: Broken pipe
[ OK ] Parameters/TestRpc.TestCallLongerThanKeepalive/SSL_UnixSocket (3036 ms)
[ RUN ] Parameters/TestRpc.TestRpcSidecar/SSL_UnixSocket
I20260923 23:10:02.094738 7827 acceptor_pool.cc:254] collecting diagnostics on the listening RPC socket unix:/tmp/dist-test-taskBMqH0o/test-tmp/rpc-test-72fe987ebbc74923a46f201048d58e50.sock every 8 connection(s)
I20260923 23:10:02.094782 7828 acceptor_pool.cc:254] collecting diagnostics on the listening RPC socket unix:/tmp/dist-test-taskBMqH0o/test-tmp/rpc-test-72fe987ebbc74923a46f201048d58e50.sock every 8 connection(s)
W20260923 23:10:02.139773 7824 connection.cc:196] Error closing socket: Network error: TlsSocket::Close: Broken pipe
[ OK ] Parameters/TestRpc.TestRpcSidecar/SSL_UnixSocket (56 ms)
[ RUN ] Parameters/TestRpc.TestRpcSidecarLimits/SSL_UnixSocket
I20260923 23:10:03.881656 7852 acceptor_pool.cc:254] collecting diagnostics on the listening RPC socket unix:/tmp/dist-test-taskBMqH0o/test-tmp/rpc-test-868c22096beb47b1843088a70aa96fdc.sock every 8 connection(s)
I20260923 23:10:03.881690 7853 acceptor_pool.cc:254] collecting diagnostics on the listening RPC socket unix:/tmp/dist-test-taskBMqH0o/test-tmp/rpc-test-868c22096beb47b1843088a70aa96fdc.sock every 8 connection(s)
W20260923 23:10:03.889231 7610 serialization.cc:72] Serialized kudu.rpc_test.PushStringsRequestPB (2147483654 bytes) is larger than the maximum configured RPC message size (52428800 bytes). Sending anyway, but peer may reject the data.
W20260923 23:10:03.893172 7849 connection.cc:535] server connection from unix:<unnamed> recv error: Network error: RPC frame had a length of 2147483714, but we only support messages up to 52428800 bytes long.
W20260923 23:10:03.893225 7849 connection.cc:158] shutting down server connection from unix:<unnamed> with pending inbound data: 4/2147483714 bytes received; last active 0 ns ago: status Network error: RPC frame had a length of 2147483714, but we only support messages up to 52428800 bytes long.
W20260923 23:10:03.893338 7865 connection.cc:698] client connection to unix:/tmp/dist-test-taskBMqH0o/test-tmp/rpc-test-868c22096beb47b1843088a70aa96fdc.sock send error: Network error: failed to write to TLS socket: Broken pipe
W20260923 23:10:03.893481 7865 connection.cc:196] Error closing socket: Network error: TlsSocket::Close: Success
I20260923 23:10:03.903901 7878 acceptor_pool.cc:254] collecting diagnostics on the listening RPC socket unix:/tmp/dist-test-taskBMqH0o/test-tmp/rpc-test-868c22096beb47b1843088a70aa96fdc.sock every 8 connection(s)
I20260923 23:10:03.903952 7877 acceptor_pool.cc:254] collecting diagnostics on the listening RPC socket unix:/tmp/dist-test-taskBMqH0o/test-tmp/rpc-test-868c22096beb47b1843088a70aa96fdc.sock every 8 connection(s)
W20260923 23:10:08.426749 7874 connection.cc:577] server connection from unix:<unnamed>: received bad data: 'Corruption: Invalid packet: message had a length of 2147483710, but we only support messages up to 2147483647 bytes
'
W20260923 23:10:08.427137 7890 connection.cc:196] Error closing socket: Network error: TlsSocket::Close: Broken pipe
[ OK ] Parameters/TestRpc.TestRpcSidecarLimits/SSL_UnixSocket (6288 ms)
[ RUN ] Parameters/TestRpc.TestCallTimeoutDoesntAffectNegotiation/SSL_UnixSocket
I20260923 23:10:08.440340 7902 acceptor_pool.cc:254] collecting diagnostics on the listening RPC socket unix:/tmp/dist-test-taskBMqH0o/test-tmp/rpc-test-ce3d478ffb794bf2bd6c54d003f6938e.sock every 8 connection(s)
I20260923 23:10:08.440387 7903 acceptor_pool.cc:254] collecting diagnostics on the listening RPC socket unix:/tmp/dist-test-taskBMqH0o/test-tmp/rpc-test-ce3d478ffb794bf2bd6c54d003f6938e.sock every 8 connection(s)
W20260923 23:10:08.453577 7898 negotiation.cc:266] Injecting 500ms delay in negotiation
I20260923 23:10:08.503753 7610 rpc-test-base.h:595] status: Timed out: connection negotiation to unix:/tmp/dist-test-taskBMqH0o/test-tmp/rpc-test-ce3d478ffb794bf2bd6c54d003f6938e.sock for RPC Sleep timed out after 0.050s (ON_OUTBOUND_QUEUE), seconds elapsed: 0.0505496
W20260923 23:10:08.963228 7899 connection.cc:196] Error closing socket: Network error: TlsSocket::Close: Broken pipe
[ OK ] Parameters/TestRpc.TestCallTimeoutDoesntAffectNegotiation/SSL_UnixSocket (535 ms)
[ RUN ] Parameters/TestRpc.TestRpcHandlerLatencyMetric/SSL_UnixSocket
I20260923 23:10:08.975961 7927 acceptor_pool.cc:254] collecting diagnostics on the listening RPC socket unix:/tmp/dist-test-taskBMqH0o/test-tmp/rpc-test-bc2c50ae4c294bf7b0946c86fba13c24.sock every 8 connection(s)
I20260923 23:10:08.975968 7928 acceptor_pool.cc:254] collecting diagnostics on the listening RPC socket unix:/tmp/dist-test-taskBMqH0o/test-tmp/rpc-test-bc2c50ae4c294bf7b0946c86fba13c24.sock every 8 connection(s)
I20260923 23:10:09.031711 7610 rpc-test.cc:1236] Sleep() min lat: 20343
I20260923 23:10:09.031785 7610 rpc-test.cc:1237] Sleep() mean lat: 20343
I20260923 23:10:09.031811 7610 rpc-test.cc:1238] Sleep() max lat: 20343
I20260923 23:10:09.031824 7610 rpc-test.cc:1239] Sleep() #calls: 1
W20260923 23:10:09.032456 7924 connection.cc:196] Error closing socket: Network error: TlsSocket::Close: Broken pipe
[ OK ] Parameters/TestRpc.TestRpcHandlerLatencyMetric/SSL_UnixSocket (68 ms)
[ RUN ] Parameters/TestRpc.TimedOutOnResponseMetricServiceQueue/SSL_UnixSocket
I20260923 23:10:09.045977 7953 acceptor_pool.cc:254] collecting diagnostics on the listening RPC socket unix:/tmp/dist-test-taskBMqH0o/test-tmp/rpc-test-7e865a388a9c402b930240aa68d17040.sock every 8 connection(s)
I20260923 23:10:09.046010 7954 acceptor_pool.cc:254] collecting diagnostics on the listening RPC socket unix:/tmp/dist-test-taskBMqH0o/test-tmp/rpc-test-7e865a388a9c402b930240aa68d17040.sock every 8 connection(s)
W20260923 23:10:09.106776 7955 rpcz_store.cc:267] Call kudu.rpc_test.CalculatorService.Sleep from unix:<unnamed> (request call id 2) took 20 ms (client timeout 20 ms). Trace:
W20260923 23:10:09.106918 7955 rpcz_store.cc:269] 0923 23:10:09.086425 (+ 0us) service_pool.cc:170] Inserting onto call queue
0923 23:10:09.106743 (+ 20318us) service_pool.cc:214] Skipping call since client already timed out
0923 23:10:09.106757 (+ 14us) inbound_call.cc:173] Queueing failure response
Metrics: {}
W20260923 23:10:09.107575 7950 connection.cc:196] Error closing socket: Network error: TlsSocket::Close: Broken pipe
[ OK ] Parameters/TestRpc.TimedOutOnResponseMetricServiceQueue/SSL_UnixSocket (75 ms)
[ RUN ] Parameters/TestRpc.RpcPendingConnectionsMetric/SSL_UnixSocket
I20260923 23:10:09.110416 7976 acceptor_pool.cc:254] collecting diagnostics on the listening RPC socket 0.0.0.0:34999 every 8 connection(s)
I20260923 23:10:09.110478 7977 acceptor_pool.cc:254] collecting diagnostics on the listening RPC socket 0.0.0.0:34999 every 8 connection(s)
W20260923 23:10:09.111058 7972 negotiation.cc:337] Failed RPC negotiation. Trace:
0923 23:10:09.110900 (+ 0us) reactor.cc:625] Submitting negotiation task for server connection from 127.0.0.1:49942 (local address 127.0.0.1:34999)
0923 23:10:09.110944 (+ 44us) server_negotiation.cc:206] Beginning negotiation
0923 23:10:09.110946 (+ 2us) server_negotiation.cc:399] Waiting for connection header
0923 23:10:09.111010 (+ 64us) negotiation.cc:327] Negotiation complete: Network error: Server connection negotiation failed: server connection from 127.0.0.1:49942: BlockingRecv error: recv got EOF from 127.0.0.1:49942 (error 108)
Metrics: {"server-negotiator.queue_time_us":16}
[ OK ] Parameters/TestRpc.RpcPendingConnectionsMetric/SSL_UnixSocket (13 ms)
[ RUN ] Parameters/TestRpc.TestRpcContextClientDeadline/SSL_UnixSocket
I20260923 23:10:09.138880 7992 acceptor_pool.cc:254] collecting diagnostics on the listening RPC socket unix:/tmp/dist-test-taskBMqH0o/test-tmp/rpc-test-09d595e8db764931bf9c48cab428ad46.sock every 8 connection(s)
I20260923 23:10:09.138887 7993 acceptor_pool.cc:254] collecting diagnostics on the listening RPC socket unix:/tmp/dist-test-taskBMqH0o/test-tmp/rpc-test-09d595e8db764931bf9c48cab428ad46.sock every 8 connection(s)
[ OK ] Parameters/TestRpc.TestRpcContextClientDeadline/SSL_UnixSocket (52 ms)
[ RUN ] Parameters/TestRpc.TestApplicationFeatureFlagUnsupportedServer/SSL_UnixSocket
I20260923 23:10:09.194801 8018 acceptor_pool.cc:254] collecting diagnostics on the listening RPC socket unix:/tmp/dist-test-taskBMqH0o/test-tmp/rpc-test-7e1ff6d78b3e4dc089f0c4cab2650e1d.sock every 8 connection(s)
I20260923 23:10:09.194762 8017 acceptor_pool.cc:254] collecting diagnostics on the listening RPC socket unix:/tmp/dist-test-taskBMqH0o/test-tmp/rpc-test-7e1ff6d78b3e4dc089f0c4cab2650e1d.sock every 8 connection(s)
W20260923 23:10:09.205432 8014 connection.cc:196] Error closing socket: Network error: TlsSocket::Close: Broken pipe
[ OK ] Parameters/TestRpc.TestApplicationFeatureFlagUnsupportedServer/SSL_UnixSocket (31 ms)
[ RUN ] Parameters/TestRpc.TestCancellationAsync/SSL_UnixSocket
I20260923 23:10:09.216678 8042 acceptor_pool.cc:254] collecting diagnostics on the listening RPC socket unix:/tmp/dist-test-taskBMqH0o/test-tmp/rpc-test-5c9f53808e9646f681de1549787af092.sock every 8 connection(s)
I20260923 23:10:09.216682 8043 acceptor_pool.cc:254] collecting diagnostics on the listening RPC socket unix:/tmp/dist-test-taskBMqH0o/test-tmp/rpc-test-5c9f53808e9646f681de1549787af092.sock every 8 connection(s)
I20260923 23:10:09.216887 7610 rpc-test.cc:1716] Connecting to unix:/tmp/dist-test-taskBMqH0o/test-tmp/rpc-test-5c9f53808e9646f681de1549787af092.sock
I20260923 23:10:09.227847 7610 test_util.cc:268] Using random seed: -1784254396
I20260923 23:10:09.241873 8045 rpc-test-base.h:240] got call: sleep_micros: 500 pattern: 4294967295 num_repetitions: 2097152 sidecar_idx: 0
I20260923 23:10:09.253327 8045 rpc-test-base.h:240] got call: sleep_micros: 500 pattern: 4294967295 num_repetitions: 2097152 sidecar_idx: 0
I20260923 23:10:09.264045 8045 rpc-test-base.h:240] got call: sleep_micros: 500 pattern: 4294967295 num_repetitions: 2097152 sidecar_idx: 0
I20260923 23:10:09.275002 8045 rpc-test-base.h:240] got call: sleep_micros: 500 pattern: 4294967295 num_repetitions: 2097152 sidecar_idx: 0
I20260923 23:10:09.286129 8045 rpc-test-base.h:240] got call: sleep_micros: 500 pattern: 4294967295 num_repetitions: 2097152 sidecar_idx: 0
I20260923 23:10:09.303457 8045 rpc-test-base.h:240] got call: sleep_micros: 500 pattern: 4294967295 num_repetitions: 2097152 sidecar_idx: 0
I20260923 23:10:09.317848 8045 rpc-test-base.h:240] got call: sleep_micros: 500 pattern: 4294967295 num_repetitions: 2097152 sidecar_idx: 0
I20260923 23:10:09.331610 8045 rpc-test-base.h:240] got call: sleep_micros: 500 pattern: 4294967295 num_repetitions: 2097152 sidecar_idx: 0
W20260923 23:10:09.333695 8039 connection.cc:196] Error closing socket: Network error: TlsSocket::Close: Broken pipe
W20260923 23:10:09.334841 8039 connection.cc:441] server connection from unix:<unnamed> torn down before Call kudu.rpc.GenericCalculatorService.SleepWithSidecar from unix:<unnamed> (request call id 9) could send its response
[ OK ] Parameters/TestRpc.TestCancellationAsync/SSL_UnixSocket (129 ms)
[ RUN ] Parameters/TestRpc.TestPerformanceBySocketType/SSL_UnixSocket
I20260923 23:10:09.353639 8067 acceptor_pool.cc:254] collecting diagnostics on the listening RPC socket unix:/tmp/dist-test-taskBMqH0o/test-tmp/rpc-test-659838345f2f451da6b48891cd083377.sock every 8 connection(s)
I20260923 23:10:09.353641 8068 acceptor_pool.cc:254] collecting diagnostics on the listening RPC socket unix:/tmp/dist-test-taskBMqH0o/test-tmp/rpc-test-659838345f2f451da6b48891cd083377.sock every 8 connection(s)
I20260923 23:10:09.353827 7610 rpc-test.cc:1846] Connecting to unix:/tmp/dist-test-taskBMqH0o/test-tmp/rpc-test-659838345f2f451da6b48891cd083377.sock
I20260923 23:10:10.767166 7610 rpc-test.cc:1859] Sending 1024MB via ssl-enabled unix socket: real 1.402s user 1.557s sys 0.951s
I20260923 23:10:12.132539 7610 rpc-test.cc:1859] Sending 1024MB via ssl-enabled unix socket: real 1.365s user 1.368s sys 1.068s
I20260923 23:10:13.433161 7610 rpc-test.cc:1859] Sending 1024MB via ssl-enabled unix socket: real 1.300s user 1.454s sys 0.871s
I20260923 23:10:14.771020 7610 rpc-test.cc:1859] Sending 1024MB via ssl-enabled unix socket: real 1.338s user 1.331s sys 1.057s
I20260923 23:10:16.097838 7610 rpc-test.cc:1859] Sending 1024MB via ssl-enabled unix socket: real 1.327s user 1.357s sys 1.019s
W20260923 23:10:16.098599 8064 connection.cc:196] Error closing socket: Network error: TlsSocket::Close: Broken pipe
[ OK ] Parameters/TestRpc.TestPerformanceBySocketType/SSL_UnixSocket (6763 ms)
[----------] 20 tests from Parameters/TestRpc (26596 ms total)
[----------] 1 test from Parameters/TestRpcSocketTxRxQueue
[ RUN ] Parameters/TestRpcSocketTxRxQueue.AcceptorRxQueueSizeMetric/0
I20260923 23:10:16.106323 8092 acceptor_pool.cc:254] collecting diagnostics on the listening RPC socket 0.0.0.0:33033 every 1 connection(s)
I20260923 23:10:16.106379 8093 acceptor_pool.cc:254] collecting diagnostics on the listening RPC socket 0.0.0.0:33033 every 1 connection(s)
W20260923 23:10:16.106997 8088 negotiation.cc:337] Failed RPC negotiation. Trace:
0923 23:10:16.106833 (+ 0us) reactor.cc:625] Submitting negotiation task for server connection from 127.0.0.1:37228 (local address 127.0.0.1:33033)
0923 23:10:16.106890 (+ 57us) server_negotiation.cc:206] Beginning negotiation
0923 23:10:16.106892 (+ 2us) server_negotiation.cc:399] Waiting for connection header
0923 23:10:16.106967 (+ 75us) negotiation.cc:327] Negotiation complete: Network error: Server connection negotiation failed: server connection from 127.0.0.1:37228: BlockingRecv error: recv got EOF from 127.0.0.1:37228 (error 108)
Metrics: {"server-negotiator.queue_time_us":28}
[ OK ] Parameters/TestRpcSocketTxRxQueue.AcceptorRxQueueSizeMetric/0 (9 ms)
[----------] 1 test from Parameters/TestRpcSocketTxRxQueue (9 ms total)
[----------] Global test environment tear-down
[==========] 21 tests from 2 test suites ran. (26606 ms total)
[ PASSED ] 20 tests.
[ FAILED ] 1 test, listed below:
[ FAILED ] Parameters/TestRpc.TestCallWithChainCertAndChainCA/SSL_UnixSocket, where GetParam() = (true, true)
1 FAILED TEST