Diagnosed failure

Parameters/TestRpc.TestCallWithChainCertAndRootCA/SSL_UnixSocket: /data0/somelongdirectorytoavoidrpathissues/src/kudu/src/kudu/rpc/rpc-test.cc:303: Failure
Failed
Bad status: Runtime error: could not verify certificate chain (error with cert: subject=CN = localhost, ST = sadfjas, C = AS, emailAddress = sdflkdsajf, O = lskdfjlsad, OU = sldfkja, issuer=C = AS, ST = ASDfkjdhf, L = lskdjf, O = saldfja, OU = skdjf, CN = localhost, emailAddress = sadjflkadsj): : certificate has expired
Google Test trace:
/data0/somelongdirectorytoavoidrpathissues/src/kudu/src/kudu/rpc/rpc-test.cc:300: Connecting to unix:/tmp/dist-test-taskLnjOeq/test-tmp/rpc-test-885cafb707304fe4ad7e889212eb4f29.sock
I20260924 00:21:12.521540  8178 test_util.cc:175] -----------------------------------------------
I20260924 00:21:12.521762  8178 test_util.cc:176] Had fatal failures, leaving test files at /tmp/dist-test-taskLnjOeq/test-tmp/rpc-test.2.Parameters_TestRpc.TestCallWithChainCertAndRootCA_SSL_UnixSocket.1790209268805566-8178-0

Full log

Note: This is test shard 3 of 8.
[==========] Running 21 tests from 2 test suites.
[----------] Global test environment set-up.
[----------] 1 test from TestRpc
[ RUN      ] TestRpc.TestNegotiationTimeout
WARNING: Logging before InitGoogleLogging() is written to STDERR
I20260924 00:21:08.999470  8178 rpc-test-base.h:595] status: Timed out: connection negotiation to 0.0.0.0:36023 for RPC Sleep timed out after 0.100s (ON_OUTBOUND_QUEUE), seconds elapsed: 0.101152
W20260924 00:21:12.087286  8188 negotiation.cc:337] Failed RPC negotiation. Trace:
0924 00:21:08.899322 (+     0us) reactor.cc:625] Submitting negotiation task for client connection to 0.0.0.0:36023 (local address 127.0.0.1:41232)
0924 00:21:08.900225 (+   903us) negotiation.cc:107] Waiting for socket to connect
0924 00:21:08.900279 (+    54us) client_negotiation.cc:174] Beginning negotiation
0924 00:21:08.913865 (+ 13586us) client_negotiation.cc:252] Sending NEGOTIATE NegotiatePB request
0924 00:21:12.086046 (+3172181us) negotiation.cc:327] Negotiation complete: Timed out: Client connection negotiation failed: client connection to 0.0.0.0:36023: received 0 of 4 requested bytes
Metrics: {"client-negotiator.queue_time_us":274}
[       OK ] TestRpc.TestNegotiationTimeout (3234 ms)
[----------] 1 test from TestRpc (3234 ms total)

[----------] 20 tests from Parameters/TestRpc
[ RUN      ] Parameters/TestRpc.TestAcceptorPoolStartStop/SSL_UnixSocket
I20260924 00:21:12.132920  8204 acceptor_pool.cc:254] collecting diagnostics on the listening RPC socket unix:/tmp/dist-test-taskLnjOeq/test-tmp/rpc-test-c72a503b922648a8bb1fa95e9e5326a8.sock every 8 connection(s)
I20260924 00:21:12.134966  8205 acceptor_pool.cc:254] collecting diagnostics on the listening RPC socket unix:/tmp/dist-test-taskLnjOeq/test-tmp/rpc-test-c72a503b922648a8bb1fa95e9e5326a8.sock every 8 connection(s)
I20260924 00:21:12.181785  8215 acceptor_pool.cc:254] collecting diagnostics on the listening RPC socket unix:/tmp/dist-test-taskLnjOeq/test-tmp/rpc-test-c72a503b922648a8bb1fa95e9e5326a8.sock every 8 connection(s)
I20260924 00:21:12.183380  8216 acceptor_pool.cc:254] collecting diagnostics on the listening RPC socket unix:/tmp/dist-test-taskLnjOeq/test-tmp/rpc-test-c72a503b922648a8bb1fa95e9e5326a8.sock every 8 connection(s)
I20260924 00:21:12.209085  8226 acceptor_pool.cc:254] collecting diagnostics on the listening RPC socket unix:/tmp/dist-test-taskLnjOeq/test-tmp/rpc-test-c72a503b922648a8bb1fa95e9e5326a8.sock every 8 connection(s)
I20260924 00:21:12.210162  8227 acceptor_pool.cc:254] collecting diagnostics on the listening RPC socket unix:/tmp/dist-test-taskLnjOeq/test-tmp/rpc-test-c72a503b922648a8bb1fa95e9e5326a8.sock every 8 connection(s)
I20260924 00:21:12.243916  8237 acceptor_pool.cc:254] collecting diagnostics on the listening RPC socket unix:/tmp/dist-test-taskLnjOeq/test-tmp/rpc-test-c72a503b922648a8bb1fa95e9e5326a8.sock every 8 connection(s)
I20260924 00:21:12.244833  8238 acceptor_pool.cc:254] collecting diagnostics on the listening RPC socket unix:/tmp/dist-test-taskLnjOeq/test-tmp/rpc-test-c72a503b922648a8bb1fa95e9e5326a8.sock every 8 connection(s)
I20260924 00:21:12.280625  8248 acceptor_pool.cc:254] collecting diagnostics on the listening RPC socket unix:/tmp/dist-test-taskLnjOeq/test-tmp/rpc-test-c72a503b922648a8bb1fa95e9e5326a8.sock every 8 connection(s)
I20260924 00:21:12.281512  8249 acceptor_pool.cc:254] collecting diagnostics on the listening RPC socket unix:/tmp/dist-test-taskLnjOeq/test-tmp/rpc-test-c72a503b922648a8bb1fa95e9e5326a8.sock every 8 connection(s)
[       OK ] Parameters/TestRpc.TestAcceptorPoolStartStop/SSL_UnixSocket (193 ms)
[ RUN      ] Parameters/TestRpc.TestCall/SSL_UnixSocket
I20260924 00:21:12.345475  8261 acceptor_pool.cc:254] collecting diagnostics on the listening RPC socket unix:/tmp/dist-test-taskLnjOeq/test-tmp/rpc-test-535cb887e34f42fbb75cd49d45a8852d.sock every 8 connection(s)
I20260924 00:21:12.347810  8262 acceptor_pool.cc:254] collecting diagnostics on the listening RPC socket unix:/tmp/dist-test-taskLnjOeq/test-tmp/rpc-test-535cb887e34f42fbb75cd49d45a8852d.sock every 8 connection(s)
I20260924 00:21:12.354328  8178 rpc-test.cc:234] Connecting to unix:/tmp/dist-test-taskLnjOeq/test-tmp/rpc-test-535cb887e34f42fbb75cd49d45a8852d.sock
W20260924 00:21:12.418910  8258 connection.cc:196] Error closing socket: Network error: TlsSocket::Close: Broken pipe
[       OK ] Parameters/TestRpc.TestCall/SSL_UnixSocket (140 ms)
[ RUN      ] Parameters/TestRpc.TestCallWithChainCertAndRootCA/SSL_UnixSocket
I20260924 00:21:12.497850  8286 acceptor_pool.cc:254] collecting diagnostics on the listening RPC socket unix:/tmp/dist-test-taskLnjOeq/test-tmp/rpc-test-885cafb707304fe4ad7e889212eb4f29.sock every 8 connection(s)
I20260924 00:21:12.498562  8287 acceptor_pool.cc:254] collecting diagnostics on the listening RPC socket unix:/tmp/dist-test-taskLnjOeq/test-tmp/rpc-test-885cafb707304fe4ad7e889212eb4f29.sock every 8 connection(s)
/data0/somelongdirectorytoavoidrpathissues/src/kudu/src/kudu/rpc/rpc-test.cc:303: Failure
Failed
Bad status: Runtime error: could not verify certificate chain (error with cert: subject=CN = localhost, ST = sadfjas, C = AS, emailAddress = sdflkdsajf, O = lskdfjlsad, OU = sldfkja, issuer=C = AS, ST = ASDfkjdhf, L = lskdjf, O = saldfja, OU = skdjf, CN = localhost, emailAddress = sadjflkadsj): : certificate has expired
Google Test trace:
/data0/somelongdirectorytoavoidrpathissues/src/kudu/src/kudu/rpc/rpc-test.cc:300: Connecting to unix:/tmp/dist-test-taskLnjOeq/test-tmp/rpc-test-885cafb707304fe4ad7e889212eb4f29.sock
I20260924 00:21:12.521540  8178 test_util.cc:175] -----------------------------------------------
I20260924 00:21:12.521762  8178 test_util.cc:176] Had fatal failures, leaving test files at /tmp/dist-test-taskLnjOeq/test-tmp/rpc-test.2.Parameters_TestRpc.TestCallWithChainCertAndRootCA_SSL_UnixSocket.1790209268805566-8178-0
[  FAILED  ] Parameters/TestRpc.TestCallWithChainCertAndRootCA/SSL_UnixSocket, where GetParam() = (true, true) (94 ms)
[ RUN      ] Parameters/TestRpc.TestCallWithBadPasswordProtectedKey/SSL_UnixSocket
[       OK ] Parameters/TestRpc.TestCallWithBadPasswordProtectedKey/SSL_UnixSocket (34 ms)
[ RUN      ] Parameters/TestRpc.TestInvalidMethodCall/SSL_UnixSocket
I20260924 00:21:12.585737  8323 acceptor_pool.cc:254] collecting diagnostics on the listening RPC socket unix:/tmp/dist-test-taskLnjOeq/test-tmp/rpc-test-8f0c34a7ec784a45a89dd986125bd3fd.sock every 8 connection(s)
I20260924 00:21:12.586547  8324 acceptor_pool.cc:254] collecting diagnostics on the listening RPC socket unix:/tmp/dist-test-taskLnjOeq/test-tmp/rpc-test-8f0c34a7ec784a45a89dd986125bd3fd.sock every 8 connection(s)
I20260924 00:21:12.590035  8178 rpc-test.cc:406] Connecting to unix:/tmp/dist-test-taskLnjOeq/test-tmp/rpc-test-8f0c34a7ec784a45a89dd986125bd3fd.sock
[       OK ] Parameters/TestRpc.TestInvalidMethodCall/SSL_UnixSocket (73 ms)
[ RUN      ] Parameters/TestRpc.TestHighFDs/SSL_UnixSocket
I20260924 00:21:12.846460  8348 acceptor_pool.cc:254] collecting diagnostics on the listening RPC socket unix:/tmp/dist-test-taskLnjOeq/test-tmp/rpc-test-5a07cf4702ee4c4dabcf60d5cc7b3958.sock every 8 connection(s)
I20260924 00:21:12.847208  8349 acceptor_pool.cc:254] collecting diagnostics on the listening RPC socket unix:/tmp/dist-test-taskLnjOeq/test-tmp/rpc-test-5a07cf4702ee4c4dabcf60d5cc7b3958.sock every 8 connection(s)
W20260924 00:21:12.878013  8345 connection.cc:196] Error closing socket: Network error: TlsSocket::Close: Broken pipe
[       OK ] Parameters/TestRpc.TestHighFDs/SSL_UnixSocket (257 ms)
[ RUN      ] Parameters/TestRpc.TestConnectionAlwaysKeepalive/SSL_UnixSocket
I20260924 00:21:12.905259  8371 acceptor_pool.cc:254] collecting diagnostics on the listening RPC socket unix:/tmp/dist-test-taskLnjOeq/test-tmp/rpc-test-5e06a01a83a7491493eef0f5568468ed.sock every 8 connection(s)
I20260924 00:21:12.906386  8372 acceptor_pool.cc:254] collecting diagnostics on the listening RPC socket unix:/tmp/dist-test-taskLnjOeq/test-tmp/rpc-test-5e06a01a83a7491493eef0f5568468ed.sock every 8 connection(s)
I20260924 00:21:12.909606  8178 rpc-test.cc:532] Connecting to unix:/tmp/dist-test-taskLnjOeq/test-tmp/rpc-test-5e06a01a83a7491493eef0f5568468ed.sock
W20260924 00:21:15.937875  8370 connection.cc:196] Error closing socket: Network error: TlsSocket::Close: Broken pipe
[       OK ] Parameters/TestRpc.TestConnectionAlwaysKeepalive/SSL_UnixSocket (3054 ms)
[ RUN      ] Parameters/TestRpc.TestReopenOutboundConnections/SSL_UnixSocket
I20260924 00:21:16.017163  8394 acceptor_pool.cc:254] collecting diagnostics on the listening RPC socket unix:/tmp/dist-test-taskLnjOeq/test-tmp/rpc-test-bd66617445f44ac3b20395d2246798cb.sock every 8 connection(s)
I20260924 00:21:16.017822  8395 acceptor_pool.cc:254] collecting diagnostics on the listening RPC socket unix:/tmp/dist-test-taskLnjOeq/test-tmp/rpc-test-bd66617445f44ac3b20395d2246798cb.sock every 8 connection(s)
I20260924 00:21:16.020852  8178 rpc-test.cc:658] Connecting to unix:/tmp/dist-test-taskLnjOeq/test-tmp/rpc-test-bd66617445f44ac3b20395d2246798cb.sock
W20260924 00:21:16.055272  8393 connection.cc:196] Error closing socket: Network error: TlsSocket::Close: Broken pipe
W20260924 00:21:16.064724  8393 connection.cc:196] Error closing socket: Network error: TlsSocket::Close: Broken pipe
W20260924 00:21:16.074313  8393 connection.cc:196] Error closing socket: Network error: TlsSocket::Close: Broken pipe
W20260924 00:21:16.085258  8393 connection.cc:196] Error closing socket: Network error: TlsSocket::Close: Broken pipe
W20260924 00:21:16.096067  8393 connection.cc:196] Error closing socket: Network error: TlsSocket::Close: Broken pipe
W20260924 00:21:16.106122  8393 connection.cc:196] Error closing socket: Network error: TlsSocket::Close: Broken pipe
W20260924 00:21:16.117161  8393 connection.cc:196] Error closing socket: Network error: TlsSocket::Close: Broken pipe
W20260924 00:21:16.128013  8393 connection.cc:196] Error closing socket: Network error: TlsSocket::Close: Broken pipe
W20260924 00:21:16.138585  8393 connection.cc:196] Error closing socket: Network error: TlsSocket::Close: Broken pipe
W20260924 00:21:16.149727  8393 connection.cc:196] Error closing socket: Network error: TlsSocket::Close: Broken pipe
W20260924 00:21:16.161233  8393 connection.cc:196] Error closing socket: Network error: TlsSocket::Close: Broken pipe
W20260924 00:21:16.172286  8393 connection.cc:196] Error closing socket: Network error: TlsSocket::Close: Broken pipe
W20260924 00:21:16.183085  8393 connection.cc:196] Error closing socket: Network error: TlsSocket::Close: Broken pipe
W20260924 00:21:16.194204  8393 connection.cc:196] Error closing socket: Network error: TlsSocket::Close: Broken pipe
W20260924 00:21:16.194271  8394 acceptor_pool.cc:285] unable to collect diagnostics on RPC socket unix:/tmp/dist-test-taskLnjOeq/test-tmp/rpc-test-bd66617445f44ac3b20395d2246798cb.sock: Not implemented: netlink diagnostics is currently supported only on IPv4 TCP sockets
W20260924 00:21:16.204497  8393 connection.cc:196] Error closing socket: Network error: TlsSocket::Close: Broken pipe
W20260924 00:21:16.215515  8393 connection.cc:196] Error closing socket: Network error: TlsSocket::Close: Broken pipe
W20260924 00:21:16.226598  8393 connection.cc:196] Error closing socket: Network error: TlsSocket::Close: Broken pipe
W20260924 00:21:16.237679  8393 connection.cc:196] Error closing socket: Network error: TlsSocket::Close: Broken pipe
W20260924 00:21:16.248420  8393 connection.cc:196] Error closing socket: Network error: TlsSocket::Close: Broken pipe
W20260924 00:21:16.258654  8393 connection.cc:196] Error closing socket: Network error: TlsSocket::Close: Broken pipe
W20260924 00:21:16.269979  8393 connection.cc:196] Error closing socket: Network error: TlsSocket::Close: Broken pipe
W20260924 00:21:16.281255  8393 connection.cc:196] Error closing socket: Network error: TlsSocket::Close: Broken pipe
W20260924 00:21:16.292109  8393 connection.cc:196] Error closing socket: Network error: TlsSocket::Close: Broken pipe
W20260924 00:21:16.302886  8393 connection.cc:196] Error closing socket: Network error: TlsSocket::Close: Broken pipe
W20260924 00:21:16.312516  8393 connection.cc:196] Error closing socket: Network error: TlsSocket::Close: Broken pipe
W20260924 00:21:16.322341  8393 connection.cc:196] Error closing socket: Network error: TlsSocket::Close: Broken pipe
W20260924 00:21:16.332330  8393 connection.cc:196] Error closing socket: Network error: TlsSocket::Close: Broken pipe
W20260924 00:21:16.341741  8393 connection.cc:196] Error closing socket: Network error: TlsSocket::Close: Broken pipe
W20260924 00:21:16.350663  8393 connection.cc:196] Error closing socket: Network error: TlsSocket::Close: Broken pipe
W20260924 00:21:16.360146  8393 connection.cc:196] Error closing socket: Network error: TlsSocket::Close: Broken pipe
W20260924 00:21:16.369597  8393 connection.cc:196] Error closing socket: Network error: TlsSocket::Close: Broken pipe
W20260924 00:21:16.381091  8393 connection.cc:196] Error closing socket: Network error: TlsSocket::Close: Broken pipe
[       OK ] Parameters/TestRpc.TestReopenOutboundConnections/SSL_UnixSocket (443 ms)
[ RUN      ] Parameters/TestRpc.TestConnectionNetworkPlane/SSL_UnixSocket
I20260924 00:21:16.412446  8417 acceptor_pool.cc:254] collecting diagnostics on the listening RPC socket unix:/tmp/dist-test-taskLnjOeq/test-tmp/rpc-test-5d0517c64eb145a5907f3db4a2aaad0a.sock every 8 connection(s)
I20260924 00:21:16.413159  8418 acceptor_pool.cc:254] collecting diagnostics on the listening RPC socket unix:/tmp/dist-test-taskLnjOeq/test-tmp/rpc-test-5d0517c64eb145a5907f3db4a2aaad0a.sock every 8 connection(s)
I20260924 00:21:16.416383  8178 rpc-test.cc:772] Connecting to unix:/tmp/dist-test-taskLnjOeq/test-tmp/rpc-test-5d0517c64eb145a5907f3db4a2aaad0a.sock
W20260924 00:21:16.484099  8416 connection.cc:196] Error closing socket: Network error: TlsSocket::Close: Broken pipe
[       OK ] Parameters/TestRpc.TestConnectionNetworkPlane/SSL_UnixSocket (101 ms)
[ RUN      ] Parameters/TestRpc.TestTCPKeepalive/SSL_UnixSocket
I20260924 00:21:16.519296  8442 acceptor_pool.cc:254] collecting diagnostics on the listening RPC socket unix:/tmp/dist-test-taskLnjOeq/test-tmp/rpc-test-e1d1a57a10254e3681f8e18ecb463faf.sock every 8 connection(s)
I20260924 00:21:16.520138  8443 acceptor_pool.cc:254] collecting diagnostics on the listening RPC socket unix:/tmp/dist-test-taskLnjOeq/test-tmp/rpc-test-e1d1a57a10254e3681f8e18ecb463faf.sock every 8 connection(s)
I20260924 00:21:16.547847  8446 rpc-test-base.h:222] got call: sleep_micros: 8000000 deferred: true
I20260924 00:21:24.552057  8446 rpcz_store.cc:275] Call kudu.rpc.GenericCalculatorService.Sleep from unix:<unnamed> (request call id 0) took 8004 ms. Trace:
I20260924 00:21:24.552532  8446 rpcz_store.cc:276] 0924 00:21:16.547655 (+     0us) service_pool.cc:170] Inserting onto call queue
0924 00:21:16.547791 (+   136us) service_pool.cc:227] Handling call
0924 00:21:24.551886 (+8004095us) inbound_call.cc:173] Queueing success response
Metrics: {}
W20260924 00:21:24.559608  8439 connection.cc:196] Error closing socket: Network error: TlsSocket::Close: Broken pipe
[       OK ] Parameters/TestRpc.TestTCPKeepalive/SSL_UnixSocket (8079 ms)
[ RUN      ] Parameters/TestRpc.TestMaxSmallSidecars/SSL_UnixSocket
I20260924 00:21:24.594004  8468 acceptor_pool.cc:254] collecting diagnostics on the listening RPC socket unix:/tmp/dist-test-taskLnjOeq/test-tmp/rpc-test-aef89ec121c24a0ab9dccf1c500d4b72.sock every 8 connection(s)
I20260924 00:21:24.594803  8469 acceptor_pool.cc:254] collecting diagnostics on the listening RPC socket unix:/tmp/dist-test-taskLnjOeq/test-tmp/rpc-test-aef89ec121c24a0ab9dccf1c500d4b72.sock every 8 connection(s)
W20260924 00:21:24.768518  8465 connection.cc:196] Error closing socket: Network error: TlsSocket::Close: Broken pipe
[       OK ] Parameters/TestRpc.TestMaxSmallSidecars/SSL_UnixSocket (205 ms)
[ RUN      ] Parameters/TestRpc.TestCallTimeout/SSL_UnixSocket
I20260924 00:21:24.793246  8493 acceptor_pool.cc:254] collecting diagnostics on the listening RPC socket unix:/tmp/dist-test-taskLnjOeq/test-tmp/rpc-test-09c1686ab3d04c8fa811f701af95fff6.sock every 8 connection(s)
I20260924 00:21:24.794117  8494 acceptor_pool.cc:254] collecting diagnostics on the listening RPC socket unix:/tmp/dist-test-taskLnjOeq/test-tmp/rpc-test-09c1686ab3d04c8fa811f701af95fff6.sock every 8 connection(s)
I20260924 00:21:24.815977  8178 rpc-test-base.h:595] status: Timed out: connection negotiation to unix:/tmp/dist-test-taskLnjOeq/test-tmp/rpc-test-09c1686ab3d04c8fa811f701af95fff6.sock for RPC Sleep timed out after 0.000s (ON_OUTBOUND_QUEUE), seconds elapsed: 0.00239061
I20260924 00:21:24.824821  8497 rpc-test-base.h:222] got call: sleep_micros: 700000
I20260924 00:21:25.017702  8178 rpc-test-base.h:595] status: Timed out: Sleep RPC to unix:/tmp/dist-test-taskLnjOeq/test-tmp/rpc-test-09c1686ab3d04c8fa811f701af95fff6.sock timed out after 0.200s (SENT), seconds elapsed: 0.201364
I20260924 00:21:25.019253  8496 rpc-test-base.h:222] got call: sleep_micros: 2000000
W20260924 00:21:25.525522  8497 rpcz_store.cc:267] Call kudu.rpc.GenericCalculatorService.Sleep from unix:<unnamed> (request call id 1) took 700 ms (client timeout 200 ms). Trace:
W20260924 00:21:25.525893  8497 rpcz_store.cc:269] 0924 00:21:24.824654 (+     0us) service_pool.cc:170] Inserting onto call queue
0924 00:21:24.824775 (+   121us) service_pool.cc:227] Handling call
0924 00:21:25.525447 (+700672us) inbound_call.cc:173] Queueing success response
Metrics: {}
I20260924 00:21:26.520524  8178 rpc-test-base.h:595] status: Timed out: Sleep RPC to unix:/tmp/dist-test-taskLnjOeq/test-tmp/rpc-test-09c1686ab3d04c8fa811f701af95fff6.sock timed out after 1.500s (SENT), seconds elapsed: 1.50238
W20260924 00:21:27.019858  8496 rpcz_store.cc:267] Call kudu.rpc.GenericCalculatorService.Sleep from unix:<unnamed> (request call id 2) took 2000 ms (client timeout 1500 ms). Trace:
W20260924 00:21:27.020267  8496 rpcz_store.cc:269] 0924 00:21:25.019041 (+     0us) service_pool.cc:170] Inserting onto call queue
0924 00:21:25.019192 (+   151us) service_pool.cc:227] Handling call
0924 00:21:27.019783 (+2000591us) inbound_call.cc:173] Queueing success response
Metrics: {}
W20260924 00:21:27.021066  8490 connection.cc:441] server connection from unix:<unnamed> torn down before Call kudu.rpc.GenericCalculatorService.Sleep from unix:<unnamed> (request call id 2) could send its response
[       OK ] Parameters/TestRpc.TestCallTimeout/SSL_UnixSocket (2253 ms)
[ RUN      ] Parameters/TestRpc.TestServerShutsDown/SSL_UnixSocket
I20260924 00:21:27.028745  8178 rpc-test.cc:1125] Connecting to 0.0.0.0:46299
W20260924 00:21:27.038686  8510 negotiation.cc:337] Failed RPC negotiation. Trace:
0924 00:21:27.037111 (+     0us) reactor.cc:625] Submitting negotiation task for client connection to 0.0.0.0:46299 (local address 127.0.0.1:56174)
0924 00:21:27.037695 (+   584us) negotiation.cc:107] Waiting for socket to connect
0924 00:21:27.037727 (+    32us) client_negotiation.cc:174] Beginning negotiation
0924 00:21:27.037947 (+   220us) client_negotiation.cc:252] Sending NEGOTIATE NegotiatePB request
0924 00:21:27.038168 (+   221us) negotiation.cc:327] Negotiation complete: Network error: Client connection negotiation failed: client connection to 0.0.0.0:46299: BlockingWrite error: write error: Broken pipe (error 32)
Metrics: {"client-negotiator.queue_time_us":145}
[       OK ] Parameters/TestRpc.TestServerShutsDown/SSL_UnixSocket (14 ms)
[ RUN      ] Parameters/TestRpc.TimedOutOnResponseMetric/SSL_UnixSocket
I20260924 00:21:27.070597  8527 acceptor_pool.cc:254] collecting diagnostics on the listening RPC socket unix:/tmp/dist-test-taskLnjOeq/test-tmp/rpc-test-c35e3fcede9f4183b6cef34c46da46f4.sock every 8 connection(s)
I20260924 00:21:27.071318  8528 acceptor_pool.cc:254] collecting diagnostics on the listening RPC socket unix:/tmp/dist-test-taskLnjOeq/test-tmp/rpc-test-c35e3fcede9f4183b6cef34c46da46f4.sock every 8 connection(s)
W20260924 00:21:27.313445  8531 rpcz_store.cc:267] Call kudu.rpc_test.CalculatorService.Sleep from unix:<unnamed> (request call id 3) took 50 ms (client timeout 25 ms). Trace:
W20260924 00:21:27.313795  8531 rpcz_store.cc:269] 0924 00:21:27.262771 (+     0us) service_pool.cc:170] Inserting onto call queue
0924 00:21:27.262884 (+   113us) service_pool.cc:227] Handling call
0924 00:21:27.313304 (+ 50420us) inbound_call.cc:173] Queueing success response
Related trace 'test_child':
Metrics: {"test_sleep_us":50000,"child_traces":[["test_child",{"related_trace_metric":1}]]}
W20260924 00:21:27.373441  8531 rpcz_store.cc:267] Call kudu.rpc_test.CalculatorService.Sleep from unix:<unnamed> (request call id 4) took 50 ms (client timeout 50 ms). Trace:
W20260924 00:21:27.373726  8531 rpcz_store.cc:269] 0924 00:21:27.322789 (+     0us) service_pool.cc:170] Inserting onto call queue
0924 00:21:27.322915 (+   126us) service_pool.cc:227] Handling call
0924 00:21:27.373294 (+ 50379us) inbound_call.cc:173] Queueing success response
Related trace 'test_child':
Metrics: {"test_sleep_us":50000,"child_traces":[["test_child",{"related_trace_metric":1}]]}
[       OK ] Parameters/TestRpc.TimedOutOnResponseMetric/SSL_UnixSocket (341 ms)
[ RUN      ] Parameters/TestRpc.AcceptorDispatchingTimesMetric/SSL_UnixSocket
I20260924 00:21:27.395262  8552 acceptor_pool.cc:254] collecting diagnostics on the listening RPC socket 0.0.0.0:37439 every 8 connection(s)
I20260924 00:21:27.395965  8553 acceptor_pool.cc:254] collecting diagnostics on the listening RPC socket 0.0.0.0:37439 every 8 connection(s)
W20260924 00:21:27.402400  8548 negotiation.cc:337] Failed RPC negotiation. Trace:
0924 00:21:27.399921 (+     0us) reactor.cc:625] Submitting negotiation task for server connection from 127.0.0.1:46520 (local address 127.0.0.1:37439)
0924 00:21:27.400562 (+   641us) server_negotiation.cc:206] Beginning negotiation
0924 00:21:27.400598 (+    36us) server_negotiation.cc:399] Waiting for connection header
0924 00:21:27.400940 (+   342us) negotiation.cc:327] Negotiation complete: Network error: Server connection negotiation failed: server connection from 127.0.0.1:46520: BlockingRecv error: recv got EOF from 127.0.0.1:46520 (error 108)
Metrics: {"server-negotiator.queue_time_us":127}
[       OK ] Parameters/TestRpc.AcceptorDispatchingTimesMetric/SSL_UnixSocket (22 ms)
[ RUN      ] Parameters/TestRpc.TestRpcCallbackDestroysMessenger/SSL_UnixSocket
[       OK ] Parameters/TestRpc.TestRpcCallbackDestroysMessenger/SSL_UnixSocket (22 ms)
[ RUN      ] Parameters/TestRpc.TestApplicationFeatureFlag/SSL_UnixSocket
I20260924 00:21:27.454514  8577 acceptor_pool.cc:254] collecting diagnostics on the listening RPC socket unix:/tmp/dist-test-taskLnjOeq/test-tmp/rpc-test-6cd2c92d391643b6b347d95a4d72aa12.sock every 8 connection(s)
I20260924 00:21:27.455269  8578 acceptor_pool.cc:254] collecting diagnostics on the listening RPC socket unix:/tmp/dist-test-taskLnjOeq/test-tmp/rpc-test-6cd2c92d391643b6b347d95a4d72aa12.sock every 8 connection(s)
W20260924 00:21:27.492553  8574 messenger.cc:357] Unable to handle RPC call: Not implemented: call requires unsupported application feature flags: 99
W20260924 00:21:27.495834  8574 connection.cc:196] Error closing socket: Network error: TlsSocket::Close: Broken pipe
[       OK ] Parameters/TestRpc.TestApplicationFeatureFlag/SSL_UnixSocket (72 ms)
[ RUN      ] Parameters/TestRpc.TestCancellation/SSL_UnixSocket
I20260924 00:21:27.527494  8602 acceptor_pool.cc:254] collecting diagnostics on the listening RPC socket unix:/tmp/dist-test-taskLnjOeq/test-tmp/rpc-test-1f1e88b70ad44574a53e19a0f00c9a8d.sock every 8 connection(s)
I20260924 00:21:27.528213  8603 acceptor_pool.cc:254] collecting diagnostics on the listening RPC socket unix:/tmp/dist-test-taskLnjOeq/test-tmp/rpc-test-1f1e88b70ad44574a53e19a0f00c9a8d.sock every 8 connection(s)
I20260924 00:21:27.531432  8178 rpc-test.cc:1648] Connecting to unix:/tmp/dist-test-taskLnjOeq/test-tmp/rpc-test-1f1e88b70ad44574a53e19a0f00c9a8d.sock
I20260924 00:21:27.636504  8178 rpc-test-base.h:595] status: Aborted: Sleep RPC to unix:/tmp/dist-test-taskLnjOeq/test-tmp/rpc-test-1f1e88b70ad44574a53e19a0f00c9a8d.sock is cancelled in state READY, seconds elapsed: 0.000450563
I20260924 00:21:27.806311  8178 rpc-test-base.h:595] status: Aborted: Sleep RPC to unix:/tmp/dist-test-taskLnjOeq/test-tmp/rpc-test-1f1e88b70ad44574a53e19a0f00c9a8d.sock is cancelled in state SENT, seconds elapsed: 0.000951768
I20260924 00:21:27.806517  8605 rpc-test-base.h:222] got call: sleep_micros: 510000
I20260924 00:21:27.975989  8178 rpc-test-base.h:595] status: Aborted: Sleep RPC to unix:/tmp/dist-test-taskLnjOeq/test-tmp/rpc-test-1f1e88b70ad44574a53e19a0f00c9a8d.sock is cancelled in state SENT, seconds elapsed: 0.000715056
I20260924 00:21:27.976890  8604 rpc-test-base.h:222] got call: sleep_micros: 510000
I20260924 00:21:28.154098  8178 rpc-test-base.h:595] status: Aborted: Sleep RPC to unix:/tmp/dist-test-taskLnjOeq/test-tmp/rpc-test-1f1e88b70ad44574a53e19a0f00c9a8d.sock is cancelled in state SENT, seconds elapsed: 0.000980144
W20260924 00:21:28.164803  8606 rpcz_store.cc:267] Call kudu.rpc.GenericCalculatorService.Sleep from unix:<unnamed> (request call id 11) took 10 ms (client timeout 10 ms). Trace:
W20260924 00:21:28.165107  8606 rpcz_store.cc:269] 0924 00:21:28.154216 (+     0us) service_pool.cc:170] Inserting onto call queue
0924 00:21:28.164515 (+ 10299us) service_pool.cc:214] Skipping call since client already timed out
0924 00:21:28.164625 (+   110us) inbound_call.cc:173] Queueing failure response
Metrics: {}
I20260924 00:21:28.165694  8606 rpc-test-base.h:222] got call: sleep_micros: 1500000
W20260924 00:21:28.317190  8605 rpcz_store.cc:267] Call kudu.rpc.GenericCalculatorService.Sleep from unix:<unnamed> (request call id 3) took 511 ms (client timeout 10 ms). Trace:
W20260924 00:21:28.317560  8605 rpcz_store.cc:269] 0924 00:21:27.806306 (+     0us) service_pool.cc:170] Inserting onto call queue
0924 00:21:27.806460 (+   154us) service_pool.cc:227] Handling call
0924 00:21:28.317134 (+510674us) inbound_call.cc:173] Queueing success response
Metrics: {}
W20260924 00:21:28.487507  8604 rpcz_store.cc:267] Call kudu.rpc.GenericCalculatorService.Sleep from unix:<unnamed> (request call id 7) took 510 ms (client timeout 10 ms). Trace:
W20260924 00:21:28.487936  8604 rpcz_store.cc:269] 0924 00:21:27.976739 (+     0us) service_pool.cc:170] Inserting onto call queue
0924 00:21:27.976837 (+    98us) service_pool.cc:227] Handling call
0924 00:21:28.487451 (+510614us) inbound_call.cc:173] Queueing success response
Metrics: {}
I20260924 00:21:29.156205  8178 rpc-test-base.h:595] status: Timed out: Sleep RPC to unix:/tmp/dist-test-taskLnjOeq/test-tmp/rpc-test-1f1e88b70ad44574a53e19a0f00c9a8d.sock timed out after 1.000s (SENT), seconds elapsed: 1.00167
I20260924 00:21:29.158257  8604 rpc-test-base.h:222] got call: sleep_micros: 1500000
W20260924 00:21:29.666433  8606 rpcz_store.cc:267] Call kudu.rpc.GenericCalculatorService.Sleep from unix:<unnamed> (request call id 12) took 1511 ms (client timeout 1000 ms). Trace:
W20260924 00:21:29.666769  8606 rpcz_store.cc:269] 0924 00:21:28.155185 (+     0us) service_pool.cc:170] Inserting onto call queue
0924 00:21:28.165652 (+ 10467us) service_pool.cc:227] Handling call
0924 00:21:29.666289 (+1500637us) inbound_call.cc:173] Queueing success response
Metrics: {}
I20260924 00:21:30.158697  8178 rpc-test-base.h:595] status: Timed out: Sleep RPC to unix:/tmp/dist-test-taskLnjOeq/test-tmp/rpc-test-1f1e88b70ad44574a53e19a0f00c9a8d.sock timed out after 1.000s (SENT), seconds elapsed: 1.00205
W20260924 00:21:30.160413  8599 messenger.cc:357] Unable to handle RPC call: Not implemented: call requires unsupported application feature flags: 99, 1
W20260924 00:21:30.162133  8599 messenger.cc:357] Unable to handle RPC call: Not implemented: call requires unsupported application feature flags: 99, 1
W20260924 00:21:30.381655  8599 connection.cc:196] Error closing socket: Network error: TlsSocket::Close: Broken pipe
W20260924 00:21:30.658883  8604 rpcz_store.cc:267] Call kudu.rpc.GenericCalculatorService.Sleep from unix:<unnamed> (request call id 13) took 1501 ms (client timeout 1000 ms). Trace:
W20260924 00:21:30.659184  8604 rpcz_store.cc:269] 0924 00:21:29.157898 (+     0us) service_pool.cc:170] Inserting onto call queue
0924 00:21:29.158126 (+   228us) service_pool.cc:227] Handling call
0924 00:21:30.658829 (+1500703us) inbound_call.cc:173] Queueing success response
Metrics: {}
W20260924 00:21:30.659848  8599 connection.cc:441] server connection from unix:<unnamed> torn down before Call kudu.rpc.GenericCalculatorService.Sleep from unix:<unnamed> (request call id 13) could send its response
[       OK ] Parameters/TestRpc.TestCancellation/SSL_UnixSocket (3167 ms)
[ RUN      ] Parameters/TestRpc.TestCancellationMultiThreads/SSL_UnixSocket
I20260924 00:21:30.702356  8628 acceptor_pool.cc:254] collecting diagnostics on the listening RPC socket unix:/tmp/dist-test-taskLnjOeq/test-tmp/rpc-test-1884243b787842098a4149300015e062.sock every 8 connection(s)
I20260924 00:21:30.703279  8629 acceptor_pool.cc:254] collecting diagnostics on the listening RPC socket unix:/tmp/dist-test-taskLnjOeq/test-tmp/rpc-test-1884243b787842098a4149300015e062.sock every 8 connection(s)
I20260924 00:21:30.706422  8178 rpc-test.cc:1808] Connecting to unix:/tmp/dist-test-taskLnjOeq/test-tmp/rpc-test-1884243b787842098a4149300015e062.sock
I20260924 00:21:30.848623  8642 test_util.cc:268] Using random seed: -1797601025
I20260924 00:21:30.849845  8643 test_util.cc:268] Using random seed: -1797599716
I20260924 00:21:30.851778  8644 test_util.cc:268] Using random seed: -1797598028
I20260924 00:21:30.853861  8645 test_util.cc:268] Using random seed: -1797595736
I20260924 00:21:30.855465  8646 test_util.cc:268] Using random seed: -1797594245
I20260924 00:21:30.857216  8647 test_util.cc:268] Using random seed: -1797592499
I20260924 00:21:30.858791  8648 test_util.cc:268] Using random seed: -1797590916
I20260924 00:21:30.860378  8649 test_util.cc:268] Using random seed: -1797589312
I20260924 00:21:30.862105  8650 test_util.cc:268] Using random seed: -1797587609
I20260924 00:21:30.863507  8651 test_util.cc:268] Using random seed: -1797586198
I20260924 00:21:30.865283  8652 test_util.cc:268] Using random seed: -1797584430
I20260924 00:21:30.866707  8653 test_util.cc:268] Using random seed: -1797582987
I20260924 00:21:30.868891  8654 test_util.cc:268] Using random seed: -1797580819
I20260924 00:21:30.871017  8655 test_util.cc:268] Using random seed: -1797578831
I20260924 00:21:30.880865  8656 test_util.cc:268] Using random seed: -1797568829
I20260924 00:21:30.882506  8657 test_util.cc:268] Using random seed: -1797567231
I20260924 00:21:30.884274  8658 test_util.cc:268] Using random seed: -1797565444
I20260924 00:21:30.886337  8659 test_util.cc:268] Using random seed: -1797563445
I20260924 00:21:30.887982  8660 test_util.cc:268] Using random seed: -1797561732
I20260924 00:21:30.889840  8661 test_util.cc:268] Using random seed: -1797559932
I20260924 00:21:30.891484  8662 test_util.cc:268] Using random seed: -1797558308
I20260924 00:21:30.893041  8663 test_util.cc:268] Using random seed: -1797556697
I20260924 00:21:30.894986  8664 test_util.cc:268] Using random seed: -1797554743
I20260924 00:21:30.896867  8665 test_util.cc:268] Using random seed: -1797552921
I20260924 00:21:30.898583  8666 test_util.cc:268] Using random seed: -1797551147
I20260924 00:21:30.900399  8667 test_util.cc:268] Using random seed: -1797549333
I20260924 00:21:30.903213  8668 test_util.cc:268] Using random seed: -1797546529
I20260924 00:21:30.905257  8669 test_util.cc:268] Using random seed: -1797544512
I20260924 00:21:30.907135  8670 test_util.cc:268] Using random seed: -1797542598
I20260924 00:21:30.908914  8671 test_util.cc:268] Using random seed: -1797540778
W20260924 00:21:50.845676  8625 connection.cc:196] Error closing socket: Network error: TlsSocket::Close: Broken pipe
[       OK ] Parameters/TestRpc.TestCancellationMultiThreads/SSL_UnixSocket (20196 ms)
[ RUN      ] Parameters/TestRpc.TestCallId/SSL_UnixSocket
I20260924 00:21:50.896391  8685 acceptor_pool.cc:254] collecting diagnostics on the listening RPC socket unix:/tmp/dist-test-taskLnjOeq/test-tmp/rpc-test-f7aaaacb30e549b49a136ed86382cfde.sock every 8 connection(s)
I20260924 00:21:50.897394  8686 acceptor_pool.cc:254] collecting diagnostics on the listening RPC socket unix:/tmp/dist-test-taskLnjOeq/test-tmp/rpc-test-f7aaaacb30e549b49a136ed86382cfde.sock every 8 connection(s)
[       OK ] Parameters/TestRpc.TestCallId/SSL_UnixSocket (88 ms)
[----------] 20 tests from Parameters/TestRpc (38861 ms total)

[----------] Global test environment tear-down
[==========] 21 tests from 2 test suites ran. (42096 ms total)
[  PASSED  ] 20 tests.
[  FAILED  ] 1 test, listed below:
[  FAILED  ] Parameters/TestRpc.TestCallWithChainCertAndRootCA/SSL_UnixSocket, where GetParam() = (true, true)

 1 FAILED TEST
I20260924 00:21:50.970794  8178 logging.cc:424] LogThrottler /data0/somelongdirectorytoavoidrpathissues/src/kudu/src/kudu/rpc/acceptor_pool.cc:285: suppressed but not reported on 3 messages since previous log ~34 seconds ago