Diagnosed failure
Parameters/TestRpc.TestCallWithChainCertAndChainCA/SSL_TCP: /data0/somelongdirectorytoavoidrpathissues/src/kudu/src/kudu/rpc/rpc-test.cc:270: Failure
Failed
Bad status: Runtime error: could not verify certificate chain (error with cert: subject=CN = localhost, ST = sadfjas, C = AS, emailAddress = sdflkdsajf, O = lskdfjlsad, OU = sldfkja, issuer=C = AS, ST = ASDfkjdhf, L = lskdjf, O = saldfja, OU = skdjf, CN = localhost, emailAddress = sadjflkadsj): : certificate has expired
Google Test trace:
/data0/somelongdirectorytoavoidrpathissues/src/kudu/src/kudu/rpc/rpc-test.cc:267: Connecting to 0.0.0.0:38493
I20260927 19:41:02.308382 9869 test_util.cc:175] -----------------------------------------------
I20260927 19:41:02.308563 9869 test_util.cc:176] Had fatal failures, leaving test files at /tmp/dist-test-taskEmvLm3/test-tmp/rpc-test.5.Parameters_TestRpc.TestCallWithChainCertAndChainCA_SSL_TCP.1790538060891477-9869-0
Full log
Note: This is test shard 6 of 8.
[==========] Running 21 tests from 2 test suites.
[----------] Global test environment set-up.
[----------] 20 tests from Parameters/TestRpc
[ RUN ] Parameters/TestRpc.TestMessengerCreateDestroy/SSL_TCP
WARNING: Logging before InitGoogleLogging() is written to STDERR
I20260927 19:41:00.993956 9869 rpc-test.cc:169] started messenger TestCreateDestroy
[ OK ] Parameters/TestRpc.TestMessengerCreateDestroy/SSL_TCP (1175 ms)
[ RUN ] Parameters/TestRpc.TestNegotiationDeadlock/SSL_TCP
I20260927 19:41:02.174412 9891 acceptor_pool.cc:254] collecting diagnostics on the listening RPC socket 0.0.0.0:44605 every 8 connection(s)
I20260927 19:41:02.176105 9892 acceptor_pool.cc:254] collecting diagnostics on the listening RPC socket 0.0.0.0:44605 every 8 connection(s)
[ OK ] Parameters/TestRpc.TestNegotiationDeadlock/SSL_TCP (114 ms)
[ RUN ] Parameters/TestRpc.TestCallWithChainCertAndChainCA/SSL_TCP
I20260927 19:41:02.278999 9907 acceptor_pool.cc:254] collecting diagnostics on the listening RPC socket 0.0.0.0:38493 every 8 connection(s)
I20260927 19:41:02.281270 9908 acceptor_pool.cc:254] collecting diagnostics on the listening RPC socket 0.0.0.0:38493 every 8 connection(s)
/data0/somelongdirectorytoavoidrpathissues/src/kudu/src/kudu/rpc/rpc-test.cc:270: Failure
Failed
Bad status: Runtime error: could not verify certificate chain (error with cert: subject=CN = localhost, ST = sadfjas, C = AS, emailAddress = sdflkdsajf, O = lskdfjlsad, OU = sldfkja, issuer=C = AS, ST = ASDfkjdhf, L = lskdjf, O = saldfja, OU = skdjf, CN = localhost, emailAddress = sadjflkadsj): : certificate has expired
Google Test trace:
/data0/somelongdirectorytoavoidrpathissues/src/kudu/src/kudu/rpc/rpc-test.cc:267: Connecting to 0.0.0.0:38493
I20260927 19:41:02.308382 9869 test_util.cc:175] -----------------------------------------------
I20260927 19:41:02.308563 9869 test_util.cc:176] Had fatal failures, leaving test files at /tmp/dist-test-taskEmvLm3/test-tmp/rpc-test.5.Parameters_TestRpc.TestCallWithChainCertAndChainCA_SSL_TCP.1790538060891477-9869-0
[ FAILED ] Parameters/TestRpc.TestCallWithChainCertAndChainCA/SSL_TCP, where GetParam() = (true, false) (73 ms)
[ RUN ] Parameters/TestRpc.TestCallWithPasswordProtectedKey/SSL_TCP
I20260927 19:41:02.336699 9932 acceptor_pool.cc:254] collecting diagnostics on the listening RPC socket 0.0.0.0:41507 every 8 connection(s)
I20260927 19:41:02.337450 9933 acceptor_pool.cc:254] collecting diagnostics on the listening RPC socket 0.0.0.0:41507 every 8 connection(s)
[ OK ] Parameters/TestRpc.TestCallWithPasswordProtectedKey/SSL_TCP (78 ms)
[ RUN ] Parameters/TestRpc.TestCallToBadServer/SSL_TCP
I20260927 19:41:02.408757 9869 rpc-test.cc:394] Status: Network error: Client connection negotiation failed: client connection to 0.0.0.0:0: connect: Connection refused (error 111)
I20260927 19:41:02.410142 9869 rpc-test.cc:394] Status: Network error: Client connection negotiation failed: client connection to 0.0.0.0:0: connect: Connection refused (error 111)
I20260927 19:41:02.411422 9869 rpc-test.cc:394] Status: Network error: Client connection negotiation failed: client connection to 0.0.0.0:0: connect: Connection refused (error 111)
I20260927 19:41:02.412773 9869 rpc-test.cc:394] Status: Network error: Client connection negotiation failed: client connection to 0.0.0.0:0: connect: Connection refused (error 111)
I20260927 19:41:02.414086 9869 rpc-test.cc:394] Status: Network error: Client connection negotiation failed: client connection to 0.0.0.0:0: connect: Connection refused (error 111)
[ OK ] Parameters/TestRpc.TestCallToBadServer/SSL_TCP (29 ms)
[ RUN ] Parameters/TestRpc.TestWrongService/SSL_TCP
I20260927 19:41:02.434146 9967 acceptor_pool.cc:254] collecting diagnostics on the listening RPC socket 0.0.0.0:45097 every 8 connection(s)
I20260927 19:41:02.434988 9968 acceptor_pool.cc:254] collecting diagnostics on the listening RPC socket 0.0.0.0:45097 every 8 connection(s)
I20260927 19:41:02.468736 9964 messenger.cc:345] service WrongServiceName not registered on TestServer
[ OK ] Parameters/TestRpc.TestWrongService/SSL_TCP (60 ms)
[ RUN ] Parameters/TestRpc.TestConnectionKeepalive/SSL_TCP
I20260927 19:41:02.499315 9990 acceptor_pool.cc:254] collecting diagnostics on the listening RPC socket 0.0.0.0:36737 every 8 connection(s)
I20260927 19:41:02.500041 9991 acceptor_pool.cc:254] collecting diagnostics on the listening RPC socket 0.0.0.0:36737 every 8 connection(s)
I20260927 19:41:02.503136 9869 rpc-test.cc:488] Connecting to 0.0.0.0:36737
[ OK ] Parameters/TestRpc.TestConnectionKeepalive/SSL_TCP (1073 ms)
[ RUN ] Parameters/TestRpc.TestClientConnectionMetrics/SSL_TCP
I20260927 19:41:03.568338 10015 acceptor_pool.cc:254] collecting diagnostics on the listening RPC socket 0.0.0.0:40819 every 8 connection(s)
I20260927 19:41:03.569084 10016 acceptor_pool.cc:254] collecting diagnostics on the listening RPC socket 0.0.0.0:40819 every 8 connection(s)
I20260927 19:41:03.572377 9869 rpc-test.cc:569] Connecting to 0.0.0.0:40819
[ OK ] Parameters/TestRpc.TestClientConnectionMetrics/SSL_TCP (118296 ms)
[ RUN ] Parameters/TestRpc.TestCredentialsPolicy/SSL_TCP
I20260927 19:43:01.875919 10050 acceptor_pool.cc:254] collecting diagnostics on the listening RPC socket 0.0.0.0:35291 every 8 connection(s)
I20260927 19:43:01.876717 10051 acceptor_pool.cc:254] collecting diagnostics on the listening RPC socket 0.0.0.0:35291 every 8 connection(s)
I20260927 19:43:01.879972 9869 rpc-test.cc:700] Connecting to 0.0.0.0:35291
[ OK ] Parameters/TestRpc.TestCredentialsPolicy/SSL_TCP (88 ms)
[ RUN ] Parameters/TestRpc.TestCallLongerThanKeepalive/SSL_TCP
I20260927 19:43:01.957757 10075 acceptor_pool.cc:254] collecting diagnostics on the listening RPC socket 0.0.0.0:41921 every 8 connection(s)
I20260927 19:43:01.958489 10076 acceptor_pool.cc:254] collecting diagnostics on the listening RPC socket 0.0.0.0:41921 every 8 connection(s)
I20260927 19:43:02.010608 10079 rpc-test-base.h:222] got call: sleep_micros: 3000000 deferred: true
I20260927 19:43:05.016283 10079 rpcz_store.cc:275] Call kudu.rpc.GenericCalculatorService.Sleep from 127.0.0.1:47976 (request call id 0) took 3006 ms. Trace:
I20260927 19:43:05.016695 10079 rpcz_store.cc:276] 0927 19:43:02.010273 (+ 0us) service_pool.cc:170] Inserting onto call queue
0927 19:43:02.010440 (+ 167us) service_pool.cc:227] Handling call
0927 19:43:05.016226 (+3005786us) inbound_call.cc:173] Queueing success response
Metrics: {}
[ OK ] Parameters/TestRpc.TestCallLongerThanKeepalive/SSL_TCP (3091 ms)
[ RUN ] Parameters/TestRpc.TestRpcSidecar/SSL_TCP
I20260927 19:43:05.044988 10100 acceptor_pool.cc:254] collecting diagnostics on the listening RPC socket 0.0.0.0:43351 every 8 connection(s)
I20260927 19:43:05.045709 10101 acceptor_pool.cc:254] collecting diagnostics on the listening RPC socket 0.0.0.0:43351 every 8 connection(s)
[ OK ] Parameters/TestRpc.TestRpcSidecar/SSL_TCP (533 ms)
[ RUN ] Parameters/TestRpc.TestRpcSidecarLimits/SSL_TCP
I20260927 19:43:22.829769 10127 acceptor_pool.cc:254] collecting diagnostics on the listening RPC socket 0.0.0.0:36149 every 8 connection(s)
I20260927 19:43:22.830704 10128 acceptor_pool.cc:254] collecting diagnostics on the listening RPC socket 0.0.0.0:36149 every 8 connection(s)
W20260927 19:43:22.861284 9869 serialization.cc:72] Serialized kudu.rpc_test.PushStringsRequestPB (2147483654 bytes) is larger than the maximum configured RPC message size (52428800 bytes). Sending anyway, but peer may reject the data.
W20260927 19:43:22.878605 10124 connection.cc:535] server connection from 127.0.0.1:46774 recv error: Network error: RPC frame had a length of 2147483714, but we only support messages up to 52428800 bytes long.
W20260927 19:43:22.879166 10124 connection.cc:158] shutting down server connection from 127.0.0.1:46774 with pending inbound data: 4/2147483714 bytes received; last active 0 ns ago: status Network error: RPC frame had a length of 2147483714, but we only support messages up to 52428800 bytes long.
W20260927 19:43:22.880303 10140 connection.cc:698] client connection to 0.0.0.0:36149 send error: Network error: failed to write to TLS socket: Connection reset by peer
W20260927 19:43:22.881140 10140 connection.cc:196] Error closing socket: Network error: TlsSocket::Close: Success
[ OK ] Parameters/TestRpc.TestRpcSidecarLimits/SSL_TCP (17950 ms)
[ RUN ] Parameters/TestRpc.TestCallTimeoutDoesntAffectNegotiation/SSL_TCP
I20260927 19:43:23.546083 10152 acceptor_pool.cc:254] collecting diagnostics on the listening RPC socket 0.0.0.0:39725 every 8 connection(s)
I20260927 19:43:23.546803 10153 acceptor_pool.cc:254] collecting diagnostics on the listening RPC socket 0.0.0.0:39725 every 8 connection(s)
W20260927 19:43:23.571691 10148 negotiation.cc:266] Injecting 500ms delay in negotiation
I20260927 19:43:23.620682 9869 rpc-test-base.h:595] status: Timed out: connection negotiation to 0.0.0.0:39725 for RPC Sleep timed out after 0.050s (ON_OUTBOUND_QUEUE), seconds elapsed: 0.0505997
[ OK ] Parameters/TestRpc.TestCallTimeoutDoesntAffectNegotiation/SSL_TCP (576 ms)
[ RUN ] Parameters/TestRpc.TestRpcHandlerLatencyMetric/SSL_TCP
I20260927 19:43:24.122812 10177 acceptor_pool.cc:254] collecting diagnostics on the listening RPC socket 0.0.0.0:45277 every 8 connection(s)
I20260927 19:43:24.123606 10178 acceptor_pool.cc:254] collecting diagnostics on the listening RPC socket 0.0.0.0:45277 every 8 connection(s)
I20260927 19:43:24.184816 9869 rpc-test.cc:1236] Sleep() min lat: 21709
I20260927 19:43:24.185006 9869 rpc-test.cc:1237] Sleep() mean lat: 21709
I20260927 19:43:24.185145 9869 rpc-test.cc:1238] Sleep() max lat: 21709
I20260927 19:43:24.185250 9869 rpc-test.cc:1239] Sleep() #calls: 1
[ OK ] Parameters/TestRpc.TestRpcHandlerLatencyMetric/SSL_TCP (103 ms)
[ RUN ] Parameters/TestRpc.TimedOutOnResponseMetricServiceQueue/SSL_TCP
I20260927 19:43:24.218108 10203 acceptor_pool.cc:254] collecting diagnostics on the listening RPC socket 0.0.0.0:34547 every 8 connection(s)
I20260927 19:43:24.218982 10204 acceptor_pool.cc:254] collecting diagnostics on the listening RPC socket 0.0.0.0:34547 every 8 connection(s)
W20260927 19:43:24.290517 10205 rpcz_store.cc:267] Call kudu.rpc_test.CalculatorService.Sleep from 127.0.0.1:35786 (request call id 2) took 20 ms (client timeout 20 ms). Trace:
W20260927 19:43:24.290891 10205 rpcz_store.cc:269] 0927 19:43:24.269922 (+ 0us) service_pool.cc:170] Inserting onto call queue
0927 19:43:24.290342 (+ 20420us) service_pool.cc:214] Skipping call since client already timed out
0927 19:43:24.290456 (+ 114us) inbound_call.cc:173] Queueing failure response
Metrics: {}
[ OK ] Parameters/TestRpc.TimedOutOnResponseMetricServiceQueue/SSL_TCP (105 ms)
[ RUN ] Parameters/TestRpc.RpcPendingConnectionsMetric/SSL_TCP
I20260927 19:43:24.308852 10226 acceptor_pool.cc:254] collecting diagnostics on the listening RPC socket 0.0.0.0:43831 every 8 connection(s)
I20260927 19:43:24.309577 10227 acceptor_pool.cc:254] collecting diagnostics on the listening RPC socket 0.0.0.0:43831 every 8 connection(s)
W20260927 19:43:24.314754 10222 negotiation.cc:337] Failed RPC negotiation. Trace:
0927 19:43:24.313550 (+ 0us) reactor.cc:625] Submitting negotiation task for server connection from 127.0.0.1:36786 (local address 127.0.0.1:43831)
0927 19:43:24.313971 (+ 421us) server_negotiation.cc:206] Beginning negotiation
0927 19:43:24.313988 (+ 17us) server_negotiation.cc:399] Waiting for connection header
0927 19:43:24.314204 (+ 216us) negotiation.cc:327] Negotiation complete: Network error: Server connection negotiation failed: server connection from 127.0.0.1:36786: BlockingRecv error: recv got EOF from 127.0.0.1:36786 (error 108)
Metrics: {"server-negotiator.queue_time_us":136}
[ OK ] Parameters/TestRpc.RpcPendingConnectionsMetric/SSL_TCP (30 ms)
[ RUN ] Parameters/TestRpc.TestRpcContextClientDeadline/SSL_TCP
I20260927 19:43:24.351907 10242 acceptor_pool.cc:254] collecting diagnostics on the listening RPC socket 0.0.0.0:41043 every 8 connection(s)
I20260927 19:43:24.352666 10243 acceptor_pool.cc:254] collecting diagnostics on the listening RPC socket 0.0.0.0:41043 every 8 connection(s)
[ OK ] Parameters/TestRpc.TestRpcContextClientDeadline/SSL_TCP (82 ms)
[ RUN ] Parameters/TestRpc.TestApplicationFeatureFlagUnsupportedServer/SSL_TCP
I20260927 19:43:24.436002 10267 acceptor_pool.cc:254] collecting diagnostics on the listening RPC socket 0.0.0.0:43697 every 8 connection(s)
I20260927 19:43:24.436523 10268 acceptor_pool.cc:254] collecting diagnostics on the listening RPC socket 0.0.0.0:43697 every 8 connection(s)
[ OK ] Parameters/TestRpc.TestApplicationFeatureFlagUnsupportedServer/SSL_TCP (81 ms)
[ RUN ] Parameters/TestRpc.TestCancellationAsync/SSL_TCP
I20260927 19:43:24.524932 10292 acceptor_pool.cc:254] collecting diagnostics on the listening RPC socket 0.0.0.0:42853 every 8 connection(s)
I20260927 19:43:24.525676 10293 acceptor_pool.cc:254] collecting diagnostics on the listening RPC socket 0.0.0.0:42853 every 8 connection(s)
I20260927 19:43:24.528891 9869 rpc-test.cc:1716] Connecting to 0.0.0.0:42853
I20260927 19:43:24.552660 9869 test_util.cc:268] Using random seed: 698588606
I20260927 19:43:24.787794 10296 rpc-test-base.h:240] got call: sleep_micros: 500 pattern: 4294967295 num_repetitions: 2097152 sidecar_idx: 0
I20260927 19:43:24.962123 10295 rpc-test-base.h:240] got call: sleep_micros: 500 pattern: 4294967295 num_repetitions: 2097152 sidecar_idx: 0
I20260927 19:43:25.149710 10296 rpc-test-base.h:240] got call: sleep_micros: 500 pattern: 4294967295 num_repetitions: 2097152 sidecar_idx: 0
I20260927 19:43:25.338466 10295 rpc-test-base.h:240] got call: sleep_micros: 500 pattern: 4294967295 num_repetitions: 2097152 sidecar_idx: 0
W20260927 19:43:25.439905 10305 outbound_call.cc:322] RPC callback for RPC call kudu.rpc.GenericCalculatorService.SleepWithSidecar -> {remote=0.0.0.0:42853 (localhost), user_credentials={real_user=slave}} blocked reactor thread for 45360.6us
I20260927 19:43:25.530617 10296 rpc-test-base.h:240] got call: sleep_micros: 500 pattern: 4294967295 num_repetitions: 2097152 sidecar_idx: 0
I20260927 19:43:25.722021 10295 rpc-test-base.h:240] got call: sleep_micros: 500 pattern: 4294967295 num_repetitions: 2097152 sidecar_idx: 0
I20260927 19:43:25.921591 10295 rpc-test-base.h:240] got call: sleep_micros: 500 pattern: 4294967295 num_repetitions: 2097152 sidecar_idx: 0
I20260927 19:43:26.083082 10296 rpc-test-base.h:240] got call: sleep_micros: 500 pattern: 4294967295 num_repetitions: 2097152 sidecar_idx: 0
W20260927 19:43:26.268355 10291 connection.cc:698] server connection from 127.0.0.1:43746 send error: Network error: failed to write to TLS socket: Broken pipe
W20260927 19:43:26.268651 10291 connection.cc:441] server connection from 127.0.0.1:43746 torn down before Call kudu.rpc.GenericCalculatorService.SleepWithSidecar from 127.0.0.1:43746 (request call id 9) could send its response
W20260927 19:43:26.273600 10291 connection.cc:196] Error closing socket: Network error: TlsSocket::Close: Success
W20260927 19:43:26.327600 10291 connection.cc:441] server connection from 127.0.0.1:43746 torn down before Call kudu.rpc.GenericCalculatorService.SleepWithSidecar from 127.0.0.1:43746 (request call id 8) could send its response
[ OK ] Parameters/TestRpc.TestCancellationAsync/SSL_TCP (1843 ms)
[ RUN ] Parameters/TestRpc.TestPerformanceBySocketType/SSL_TCP
I20260927 19:43:26.431876 10317 acceptor_pool.cc:254] collecting diagnostics on the listening RPC socket 0.0.0.0:36945 every 8 connection(s)
I20260927 19:43:26.432551 10318 acceptor_pool.cc:254] collecting diagnostics on the listening RPC socket 0.0.0.0:36945 every 8 connection(s)
I20260927 19:43:26.435940 9869 rpc-test.cc:1846] Connecting to 0.0.0.0:36945
I20260927 19:43:45.978209 9869 rpc-test.cc:1859] Sending 1024MB via ssl-enabled tcp socket: real 19.531s user 17.220s sys 10.749s
I20260927 19:44:05.610116 9869 rpc-test.cc:1859] Sending 1024MB via ssl-enabled tcp socket: real 19.631s user 16.928s sys 11.032s
I20260927 19:44:25.115129 9869 rpc-test.cc:1859] Sending 1024MB via ssl-enabled tcp socket: real 19.505s user 16.842s sys 10.953s
I20260927 19:44:44.279381 9869 rpc-test.cc:1859] Sending 1024MB via ssl-enabled tcp socket: real 19.164s user 16.513s sys 10.824s
I20260927 19:45:03.603295 9869 rpc-test.cc:1859] Sending 1024MB via ssl-enabled tcp socket: real 19.323s user 16.696s sys 10.944s
[ OK ] Parameters/TestRpc.TestPerformanceBySocketType/SSL_TCP (97285 ms)
[----------] 20 tests from Parameters/TestRpc (242677 ms total)
[----------] 1 test from Parameters/TestRpcSocketTxRxQueue
[ RUN ] Parameters/TestRpcSocketTxRxQueue.OverCapacity/0
W20260927 19:45:04.063730 10371 negotiation.cc:337] Failed RPC negotiation. Trace:
0927 19:45:03.665896 (+ 0us) reactor.cc:625] Submitting negotiation task for client connection to 0.0.0.0:33081 (local address 127.0.0.1:40284)
0927 19:45:03.666578 (+ 682us) negotiation.cc:107] Waiting for socket to connect
0927 19:45:03.666612 (+ 34us) client_negotiation.cc:174] Beginning negotiation
0927 19:45:03.667008 (+ 396us) client_negotiation.cc:252] Sending NEGOTIATE NegotiatePB request
0927 19:45:04.062330 (+395322us) negotiation.cc:327] Negotiation complete: Network error: Client connection negotiation failed: client connection to 0.0.0.0:33081: BlockingRecv error: recv error from unknown peer: Transport endpoint is not connected (error 107)
Metrics: {"client-negotiator.queue_time_us":189}
W20260927 19:45:04.063840 10362 negotiation.cc:337] Failed RPC negotiation. Trace:
0927 19:45:03.653382 (+ 0us) reactor.cc:625] Submitting negotiation task for client connection to 0.0.0.0:33081 (local address 127.0.0.1:40282)
0927 19:45:03.653930 (+ 548us) negotiation.cc:107] Waiting for socket to connect
0927 19:45:03.653961 (+ 31us) client_negotiation.cc:174] Beginning negotiation
0927 19:45:03.654141 (+ 180us) client_negotiation.cc:252] Sending NEGOTIATE NegotiatePB request
0927 19:45:04.062521 (+408380us) negotiation.cc:327] Negotiation complete: Network error: Client connection negotiation failed: client connection to 0.0.0.0:33081: BlockingRecv error: recv error from unknown peer: Transport endpoint is not connected (error 107)
Metrics: {"client-negotiator.queue_time_us":144}
W20260927 19:45:04.064153 10380 negotiation.cc:337] Failed RPC negotiation. Trace:
0927 19:45:03.677902 (+ 0us) reactor.cc:625] Submitting negotiation task for client connection to 0.0.0.0:33081 (local address 127.0.0.1:40294)
0927 19:45:03.678385 (+ 483us) negotiation.cc:107] Waiting for socket to connect
0927 19:45:03.678422 (+ 37us) client_negotiation.cc:174] Beginning negotiation
0927 19:45:03.678602 (+ 180us) client_negotiation.cc:252] Sending NEGOTIATE NegotiatePB request
0927 19:45:04.063042 (+384440us) negotiation.cc:327] Negotiation complete: Network error: Client connection negotiation failed: client connection to 0.0.0.0:33081: BlockingRecv error: recv error from unknown peer: Transport endpoint is not connected (error 107)
Metrics: {"client-negotiator.queue_time_us":138}
W20260927 19:45:04.067373 10344 negotiation.cc:337] Failed RPC negotiation. Trace:
0927 19:45:03.639128 (+ 0us) reactor.cc:625] Submitting negotiation task for client connection to 0.0.0.0:33081 (local address 127.0.0.1:40274)
0927 19:45:03.639721 (+ 593us) negotiation.cc:107] Waiting for socket to connect
0927 19:45:03.639750 (+ 29us) client_negotiation.cc:174] Beginning negotiation
0927 19:45:03.640076 (+ 326us) client_negotiation.cc:252] Sending NEGOTIATE NegotiatePB request
0927 19:45:04.062330 (+422254us) negotiation.cc:327] Negotiation complete: Network error: Client connection negotiation failed: client connection to 0.0.0.0:33081: BlockingRecv error: recv error from unknown peer: Transport endpoint is not connected (error 107)
Metrics: {"client-negotiator.queue_time_us":115}
W20260927 19:45:04.067938 10389 negotiation.cc:337] Failed RPC negotiation. Trace:
0927 19:45:03.690322 (+ 0us) reactor.cc:625] Submitting negotiation task for client connection to 0.0.0.0:33081 (local address 127.0.0.1:40300)
0927 19:45:03.690906 (+ 584us) negotiation.cc:107] Waiting for socket to connect
0927 19:45:03.690936 (+ 30us) client_negotiation.cc:174] Beginning negotiation
0927 19:45:03.691121 (+ 185us) client_negotiation.cc:252] Sending NEGOTIATE NegotiatePB request
0927 19:45:04.063502 (+372381us) negotiation.cc:327] Negotiation complete: Network error: Client connection negotiation failed: client connection to 0.0.0.0:33081: BlockingRecv error: recv error from unknown peer: Transport endpoint is not connected (error 107)
Metrics: {"client-negotiator.queue_time_us":158}
W20260927 19:45:04.067930 10353 negotiation.cc:337] Failed RPC negotiation. Trace:
0927 19:45:03.646213 (+ 0us) reactor.cc:625] Submitting negotiation task for client connection to 0.0.0.0:33081 (local address 127.0.0.1:40276)
0927 19:45:03.646851 (+ 638us) negotiation.cc:107] Waiting for socket to connect
0927 19:45:03.646882 (+ 31us) client_negotiation.cc:174] Beginning negotiation
0927 19:45:03.647070 (+ 188us) client_negotiation.cc:252] Sending NEGOTIATE NegotiatePB request
0927 19:45:04.062543 (+415473us) negotiation.cc:327] Negotiation complete: Network error: Client connection negotiation failed: client connection to 0.0.0.0:33081: BlockingRecv error: recv error from unknown peer: Transport endpoint is not connected (error 107)
Metrics: {"client-negotiator.queue_time_us":207}
[ OK ] Parameters/TestRpcSocketTxRxQueue.OverCapacity/0 (1255 ms)
[----------] 1 test from Parameters/TestRpcSocketTxRxQueue (1256 ms total)
[----------] Global test environment tear-down
[==========] 21 tests from 2 test suites ran. (243934 ms total)
[ PASSED ] 20 tests.
[ FAILED ] 1 test, listed below:
[ FAILED ] Parameters/TestRpc.TestCallWithChainCertAndChainCA/SSL_TCP, where GetParam() = (true, false)
1 FAILED TEST