Parameters/TestRpc.TestCallWithChainCertAndRootCA/SSL_TCP: /data0/somelongdirectorytoavoidrpathissues/src/kudu/src/kudu/rpc/rpc-test.cc:303: Failure
Failed
Bad status: Runtime error: could not verify certificate chain (error with cert: subject=CN = localhost, ST = sadfjas, C = AS, emailAddress = sdflkdsajf, O = lskdfjlsad, OU = sldfkja, issuer=C = AS, ST = ASDfkjdhf, L = lskdjf, O = saldfja, OU = skdjf, CN = localhost, emailAddress = sadjflkadsj): : certificate has expired
Google Test trace:
/data0/somelongdirectorytoavoidrpathissues/src/kudu/src/kudu/rpc/rpc-test.cc:300: Connecting to 0.0.0.0:35269
I20260927 14:00:52.338989 5118 test_util.cc:175] -----------------------------------------------
I20260927 14:00:52.339154 5118 test_util.cc:176] Had fatal failures, leaving test files at /tmp/dist-test-task7DISjJ/test-tmp/rpc-test.1.Parameters_TestRpc.TestCallWithChainCertAndRootCA_SSL_TCP.1790517650814178-5118-0
Note: This is test shard 2 of 8.
[==========] Running 21 tests from 2 test suites.
[----------] Global test environment set-up.
[----------] 1 test from TestRpc
[ RUN ] TestRpc.TestMethodsByName
[ OK ] TestRpc.TestMethodsByName (6 ms)
[----------] 1 test from TestRpc (6 ms total)
[----------] 20 tests from Parameters/TestRpc
[ RUN ] Parameters/TestRpc.TestAcceptorPoolStartStop/SSL_TCP
WARNING: Logging before InitGoogleLogging() is written to STDERR
I20260927 14:00:50.914916 5133 acceptor_pool.cc:254] collecting diagnostics on the listening RPC socket 0.0.0.0:39199 every 8 connection(s)
W20260927 14:00:51.917753 5118 thread.cc:536] Waited for 1000ms trying to join with acceptor (tid 5134)
I20260927 14:00:50.916926 5134 acceptor_pool.cc:254] collecting diagnostics on the listening RPC socket 0.0.0.0:39199 every 8 connection(s)
I20260927 14:00:52.047111 5145 acceptor_pool.cc:254] collecting diagnostics on the listening RPC socket 0.0.0.0:33399 every 8 connection(s)
I20260927 14:00:52.048365 5146 acceptor_pool.cc:254] collecting diagnostics on the listening RPC socket 0.0.0.0:33399 every 8 connection(s)
I20260927 14:00:52.087929 5156 acceptor_pool.cc:254] collecting diagnostics on the listening RPC socket 0.0.0.0:36505 every 8 connection(s)
I20260927 14:00:52.089195 5157 acceptor_pool.cc:254] collecting diagnostics on the listening RPC socket 0.0.0.0:36505 every 8 connection(s)
I20260927 14:00:52.122442 5167 acceptor_pool.cc:254] collecting diagnostics on the listening RPC socket 0.0.0.0:41359 every 8 connection(s)
I20260927 14:00:52.123191 5168 acceptor_pool.cc:254] collecting diagnostics on the listening RPC socket 0.0.0.0:41359 every 8 connection(s)
I20260927 14:00:52.159932 5178 acceptor_pool.cc:254] collecting diagnostics on the listening RPC socket 0.0.0.0:44121 every 8 connection(s)
I20260927 14:00:52.160630 5179 acceptor_pool.cc:254] collecting diagnostics on the listening RPC socket 0.0.0.0:44121 every 8 connection(s)
[ OK ] Parameters/TestRpc.TestAcceptorPoolStartStop/SSL_TCP (1295 ms)
[ RUN ] Parameters/TestRpc.TestCall/SSL_TCP
I20260927 14:00:52.181928 5191 acceptor_pool.cc:254] collecting diagnostics on the listening RPC socket 0.0.0.0:43135 every 8 connection(s)
I20260927 14:00:52.183686 5192 acceptor_pool.cc:254] collecting diagnostics on the listening RPC socket 0.0.0.0:43135 every 8 connection(s)
I20260927 14:00:52.188275 5118 rpc-test.cc:234] Connecting to 0.0.0.0:43135
[ OK ] Parameters/TestRpc.TestCall/SSL_TCP (124 ms)
[ RUN ] Parameters/TestRpc.TestCallWithChainCertAndRootCA/SSL_TCP
I20260927 14:00:52.317305 5216 acceptor_pool.cc:254] collecting diagnostics on the listening RPC socket 0.0.0.0:35269 every 8 connection(s)
I20260927 14:00:52.318059 5217 acceptor_pool.cc:254] collecting diagnostics on the listening RPC socket 0.0.0.0:35269 every 8 connection(s)
/data0/somelongdirectorytoavoidrpathissues/src/kudu/src/kudu/rpc/rpc-test.cc:303: Failure
Failed
Bad status: Runtime error: could not verify certificate chain (error with cert: subject=CN = localhost, ST = sadfjas, C = AS, emailAddress = sdflkdsajf, O = lskdfjlsad, OU = sldfkja, issuer=C = AS, ST = ASDfkjdhf, L = lskdjf, O = saldfja, OU = skdjf, CN = localhost, emailAddress = sadjflkadsj): : certificate has expired
Google Test trace:
/data0/somelongdirectorytoavoidrpathissues/src/kudu/src/kudu/rpc/rpc-test.cc:300: Connecting to 0.0.0.0:35269
I20260927 14:00:52.338989 5118 test_util.cc:175] -----------------------------------------------
I20260927 14:00:52.339154 5118 test_util.cc:176] Had fatal failures, leaving test files at /tmp/dist-test-task7DISjJ/test-tmp/rpc-test.1.Parameters_TestRpc.TestCallWithChainCertAndRootCA_SSL_TCP.1790517650814178-5118-0
[ FAILED ] Parameters/TestRpc.TestCallWithChainCertAndRootCA/SSL_TCP, where GetParam() = (true, false) (49 ms)
[ RUN ] Parameters/TestRpc.TestCallWithBadPasswordProtectedKey/SSL_TCP
[ OK ] Parameters/TestRpc.TestCallWithBadPasswordProtectedKey/SSL_TCP (28 ms)
[ RUN ] Parameters/TestRpc.TestInvalidMethodCall/SSL_TCP
I20260927 14:00:52.383765 5253 acceptor_pool.cc:254] collecting diagnostics on the listening RPC socket 0.0.0.0:46815 every 8 connection(s)
I20260927 14:00:52.384497 5254 acceptor_pool.cc:254] collecting diagnostics on the listening RPC socket 0.0.0.0:46815 every 8 connection(s)
I20260927 14:00:52.387535 5118 rpc-test.cc:406] Connecting to 0.0.0.0:46815
[ OK ] Parameters/TestRpc.TestInvalidMethodCall/SSL_TCP (57 ms)
[ RUN ] Parameters/TestRpc.TestHighFDs/SSL_TCP
I20260927 14:00:52.638659 5278 acceptor_pool.cc:254] collecting diagnostics on the listening RPC socket 0.0.0.0:33165 every 8 connection(s)
I20260927 14:00:52.639349 5279 acceptor_pool.cc:254] collecting diagnostics on the listening RPC socket 0.0.0.0:33165 every 8 connection(s)
[ OK ] Parameters/TestRpc.TestHighFDs/SSL_TCP (276 ms)
[ RUN ] Parameters/TestRpc.TestConnectionAlwaysKeepalive/SSL_TCP
I20260927 14:00:52.722793 5301 acceptor_pool.cc:254] collecting diagnostics on the listening RPC socket 0.0.0.0:36205 every 8 connection(s)
I20260927 14:00:52.723500 5302 acceptor_pool.cc:254] collecting diagnostics on the listening RPC socket 0.0.0.0:36205 every 8 connection(s)
I20260927 14:00:52.726542 5118 rpc-test.cc:532] Connecting to 0.0.0.0:36205
[ OK ] Parameters/TestRpc.TestConnectionAlwaysKeepalive/SSL_TCP (3061 ms)
[ RUN ] Parameters/TestRpc.TestReopenOutboundConnections/SSL_TCP
I20260927 14:00:55.783663 5324 acceptor_pool.cc:254] collecting diagnostics on the listening RPC socket 0.0.0.0:33995 every 8 connection(s)
I20260927 14:00:55.784444 5325 acceptor_pool.cc:254] collecting diagnostics on the listening RPC socket 0.0.0.0:33995 every 8 connection(s)
I20260927 14:00:55.787631 5118 rpc-test.cc:658] Connecting to 0.0.0.0:33995
[ OK ] Parameters/TestRpc.TestReopenOutboundConnections/SSL_TCP (348 ms)
[ RUN ] Parameters/TestRpc.TestConnectionNetworkPlane/SSL_TCP
I20260927 14:00:56.131114 5347 acceptor_pool.cc:254] collecting diagnostics on the listening RPC socket 0.0.0.0:46647 every 8 connection(s)
I20260927 14:00:56.131843 5348 acceptor_pool.cc:254] collecting diagnostics on the listening RPC socket 0.0.0.0:46647 every 8 connection(s)
I20260927 14:00:56.134860 5118 rpc-test.cc:772] Connecting to 0.0.0.0:46647
[ OK ] Parameters/TestRpc.TestConnectionNetworkPlane/SSL_TCP (71 ms)
[ RUN ] Parameters/TestRpc.TestTCPKeepalive/SSL_TCP
I20260927 14:00:56.207397 5372 acceptor_pool.cc:254] collecting diagnostics on the listening RPC socket 0.0.0.0:33733 every 8 connection(s)
I20260927 14:00:56.208158 5373 acceptor_pool.cc:254] collecting diagnostics on the listening RPC socket 0.0.0.0:33733 every 8 connection(s)
I20260927 14:00:56.246256 5376 rpc-test-base.h:222] got call: sleep_micros: 8000000 deferred: true
I20260927 14:01:04.250062 5376 rpcz_store.cc:275] Call kudu.rpc.GenericCalculatorService.Sleep from 127.0.0.1:51116 (request call id 0) took 8004 ms. Trace:
I20260927 14:01:04.250463 5376 rpcz_store.cc:276] 0927 14:00:56.246004 (+ 0us) service_pool.cc:170] Inserting onto call queue
0927 14:00:56.246102 (+ 98us) service_pool.cc:227] Handling call
0927 14:01:04.249869 (+8003767us) inbound_call.cc:173] Queueing success response
Metrics: {}
[ OK ] Parameters/TestRpc.TestTCPKeepalive/SSL_TCP (8079 ms)
[ RUN ] Parameters/TestRpc.TestMaxSmallSidecars/SSL_TCP
I20260927 14:01:04.288793 5398 acceptor_pool.cc:254] collecting diagnostics on the listening RPC socket 0.0.0.0:34829 every 8 connection(s)
I20260927 14:01:04.289615 5399 acceptor_pool.cc:254] collecting diagnostics on the listening RPC socket 0.0.0.0:34829 every 8 connection(s)
[ OK ] Parameters/TestRpc.TestMaxSmallSidecars/SSL_TCP (214 ms)
[ RUN ] Parameters/TestRpc.TestCallTimeout/SSL_TCP
I20260927 14:01:04.499473 5423 acceptor_pool.cc:254] collecting diagnostics on the listening RPC socket 0.0.0.0:44157 every 8 connection(s)
I20260927 14:01:04.500180 5424 acceptor_pool.cc:254] collecting diagnostics on the listening RPC socket 0.0.0.0:44157 every 8 connection(s)
I20260927 14:01:04.522452 5118 rpc-test-base.h:595] status: Timed out: connection negotiation to 0.0.0.0:44157 for RPC Sleep timed out after 0.000s (ON_OUTBOUND_QUEUE), seconds elapsed: 0.00235585
I20260927 14:01:04.529598 5427 rpc-test-base.h:222] got call: sleep_micros: 700000
I20260927 14:01:04.724354 5118 rpc-test-base.h:595] status: Timed out: Sleep RPC to 0.0.0.0:44157 timed out after 0.200s (SENT), seconds elapsed: 0.201497
I20260927 14:01:04.725767 5426 rpc-test-base.h:222] got call: sleep_micros: 2000000
W20260927 14:01:05.230278 5427 rpcz_store.cc:267] Call kudu.rpc.GenericCalculatorService.Sleep from 127.0.0.1:38158 (request call id 1) took 700 ms (client timeout 200 ms). Trace:
W20260927 14:01:05.230679 5427 rpcz_store.cc:269] 0927 14:01:04.529450 (+ 0us) service_pool.cc:170] Inserting onto call queue
0927 14:01:04.529542 (+ 92us) service_pool.cc:227] Handling call
0927 14:01:05.230217 (+700675us) inbound_call.cc:173] Queueing success response
Metrics: {}
I20260927 14:01:06.226327 5118 rpc-test-base.h:595] status: Timed out: Sleep RPC to 0.0.0.0:44157 timed out after 1.500s (SENT), seconds elapsed: 1.50162
W20260927 14:01:06.726260 5426 rpcz_store.cc:267] Call kudu.rpc.GenericCalculatorService.Sleep from 127.0.0.1:38158 (request call id 2) took 2000 ms (client timeout 1500 ms). Trace:
W20260927 14:01:06.726617 5426 rpcz_store.cc:269] 0927 14:01:04.725520 (+ 0us) service_pool.cc:170] Inserting onto call queue
0927 14:01:04.725627 (+ 107us) service_pool.cc:227] Handling call
0927 14:01:06.726210 (+2000583us) inbound_call.cc:173] Queueing success response
Metrics: {}
W20260927 14:01:06.727202 5421 connection.cc:441] server connection from 127.0.0.1:38158 torn down before Call kudu.rpc.GenericCalculatorService.Sleep from 127.0.0.1:38158 (request call id 2) could send its response
[ OK ] Parameters/TestRpc.TestCallTimeout/SSL_TCP (2253 ms)
[ RUN ] Parameters/TestRpc.TestServerShutsDown/SSL_TCP
I20260927 14:01:06.733587 5118 rpc-test.cc:1125] Connecting to 0.0.0.0:43419
W20260927 14:01:06.742509 5440 negotiation.cc:337] Failed RPC negotiation. Trace:
0927 14:01:06.741212 (+ 0us) reactor.cc:625] Submitting negotiation task for client connection to 0.0.0.0:43419 (local address 127.0.0.1:53274)
0927 14:01:06.741582 (+ 370us) negotiation.cc:107] Waiting for socket to connect
0927 14:01:06.741609 (+ 27us) client_negotiation.cc:174] Beginning negotiation
0927 14:01:06.741794 (+ 185us) client_negotiation.cc:252] Sending NEGOTIATE NegotiatePB request
0927 14:01:06.741999 (+ 205us) negotiation.cc:327] Negotiation complete: Network error: Client connection negotiation failed: client connection to 0.0.0.0:43419: BlockingWrite error: write error: Broken pipe (error 32)
Metrics: {"client-negotiator.queue_time_us":87}
[ OK ] Parameters/TestRpc.TestServerShutsDown/SSL_TCP (12 ms)
[ RUN ] Parameters/TestRpc.TimedOutOnResponseMetric/SSL_TCP
I20260927 14:01:06.765228 5457 acceptor_pool.cc:254] collecting diagnostics on the listening RPC socket 0.0.0.0:36329 every 8 connection(s)
I20260927 14:01:06.765913 5458 acceptor_pool.cc:254] collecting diagnostics on the listening RPC socket 0.0.0.0:36329 every 8 connection(s)
W20260927 14:01:06.999398 5461 rpcz_store.cc:267] Call kudu.rpc_test.CalculatorService.Sleep from 127.0.0.1:41238 (request call id 3) took 50 ms (client timeout 25 ms). Trace:
W20260927 14:01:06.999660 5461 rpcz_store.cc:269] 0927 14:01:06.948864 (+ 0us) service_pool.cc:170] Inserting onto call queue
0927 14:01:06.948984 (+ 120us) service_pool.cc:227] Handling call
0927 14:01:06.999338 (+ 50354us) inbound_call.cc:173] Queueing success response
Related trace 'test_child':
Metrics: {"test_sleep_us":50000,"child_traces":[["test_child",{"related_trace_metric":1}]]}
W20260927 14:01:07.058132 5461 rpcz_store.cc:267] Call kudu.rpc_test.CalculatorService.Sleep from 127.0.0.1:41238 (request call id 4) took 50 ms (client timeout 50 ms). Trace:
W20260927 14:01:07.058447 5461 rpcz_store.cc:269] 0927 14:01:07.007630 (+ 0us) service_pool.cc:170] Inserting onto call queue
0927 14:01:07.007750 (+ 120us) service_pool.cc:227] Handling call
0927 14:01:07.058078 (+ 50328us) inbound_call.cc:173] Queueing success response
Related trace 'test_child':
Metrics: {"test_sleep_us":50000,"child_traces":[["test_child",{"related_trace_metric":1}]]}
[ OK ] Parameters/TestRpc.TimedOutOnResponseMetric/SSL_TCP (321 ms)
[ RUN ] Parameters/TestRpc.AcceptorDispatchingTimesMetric/SSL_TCP
I20260927 14:01:07.082463 5482 acceptor_pool.cc:254] collecting diagnostics on the listening RPC socket 0.0.0.0:45845 every 8 connection(s)
I20260927 14:01:07.083135 5483 acceptor_pool.cc:254] collecting diagnostics on the listening RPC socket 0.0.0.0:45845 every 8 connection(s)
W20260927 14:01:07.088927 5478 negotiation.cc:337] Failed RPC negotiation. Trace:
0927 14:01:07.086742 (+ 0us) reactor.cc:625] Submitting negotiation task for server connection from 127.0.0.1:57852 (local address 127.0.0.1:45845)
0927 14:01:07.087263 (+ 521us) server_negotiation.cc:206] Beginning negotiation
0927 14:01:07.087301 (+ 38us) server_negotiation.cc:399] Waiting for connection header
0927 14:01:07.087685 (+ 384us) negotiation.cc:327] Negotiation complete: Network error: Server connection negotiation failed: server connection from 127.0.0.1:57852: BlockingRecv error: recv got EOF from 127.0.0.1:57852 (error 108)
Metrics: {"server-negotiator.queue_time_us":123}
[ OK ] Parameters/TestRpc.AcceptorDispatchingTimesMetric/SSL_TCP (24 ms)
[ RUN ] Parameters/TestRpc.TestRpcCallbackDestroysMessenger/SSL_TCP
[ OK ] Parameters/TestRpc.TestRpcCallbackDestroysMessenger/SSL_TCP (16 ms)
[ RUN ] Parameters/TestRpc.TestApplicationFeatureFlag/SSL_TCP
I20260927 14:01:07.126639 5507 acceptor_pool.cc:254] collecting diagnostics on the listening RPC socket 0.0.0.0:39697 every 8 connection(s)
I20260927 14:01:07.127281 5508 acceptor_pool.cc:254] collecting diagnostics on the listening RPC socket 0.0.0.0:39697 every 8 connection(s)
W20260927 14:01:07.161099 5504 messenger.cc:357] Unable to handle RPC call: Not implemented: call requires unsupported application feature flags: 99
[ OK ] Parameters/TestRpc.TestApplicationFeatureFlag/SSL_TCP (60 ms)
[ RUN ] Parameters/TestRpc.TestCancellation/SSL_TCP
I20260927 14:01:07.215533 5532 acceptor_pool.cc:254] collecting diagnostics on the listening RPC socket 0.0.0.0:35913 every 8 connection(s)
I20260927 14:01:07.216220 5533 acceptor_pool.cc:254] collecting diagnostics on the listening RPC socket 0.0.0.0:35913 every 8 connection(s)
I20260927 14:01:07.219164 5118 rpc-test.cc:1648] Connecting to 0.0.0.0:35913
I20260927 14:01:07.326195 5118 rpc-test-base.h:595] status: Aborted: Sleep RPC to 0.0.0.0:35913 is cancelled in state READY, seconds elapsed: 0.000286576
I20260927 14:01:07.462553 5118 rpc-test-base.h:595] status: Aborted: Sleep RPC to 0.0.0.0:35913 is cancelled in state SENT, seconds elapsed: 0.000779834
I20260927 14:01:07.506209 5535 rpc-test-base.h:222] got call: sleep_micros: 510000
I20260927 14:01:07.620563 5118 rpc-test-base.h:595] status: Aborted: Sleep RPC to 0.0.0.0:35913 is cancelled in state SENT, seconds elapsed: 0.00091797
I20260927 14:01:07.662786 5534 rpc-test-base.h:222] got call: sleep_micros: 510000
I20260927 14:01:07.781445 5118 rpc-test-base.h:595] status: Aborted: Sleep RPC to 0.0.0.0:35913 is cancelled in state SENT, seconds elapsed: 0.000710665
W20260927 14:01:07.820698 5536 rpcz_store.cc:267] Call kudu.rpc.GenericCalculatorService.Sleep from 127.0.0.1:45634 (request call id 11) took 14 ms (client timeout 10 ms). Trace:
W20260927 14:01:07.820973 5536 rpcz_store.cc:269] 0927 14:01:07.806176 (+ 0us) service_pool.cc:170] Inserting onto call queue
0927 14:01:07.820414 (+ 14238us) service_pool.cc:214] Skipping call since client already timed out
0927 14:01:07.820535 (+ 121us) inbound_call.cc:173] Queueing failure response
Metrics: {}
I20260927 14:01:07.821455 5536 rpc-test-base.h:222] got call: sleep_micros: 1500000
W20260927 14:01:08.016991 5535 rpcz_store.cc:267] Call kudu.rpc.GenericCalculatorService.Sleep from 127.0.0.1:45634 (request call id 3) took 511 ms (client timeout 10 ms). Trace:
W20260927 14:01:08.017412 5535 rpcz_store.cc:269] 0927 14:01:07.505940 (+ 0us) service_pool.cc:170] Inserting onto call queue
0927 14:01:07.506129 (+ 189us) service_pool.cc:227] Handling call
0927 14:01:08.016939 (+510810us) inbound_call.cc:173] Queueing success response
Metrics: {}
W20260927 14:01:08.173442 5534 rpcz_store.cc:267] Call kudu.rpc.GenericCalculatorService.Sleep from 127.0.0.1:45634 (request call id 7) took 510 ms (client timeout 10 ms). Trace:
W20260927 14:01:08.173743 5534 rpcz_store.cc:269] 0927 14:01:07.662570 (+ 0us) service_pool.cc:170] Inserting onto call queue
0927 14:01:07.662715 (+ 145us) service_pool.cc:227] Handling call
0927 14:01:08.173391 (+510676us) inbound_call.cc:173] Queueing success response
Metrics: {}
I20260927 14:01:08.782954 5118 rpc-test-base.h:595] status: Timed out: Sleep RPC to 0.0.0.0:35913 timed out after 1.000s (SENT), seconds elapsed: 1.00117
I20260927 14:01:08.784292 5534 rpc-test-base.h:222] got call: sleep_micros: 1500000
W20260927 14:01:09.321969 5536 rpcz_store.cc:267] Call kudu.rpc.GenericCalculatorService.Sleep from 127.0.0.1:45634 (request call id 12) took 1515 ms (client timeout 1000 ms). Trace:
W20260927 14:01:09.322300 5536 rpcz_store.cc:269] 0927 14:01:07.806488 (+ 0us) service_pool.cc:170] Inserting onto call queue
0927 14:01:07.821418 (+ 14930us) service_pool.cc:227] Handling call
0927 14:01:09.321921 (+1500503us) inbound_call.cc:173] Queueing success response
Metrics: {}
I20260927 14:01:09.785004 5118 rpc-test-base.h:595] status: Timed out: Sleep RPC to 0.0.0.0:35913 timed out after 1.000s (SENT), seconds elapsed: 1.00173
W20260927 14:01:09.786443 5530 messenger.cc:357] Unable to handle RPC call: Not implemented: call requires unsupported application feature flags: 99, 1
W20260927 14:01:09.787849 5530 messenger.cc:357] Unable to handle RPC call: Not implemented: call requires unsupported application feature flags: 99, 1
W20260927 14:01:10.284793 5534 rpcz_store.cc:267] Call kudu.rpc.GenericCalculatorService.Sleep from 127.0.0.1:45634 (request call id 13) took 1500 ms (client timeout 1000 ms). Trace:
W20260927 14:01:10.285185 5534 rpcz_store.cc:269] 0927 14:01:08.784118 (+ 0us) service_pool.cc:170] Inserting onto call queue
0927 14:01:08.784249 (+ 131us) service_pool.cc:227] Handling call
0927 14:01:10.284746 (+1500497us) inbound_call.cc:173] Queueing success response
Metrics: {}
W20260927 14:01:10.285768 5530 connection.cc:441] server connection from 127.0.0.1:45634 torn down before Call kudu.rpc.GenericCalculatorService.Sleep from 127.0.0.1:45634 (request call id 13) could send its response
[ OK ] Parameters/TestRpc.TestCancellation/SSL_TCP (3122 ms)
[ RUN ] Parameters/TestRpc.TestCancellationMultiThreads/SSL_TCP
I20260927 14:01:10.314648 5557 acceptor_pool.cc:254] collecting diagnostics on the listening RPC socket 0.0.0.0:43641 every 8 connection(s)
I20260927 14:01:10.315413 5558 acceptor_pool.cc:254] collecting diagnostics on the listening RPC socket 0.0.0.0:43641 every 8 connection(s)
I20260927 14:01:10.318512 5118 rpc-test.cc:1808] Connecting to 0.0.0.0:43641
I20260927 14:01:10.471083 5571 test_util.cc:268] Using random seed: 1639343497
I20260927 14:01:10.472183 5572 test_util.cc:268] Using random seed: 1639344609
I20260927 14:01:10.473567 5573 test_util.cc:268] Using random seed: 1639345992
I20260927 14:01:10.475407 5574 test_util.cc:268] Using random seed: 1639347805
I20260927 14:01:10.476914 5575 test_util.cc:268] Using random seed: 1639349204
I20260927 14:01:10.478524 5576 test_util.cc:268] Using random seed: 1639350794
I20260927 14:01:10.479875 5577 test_util.cc:268] Using random seed: 1639352170
I20260927 14:01:10.481670 5578 test_util.cc:268] Using random seed: 1639353949
I20260927 14:01:10.483595 5579 test_util.cc:268] Using random seed: 1639355889
I20260927 14:01:10.485580 5580 test_util.cc:268] Using random seed: 1639357886
I20260927 14:01:10.487217 5581 test_util.cc:268] Using random seed: 1639359090
I20260927 14:01:10.488736 5582 test_util.cc:268] Using random seed: 1639360998
I20260927 14:01:10.490656 5583 test_util.cc:268] Using random seed: 1639362964
I20260927 14:01:10.492589 5584 test_util.cc:268] Using random seed: 1639364847
I20260927 14:01:10.494611 5585 test_util.cc:268] Using random seed: 1639366882
I20260927 14:01:10.496423 5586 test_util.cc:268] Using random seed: 1639368687
I20260927 14:01:10.498011 5587 test_util.cc:268] Using random seed: 1639370310
I20260927 14:01:10.499943 5588 test_util.cc:268] Using random seed: 1639372207
I20260927 14:01:10.501803 5589 test_util.cc:268] Using random seed: 1639374095
I20260927 14:01:10.503734 5590 test_util.cc:268] Using random seed: 1639376000
I20260927 14:01:10.506458 5591 test_util.cc:268] Using random seed: 1639378751
I20260927 14:01:10.508311 5592 test_util.cc:268] Using random seed: 1639380594
I20260927 14:01:10.510496 5593 test_util.cc:268] Using random seed: 1639382781
I20260927 14:01:10.513854 5594 test_util.cc:268] Using random seed: 1639386142
I20260927 14:01:10.515822 5595 test_util.cc:268] Using random seed: 1639388096
I20260927 14:01:10.517990 5596 test_util.cc:268] Using random seed: 1639389689
I20260927 14:01:10.519410 5597 test_util.cc:268] Using random seed: 1639391698
I20260927 14:01:10.521291 5598 test_util.cc:268] Using random seed: 1639393537
I20260927 14:01:10.523509 5599 test_util.cc:268] Using random seed: 1639395743
I20260927 14:01:10.525662 5600 test_util.cc:268] Using random seed: 1639397972
[ OK ] Parameters/TestRpc.TestCancellationMultiThreads/SSL_TCP (17305 ms)
[ RUN ] Parameters/TestRpc.TestCallId/SSL_TCP
I20260927 14:01:27.630192 5614 acceptor_pool.cc:254] collecting diagnostics on the listening RPC socket 0.0.0.0:37209 every 8 connection(s)
I20260927 14:01:27.630983 5615 acceptor_pool.cc:254] collecting diagnostics on the listening RPC socket 0.0.0.0:37209 every 8 connection(s)
[ OK ] Parameters/TestRpc.TestCallId/SSL_TCP (91 ms)
[----------] 20 tests from Parameters/TestRpc (36819 ms total)
[----------] Global test environment tear-down
[==========] 21 tests from 2 test suites ran. (36826 ms total)
[ PASSED ] 20 tests.
[ FAILED ] 1 test, listed below:
[ FAILED ] Parameters/TestRpc.TestCallWithChainCertAndRootCA/SSL_TCP, where GetParam() = (true, false)
1 FAILED TEST