Diagnosed failure

Parameters/TestRpc.TestCallWithChainCertAndChainCA/SSL_TCP: /data0/somelongdirectorytoavoidrpathissues/src/kudu/src/kudu/rpc/rpc-test.cc:270: Failure
Failed
Bad status: Runtime error: could not verify certificate chain (error with cert: subject=CN = localhost, ST = sadfjas, C = AS, emailAddress = sdflkdsajf, O = lskdfjlsad, OU = sldfkja, issuer=C = AS, ST = ASDfkjdhf, L = lskdjf, O = saldfja, OU = skdjf, CN = localhost, emailAddress = sadjflkadsj): : certificate has expired
Google Test trace:
/data0/somelongdirectorytoavoidrpathissues/src/kudu/src/kudu/rpc/rpc-test.cc:267: Connecting to 0.0.0.0:46845
I20260926 22:01:23.802788  6003 test_util.cc:175] -----------------------------------------------
I20260926 22:01:23.802882  6003 test_util.cc:176] Had fatal failures, leaving test files at /tmp/dist-test-taskRRCrOL/test-tmp/rpc-test.5.Parameters_TestRpc.TestCallWithChainCertAndChainCA_SSL_TCP.1790460083654786-6003-0

Full log

Note: This is test shard 6 of 8.
[==========] Running 21 tests from 2 test suites.
[----------] Global test environment set-up.
[----------] 20 tests from Parameters/TestRpc
[ RUN      ] Parameters/TestRpc.TestMessengerCreateDestroy/SSL_TCP
WARNING: Logging before InitGoogleLogging() is written to STDERR
I20260926 22:01:23.710879  6003 rpc-test.cc:169] started messenger TestCreateDestroy
[       OK ] Parameters/TestRpc.TestMessengerCreateDestroy/SSL_TCP (36 ms)
[ RUN      ] Parameters/TestRpc.TestNegotiationDeadlock/SSL_TCP
I20260926 22:01:23.733865  6023 acceptor_pool.cc:254] collecting diagnostics on the listening RPC socket 0.0.0.0:36347 every 8 connection(s)
I20260926 22:01:23.734176  6024 acceptor_pool.cc:254] collecting diagnostics on the listening RPC socket 0.0.0.0:36347 every 8 connection(s)
[       OK ] Parameters/TestRpc.TestNegotiationDeadlock/SSL_TCP (54 ms)
[ RUN      ] Parameters/TestRpc.TestCallWithChainCertAndChainCA/SSL_TCP
I20260926 22:01:23.790517  6039 acceptor_pool.cc:254] collecting diagnostics on the listening RPC socket 0.0.0.0:46845 every 8 connection(s)
I20260926 22:01:23.790726  6040 acceptor_pool.cc:254] collecting diagnostics on the listening RPC socket 0.0.0.0:46845 every 8 connection(s)
/data0/somelongdirectorytoavoidrpathissues/src/kudu/src/kudu/rpc/rpc-test.cc:270: Failure
Failed
Bad status: Runtime error: could not verify certificate chain (error with cert: subject=CN = localhost, ST = sadfjas, C = AS, emailAddress = sdflkdsajf, O = lskdfjlsad, OU = sldfkja, issuer=C = AS, ST = ASDfkjdhf, L = lskdjf, O = saldfja, OU = skdjf, CN = localhost, emailAddress = sadjflkadsj): : certificate has expired
Google Test trace:
/data0/somelongdirectorytoavoidrpathissues/src/kudu/src/kudu/rpc/rpc-test.cc:267: Connecting to 0.0.0.0:46845
I20260926 22:01:23.802788  6003 test_util.cc:175] -----------------------------------------------
I20260926 22:01:23.802882  6003 test_util.cc:176] Had fatal failures, leaving test files at /tmp/dist-test-taskRRCrOL/test-tmp/rpc-test.5.Parameters_TestRpc.TestCallWithChainCertAndChainCA_SSL_TCP.1790460083654786-6003-0
[  FAILED  ] Parameters/TestRpc.TestCallWithChainCertAndChainCA/SSL_TCP, where GetParam() = (true, false) (33 ms)
[ RUN      ] Parameters/TestRpc.TestCallWithPasswordProtectedKey/SSL_TCP
I20260926 22:01:23.822376  6064 acceptor_pool.cc:254] collecting diagnostics on the listening RPC socket 0.0.0.0:39633 every 8 connection(s)
I20260926 22:01:23.822598  6065 acceptor_pool.cc:254] collecting diagnostics on the listening RPC socket 0.0.0.0:39633 every 8 connection(s)
[       OK ] Parameters/TestRpc.TestCallWithPasswordProtectedKey/SSL_TCP (55 ms)
[ RUN      ] Parameters/TestRpc.TestCallToBadServer/SSL_TCP
I20260926 22:01:23.871802  6003 rpc-test.cc:394] Status: Network error: Client connection negotiation failed: client connection to 0.0.0.0:0: connect: Connection refused (error 111)
I20260926 22:01:23.872576  6003 rpc-test.cc:394] Status: Network error: Client connection negotiation failed: client connection to 0.0.0.0:0: connect: Connection refused (error 111)
I20260926 22:01:23.873116  6003 rpc-test.cc:394] Status: Network error: Client connection negotiation failed: client connection to 0.0.0.0:0: connect: Connection refused (error 111)
I20260926 22:01:23.873628  6003 rpc-test.cc:394] Status: Network error: Client connection negotiation failed: client connection to 0.0.0.0:0: connect: Connection refused (error 111)
I20260926 22:01:23.874138  6003 rpc-test.cc:394] Status: Network error: Client connection negotiation failed: client connection to 0.0.0.0:0: connect: Connection refused (error 111)
[       OK ] Parameters/TestRpc.TestCallToBadServer/SSL_TCP (17 ms)
[ RUN      ] Parameters/TestRpc.TestWrongService/SSL_TCP
I20260926 22:01:23.905726  6099 acceptor_pool.cc:254] collecting diagnostics on the listening RPC socket 0.0.0.0:40545 every 8 connection(s)
I20260926 22:01:23.905994  6100 acceptor_pool.cc:254] collecting diagnostics on the listening RPC socket 0.0.0.0:40545 every 8 connection(s)
I20260926 22:01:23.923502  6096 messenger.cc:345] service WrongServiceName not registered on TestServer
[       OK ] Parameters/TestRpc.TestWrongService/SSL_TCP (52 ms)
[ RUN      ] Parameters/TestRpc.TestConnectionKeepalive/SSL_TCP
I20260926 22:01:23.939018  6122 acceptor_pool.cc:254] collecting diagnostics on the listening RPC socket 0.0.0.0:42857 every 8 connection(s)
I20260926 22:01:23.939249  6123 acceptor_pool.cc:254] collecting diagnostics on the listening RPC socket 0.0.0.0:42857 every 8 connection(s)
I20260926 22:01:23.940151  6003 rpc-test.cc:488] Connecting to 0.0.0.0:42857
[       OK ] Parameters/TestRpc.TestConnectionKeepalive/SSL_TCP (1045 ms)
[ RUN      ] Parameters/TestRpc.TestClientConnectionMetrics/SSL_TCP
I20260926 22:01:25.006211  6147 acceptor_pool.cc:254] collecting diagnostics on the listening RPC socket 0.0.0.0:36185 every 8 connection(s)
I20260926 22:01:25.006481  6148 acceptor_pool.cc:254] collecting diagnostics on the listening RPC socket 0.0.0.0:36185 every 8 connection(s)
I20260926 22:01:25.007412  6003 rpc-test.cc:569] Connecting to 0.0.0.0:36185
[       OK ] Parameters/TestRpc.TestClientConnectionMetrics/SSL_TCP (19188 ms)
[ RUN      ] Parameters/TestRpc.TestCredentialsPolicy/SSL_TCP
I20260926 22:01:44.178020  6170 acceptor_pool.cc:254] collecting diagnostics on the listening RPC socket 0.0.0.0:43459 every 8 connection(s)
I20260926 22:01:44.178344  6171 acceptor_pool.cc:254] collecting diagnostics on the listening RPC socket 0.0.0.0:43459 every 8 connection(s)
I20260926 22:01:44.179435  6003 rpc-test.cc:700] Connecting to 0.0.0.0:43459
[       OK ] Parameters/TestRpc.TestCredentialsPolicy/SSL_TCP (64 ms)
[ RUN      ] Parameters/TestRpc.TestCallLongerThanKeepalive/SSL_TCP
I20260926 22:01:44.238577  6195 acceptor_pool.cc:254] collecting diagnostics on the listening RPC socket 0.0.0.0:33771 every 8 connection(s)
I20260926 22:01:44.238801  6196 acceptor_pool.cc:254] collecting diagnostics on the listening RPC socket 0.0.0.0:33771 every 8 connection(s)
I20260926 22:01:44.253686  6199 rpc-test-base.h:222] got call: sleep_micros: 3000000 deferred: true
I20260926 22:01:47.256114  6199 rpcz_store.cc:275] Call kudu.rpc.GenericCalculatorService.Sleep from 127.0.0.1:35664 (request call id 0) took 3002 ms. Trace:
I20260926 22:01:47.256366  6199 rpcz_store.cc:276] 0926 22:01:44.253572 (+     0us) service_pool.cc:170] Inserting onto call queue
0926 22:01:44.253640 (+    68us) service_pool.cc:227] Handling call
0926 22:01:47.256067 (+3002427us) inbound_call.cc:173] Queueing success response
Metrics: {}
[       OK ] Parameters/TestRpc.TestCallLongerThanKeepalive/SSL_TCP (3034 ms)
[ RUN      ] Parameters/TestRpc.TestRpcSidecar/SSL_TCP
I20260926 22:01:47.272698  6220 acceptor_pool.cc:254] collecting diagnostics on the listening RPC socket 0.0.0.0:41977 every 8 connection(s)
I20260926 22:01:47.272953  6221 acceptor_pool.cc:254] collecting diagnostics on the listening RPC socket 0.0.0.0:41977 every 8 connection(s)
[       OK ] Parameters/TestRpc.TestRpcSidecar/SSL_TCP (106 ms)
[ RUN      ] Parameters/TestRpc.TestRpcSidecarLimits/SSL_TCP
I20260926 22:01:50.810472  6245 acceptor_pool.cc:254] collecting diagnostics on the listening RPC socket 0.0.0.0:46365 every 8 connection(s)
I20260926 22:01:50.810952  6246 acceptor_pool.cc:254] collecting diagnostics on the listening RPC socket 0.0.0.0:46365 every 8 connection(s)
W20260926 22:01:50.824492  6003 serialization.cc:72] Serialized kudu.rpc_test.PushStringsRequestPB (2147483654 bytes) is larger than the maximum configured RPC message size (52428800 bytes). Sending anyway, but peer may reject the data.
W20260926 22:01:50.831660  6243 connection.cc:535] server connection from 127.0.0.1:45992 recv error: Network error: RPC frame had a length of 2147483714, but we only support messages up to 52428800 bytes long.
W20260926 22:01:50.831873  6243 connection.cc:158] shutting down server connection from 127.0.0.1:45992 with pending inbound data: 4/2147483714 bytes received; last active 0 ns ago: status Network error: RPC frame had a length of 2147483714, but we only support messages up to 52428800 bytes long.
W20260926 22:01:50.832405  6258 connection.cc:196] Error closing socket: Network error: TlsSocket::Close: Connection reset by peer
I20260926 22:01:50.850611  6270 acceptor_pool.cc:254] collecting diagnostics on the listening RPC socket 0.0.0.0:38935 every 8 connection(s)
I20260926 22:01:50.851012  6271 acceptor_pool.cc:254] collecting diagnostics on the listening RPC socket 0.0.0.0:38935 every 8 connection(s)
W20260926 22:01:57.377367  6267 connection.cc:577] server connection from 127.0.0.1:51228: received bad data: 'Corruption: Invalid packet: message had a length of 2147483710, but we only support messages up to 2147483647 bytes
'
[       OK ] Parameters/TestRpc.TestRpcSidecarLimits/SSL_TCP (10419 ms)
[ RUN      ] Parameters/TestRpc.TestCallTimeoutDoesntAffectNegotiation/SSL_TCP
I20260926 22:01:57.808732  6295 acceptor_pool.cc:254] collecting diagnostics on the listening RPC socket 0.0.0.0:45105 every 8 connection(s)
I20260926 22:01:57.808991  6296 acceptor_pool.cc:254] collecting diagnostics on the listening RPC socket 0.0.0.0:45105 every 8 connection(s)
W20260926 22:01:57.829275  6291 negotiation.cc:266] Injecting 500ms delay in negotiation
I20260926 22:01:57.879740  6003 rpc-test-base.h:595] status: Timed out: connection negotiation to 0.0.0.0:45105 for RPC Sleep timed out after 0.050s (ON_OUTBOUND_QUEUE), seconds elapsed: 0.0513512
[       OK ] Parameters/TestRpc.TestCallTimeoutDoesntAffectNegotiation/SSL_TCP (552 ms)
[ RUN      ] Parameters/TestRpc.TestRpcHandlerLatencyMetric/SSL_TCP
I20260926 22:01:58.352864  6320 acceptor_pool.cc:254] collecting diagnostics on the listening RPC socket 0.0.0.0:44845 every 8 connection(s)
I20260926 22:01:58.353128  6321 acceptor_pool.cc:254] collecting diagnostics on the listening RPC socket 0.0.0.0:44845 every 8 connection(s)
I20260926 22:01:58.394025  6003 rpc-test.cc:1236] Sleep() min lat: 20815
I20260926 22:01:58.394127  6003 rpc-test.cc:1237] Sleep() mean lat: 20815
I20260926 22:01:58.394186  6003 rpc-test.cc:1238] Sleep() max lat: 20815
I20260926 22:01:58.394205  6003 rpc-test.cc:1239] Sleep() #calls: 1
[       OK ] Parameters/TestRpc.TestRpcHandlerLatencyMetric/SSL_TCP (58 ms)
[ RUN      ] Parameters/TestRpc.TimedOutOnResponseMetricServiceQueue/SSL_TCP
I20260926 22:01:58.416824  6346 acceptor_pool.cc:254] collecting diagnostics on the listening RPC socket 0.0.0.0:37361 every 8 connection(s)
I20260926 22:01:58.417043  6347 acceptor_pool.cc:254] collecting diagnostics on the listening RPC socket 0.0.0.0:37361 every 8 connection(s)
W20260926 22:01:58.476274  6348 rpcz_store.cc:267] Call kudu.rpc_test.CalculatorService.Sleep from 127.0.0.1:42336 (request call id 2) took 20 ms (client timeout 20 ms). Trace:
W20260926 22:01:58.476437  6348 rpcz_store.cc:269] 0926 22:01:58.455825 (+     0us) service_pool.cc:170] Inserting onto call queue
0926 22:01:58.476172 (+ 20347us) service_pool.cc:214] Skipping call since client already timed out
0926 22:01:58.476251 (+    79us) inbound_call.cc:173] Queueing failure response
Metrics: {}
[       OK ] Parameters/TestRpc.TimedOutOnResponseMetricServiceQueue/SSL_TCP (81 ms)
[ RUN      ] Parameters/TestRpc.RpcPendingConnectionsMetric/SSL_TCP
I20260926 22:01:58.485251  6369 acceptor_pool.cc:254] collecting diagnostics on the listening RPC socket 0.0.0.0:44203 every 8 connection(s)
I20260926 22:01:58.485425  6370 acceptor_pool.cc:254] collecting diagnostics on the listening RPC socket 0.0.0.0:44203 every 8 connection(s)
W20260926 22:01:58.487373  6365 negotiation.cc:337] Failed RPC negotiation. Trace:
0926 22:01:58.486746 (+     0us) reactor.cc:625] Submitting negotiation task for server connection from 127.0.0.1:47290 (local address 127.0.0.1:44203)
0926 22:01:58.486905 (+   159us) server_negotiation.cc:206] Beginning negotiation
0926 22:01:58.486909 (+     4us) server_negotiation.cc:399] Waiting for connection header
0926 22:01:58.487053 (+   144us) negotiation.cc:327] Negotiation complete: Network error: Server connection negotiation failed: server connection from 127.0.0.1:47290: BlockingRecv error: recv got EOF from 127.0.0.1:47290 (error 108)
Metrics: {"server-negotiator.queue_time_us":54}
[       OK ] Parameters/TestRpc.RpcPendingConnectionsMetric/SSL_TCP (19 ms)
[ RUN      ] Parameters/TestRpc.TestRpcContextClientDeadline/SSL_TCP
I20260926 22:01:58.520833  6385 acceptor_pool.cc:254] collecting diagnostics on the listening RPC socket 0.0.0.0:44979 every 8 connection(s)
I20260926 22:01:58.521046  6386 acceptor_pool.cc:254] collecting diagnostics on the listening RPC socket 0.0.0.0:44979 every 8 connection(s)
[       OK ] Parameters/TestRpc.TestRpcContextClientDeadline/SSL_TCP (64 ms)
[ RUN      ] Parameters/TestRpc.TestApplicationFeatureFlagUnsupportedServer/SSL_TCP
I20260926 22:01:58.574450  6410 acceptor_pool.cc:254] collecting diagnostics on the listening RPC socket 0.0.0.0:38007 every 8 connection(s)
I20260926 22:01:58.574657  6411 acceptor_pool.cc:254] collecting diagnostics on the listening RPC socket 0.0.0.0:38007 every 8 connection(s)
[       OK ] Parameters/TestRpc.TestApplicationFeatureFlagUnsupportedServer/SSL_TCP (33 ms)
[ RUN      ] Parameters/TestRpc.TestCancellationAsync/SSL_TCP
I20260926 22:01:58.607286  6435 acceptor_pool.cc:254] collecting diagnostics on the listening RPC socket 0.0.0.0:40333 every 8 connection(s)
I20260926 22:01:58.607527  6436 acceptor_pool.cc:254] collecting diagnostics on the listening RPC socket 0.0.0.0:40333 every 8 connection(s)
I20260926 22:01:58.608299  6003 rpc-test.cc:1716] Connecting to 0.0.0.0:40333
I20260926 22:01:58.658285  6003 test_util.cc:268] Using random seed: -77894495
I20260926 22:01:58.692588  6439 rpc-test-base.h:240] got call: sleep_micros: 500 pattern: 4294967295 num_repetitions: 2097152 sidecar_idx: 0
I20260926 22:01:58.718786  6438 rpc-test-base.h:240] got call: sleep_micros: 500 pattern: 4294967295 num_repetitions: 2097152 sidecar_idx: 0
I20260926 22:01:58.749051  6437 rpc-test-base.h:240] got call: sleep_micros: 500 pattern: 4294967295 num_repetitions: 2097152 sidecar_idx: 0
I20260926 22:01:58.776121  6439 rpc-test-base.h:240] got call: sleep_micros: 500 pattern: 4294967295 num_repetitions: 2097152 sidecar_idx: 0
I20260926 22:01:58.806670  6437 rpc-test-base.h:240] got call: sleep_micros: 500 pattern: 4294967295 num_repetitions: 2097152 sidecar_idx: 0
I20260926 22:01:58.832444  6439 rpc-test-base.h:240] got call: sleep_micros: 500 pattern: 4294967295 num_repetitions: 2097152 sidecar_idx: 0
W20260926 22:01:58.854508  6434 connection.cc:196] Error closing socket: Network error: TlsSocket::Close: Broken pipe
W20260926 22:01:58.868451  6434 connection.cc:441] server connection from 127.0.0.1:57818 torn down before Call kudu.rpc.GenericCalculatorService.SleepWithSidecar from 127.0.0.1:57818 (request call id 7) could send its response
W20260926 22:01:58.882704  6434 connection.cc:441] server connection from 127.0.0.1:57818 torn down before Call kudu.rpc.GenericCalculatorService.SleepWithSidecar from 127.0.0.1:57818 (request call id 8) could send its response
[       OK ] Parameters/TestRpc.TestCancellationAsync/SSL_TCP (287 ms)
[ RUN      ] Parameters/TestRpc.TestPerformanceBySocketType/SSL_TCP
I20260926 22:01:58.904333  6460 acceptor_pool.cc:254] collecting diagnostics on the listening RPC socket 0.0.0.0:41183 every 8 connection(s)
I20260926 22:01:58.904572  6461 acceptor_pool.cc:254] collecting diagnostics on the listening RPC socket 0.0.0.0:41183 every 8 connection(s)
I20260926 22:01:58.905441  6003 rpc-test.cc:1846] Connecting to 0.0.0.0:41183
I20260926 22:02:01.847164  6003 rpc-test.cc:1859] Sending 1024MB via ssl-enabled tcp socket: real 2.930s	user 2.756s	sys 2.102s
I20260926 22:02:04.899446  6003 rpc-test.cc:1859] Sending 1024MB via ssl-enabled tcp socket: real 3.052s	user 2.918s	sys 2.148s
I20260926 22:02:08.005959  6003 rpc-test.cc:1859] Sending 1024MB via ssl-enabled tcp socket: real 3.106s	user 2.863s	sys 2.286s
I20260926 22:02:11.043923  6003 rpc-test.cc:1859] Sending 1024MB via ssl-enabled tcp socket: real 3.038s	user 2.744s	sys 2.267s
I20260926 22:02:14.036624  6003 rpc-test.cc:1859] Sending 1024MB via ssl-enabled tcp socket: real 2.993s	user 2.855s	sys 2.097s
[       OK ] Parameters/TestRpc.TestPerformanceBySocketType/SSL_TCP (15158 ms)
[----------] 20 tests from Parameters/TestRpc (50366 ms total)

[----------] 1 test from Parameters/TestRpcSocketTxRxQueue
[ RUN      ] Parameters/TestRpcSocketTxRxQueue.OverCapacity/0
W20260926 22:02:14.347468  6477 negotiation.cc:337] Failed RPC negotiation. Trace:
0926 22:02:14.052594 (+     0us) reactor.cc:625] Submitting negotiation task for client connection to 0.0.0.0:34991 (local address 127.0.0.1:33296)
0926 22:02:14.052788 (+   194us) negotiation.cc:107] Waiting for socket to connect
0926 22:02:14.052808 (+    20us) client_negotiation.cc:174] Beginning negotiation
0926 22:02:14.052936 (+   128us) client_negotiation.cc:252] Sending NEGOTIATE NegotiatePB request
0926 22:02:14.346553 (+293617us) negotiation.cc:327] Negotiation complete: Network error: Client connection negotiation failed: client connection to 0.0.0.0:34991: BlockingRecv error: recv error from unknown peer: Transport endpoint is not connected (error 107)
Metrics: {"client-negotiator.queue_time_us":66}
W20260926 22:02:14.347568  6495 negotiation.cc:337] Failed RPC negotiation. Trace:
0926 22:02:14.058095 (+     0us) reactor.cc:625] Submitting negotiation task for client connection to 0.0.0.0:34991 (local address 127.0.0.1:33310)
0926 22:02:14.058294 (+   199us) negotiation.cc:107] Waiting for socket to connect
0926 22:02:14.058312 (+    18us) client_negotiation.cc:174] Beginning negotiation
0926 22:02:14.058432 (+   120us) client_negotiation.cc:252] Sending NEGOTIATE NegotiatePB request
0926 22:02:14.346631 (+288199us) negotiation.cc:327] Negotiation complete: Network error: Client connection negotiation failed: client connection to 0.0.0.0:34991: BlockingRecv error: recv error from unknown peer: Transport endpoint is not connected (error 107)
Metrics: {"client-negotiator.queue_time_us":55}
W20260926 22:02:14.348100  6513 negotiation.cc:337] Failed RPC negotiation. Trace:
0926 22:02:14.063884 (+     0us) reactor.cc:625] Submitting negotiation task for client connection to 0.0.0.0:34991 (local address 127.0.0.1:33324)
0926 22:02:14.064089 (+   205us) negotiation.cc:107] Waiting for socket to connect
0926 22:02:14.064106 (+    17us) client_negotiation.cc:174] Beginning negotiation
0926 22:02:14.064203 (+    97us) client_negotiation.cc:252] Sending NEGOTIATE NegotiatePB request
0926 22:02:14.347538 (+283335us) negotiation.cc:327] Negotiation complete: Network error: Client connection negotiation failed: client connection to 0.0.0.0:34991: BlockingRecv error: recv error from unknown peer: Transport endpoint is not connected (error 107)
Metrics: {"client-negotiator.queue_time_us":73}
W20260926 22:02:14.347496  6486 negotiation.cc:337] Failed RPC negotiation. Trace:
0926 22:02:14.055416 (+     0us) reactor.cc:625] Submitting negotiation task for client connection to 0.0.0.0:34991 (local address 127.0.0.1:33308)
0926 22:02:14.055580 (+   164us) negotiation.cc:107] Waiting for socket to connect
0926 22:02:14.055598 (+    18us) client_negotiation.cc:174] Beginning negotiation
0926 22:02:14.055719 (+   121us) client_negotiation.cc:252] Sending NEGOTIATE NegotiatePB request
0926 22:02:14.346631 (+290912us) negotiation.cc:327] Negotiation complete: Network error: Client connection negotiation failed: client connection to 0.0.0.0:34991: BlockingRecv error: recv error from unknown peer: Transport endpoint is not connected (error 107)
Metrics: {"client-negotiator.queue_time_us":52}
W20260926 22:02:14.348344  6504 negotiation.cc:337] Failed RPC negotiation. Trace:
0926 22:02:14.061186 (+     0us) reactor.cc:625] Submitting negotiation task for client connection to 0.0.0.0:34991 (local address 127.0.0.1:33314)
0926 22:02:14.061366 (+   180us) negotiation.cc:107] Waiting for socket to connect
0926 22:02:14.061384 (+    18us) client_negotiation.cc:174] Beginning negotiation
0926 22:02:14.061489 (+   105us) client_negotiation.cc:252] Sending NEGOTIATE NegotiatePB request
0926 22:02:14.347516 (+286027us) negotiation.cc:327] Negotiation complete: Network error: Client connection negotiation failed: client connection to 0.0.0.0:34991: BlockingRecv error: recv error from unknown peer: Transport endpoint is not connected (error 107)
Metrics: {"client-negotiator.queue_time_us":39}
W20260926 22:02:14.351931  6522 negotiation.cc:337] Failed RPC negotiation. Trace:
0926 22:02:14.067133 (+     0us) reactor.cc:625] Submitting negotiation task for client connection to 0.0.0.0:34991 (local address 127.0.0.1:33330)
0926 22:02:14.067310 (+   177us) negotiation.cc:107] Waiting for socket to connect
0926 22:02:14.067324 (+    14us) client_negotiation.cc:174] Beginning negotiation
0926 22:02:14.067435 (+   111us) client_negotiation.cc:252] Sending NEGOTIATE NegotiatePB request
0926 22:02:14.347656 (+280221us) negotiation.cc:327] Negotiation complete: Network error: Client connection negotiation failed: client connection to 0.0.0.0:34991: BlockingRecv error: recv error from unknown peer: Transport endpoint is not connected (error 107)
Metrics: {"client-negotiator.queue_time_us":61}
[       OK ] Parameters/TestRpcSocketTxRxQueue.OverCapacity/0 (1072 ms)
[----------] 1 test from Parameters/TestRpcSocketTxRxQueue (1072 ms total)

[----------] Global test environment tear-down
[==========] 21 tests from 2 test suites ran. (51439 ms total)
[  PASSED  ] 20 tests.
[  FAILED  ] 1 test, listed below:
[  FAILED  ] Parameters/TestRpc.TestCallWithChainCertAndChainCA/SSL_TCP, where GetParam() = (true, false)

 1 FAILED TEST