Diagnosed failure
Parameters/TestRpc.TestCallWithChainCertAndChainCA/SSL_TCP: /data0/somelongdirectorytoavoidrpathissues/src/kudu/src/kudu/rpc/rpc-test.cc:270: Failure
Failed
Bad status: Runtime error: could not verify certificate chain (error with cert: subject=CN = localhost, ST = sadfjas, C = AS, emailAddress = sdflkdsajf, O = lskdfjlsad, OU = sldfkja, issuer=C = AS, ST = ASDfkjdhf, L = lskdjf, O = saldfja, OU = skdjf, CN = localhost, emailAddress = sadjflkadsj): : certificate has expired
Google Test trace:
/data0/somelongdirectorytoavoidrpathissues/src/kudu/src/kudu/rpc/rpc-test.cc:267: Connecting to 0.0.0.0:41567
I20260928 03:47:52.835650 9411 test_util.cc:175] -----------------------------------------------
I20260928 03:47:52.835816 9411 test_util.cc:176] Had fatal failures, leaving test files at /tmp/dist-test-taskjMQ0RR/test-tmp/rpc-test.5.Parameters_TestRpc.TestCallWithChainCertAndChainCA_SSL_TCP.1790567271412359-9411-0
Full log
Note: This is test shard 6 of 8.
[==========] Running 21 tests from 2 test suites.
[----------] Global test environment set-up.
[----------] 20 tests from Parameters/TestRpc
[ RUN ] Parameters/TestRpc.TestMessengerCreateDestroy/SSL_TCP
WARNING: Logging before InitGoogleLogging() is written to STDERR
I20260928 03:47:51.510743 9411 rpc-test.cc:169] started messenger TestCreateDestroy
[ OK ] Parameters/TestRpc.TestMessengerCreateDestroy/SSL_TCP (76 ms)
[ RUN ] Parameters/TestRpc.TestNegotiationDeadlock/SSL_TCP
W20260928 03:47:52.680569 9411 thread.cc:636] client-negotiator [worker] (thread pool) Time spent creating pthread: real 1.134s user 0.005s sys 0.001s
W20260928 03:47:52.680943 9411 thread.cc:602] client-negotiator [worker] (thread pool) Time spent starting thread: real 1.134s user 0.005s sys 0.001s
I20260928 03:47:52.717963 9433 acceptor_pool.cc:254] collecting diagnostics on the listening RPC socket 0.0.0.0:43749 every 8 connection(s)
I20260928 03:47:52.719357 9434 acceptor_pool.cc:254] collecting diagnostics on the listening RPC socket 0.0.0.0:43749 every 8 connection(s)
[ OK ] Parameters/TestRpc.TestNegotiationDeadlock/SSL_TCP (1229 ms)
[ RUN ] Parameters/TestRpc.TestCallWithChainCertAndChainCA/SSL_TCP
I20260928 03:47:52.807071 9449 acceptor_pool.cc:254] collecting diagnostics on the listening RPC socket 0.0.0.0:41567 every 8 connection(s)
I20260928 03:47:52.809319 9450 acceptor_pool.cc:254] collecting diagnostics on the listening RPC socket 0.0.0.0:41567 every 8 connection(s)
/data0/somelongdirectorytoavoidrpathissues/src/kudu/src/kudu/rpc/rpc-test.cc:270: Failure
Failed
Bad status: Runtime error: could not verify certificate chain (error with cert: subject=CN = localhost, ST = sadfjas, C = AS, emailAddress = sdflkdsajf, O = lskdfjlsad, OU = sldfkja, issuer=C = AS, ST = ASDfkjdhf, L = lskdjf, O = saldfja, OU = skdjf, CN = localhost, emailAddress = sadjflkadsj): : certificate has expired
Google Test trace:
/data0/somelongdirectorytoavoidrpathissues/src/kudu/src/kudu/rpc/rpc-test.cc:267: Connecting to 0.0.0.0:41567
I20260928 03:47:52.835650 9411 test_util.cc:175] -----------------------------------------------
I20260928 03:47:52.835816 9411 test_util.cc:176] Had fatal failures, leaving test files at /tmp/dist-test-taskjMQ0RR/test-tmp/rpc-test.5.Parameters_TestRpc.TestCallWithChainCertAndChainCA_SSL_TCP.1790567271412359-9411-0
[ FAILED ] Parameters/TestRpc.TestCallWithChainCertAndChainCA/SSL_TCP, where GetParam() = (true, false) (65 ms)
[ RUN ] Parameters/TestRpc.TestCallWithPasswordProtectedKey/SSL_TCP
I20260928 03:47:52.854877 9474 acceptor_pool.cc:254] collecting diagnostics on the listening RPC socket 0.0.0.0:38601 every 8 connection(s)
I20260928 03:47:52.855587 9475 acceptor_pool.cc:254] collecting diagnostics on the listening RPC socket 0.0.0.0:38601 every 8 connection(s)
[ OK ] Parameters/TestRpc.TestCallWithPasswordProtectedKey/SSL_TCP (68 ms)
[ RUN ] Parameters/TestRpc.TestCallToBadServer/SSL_TCP
I20260928 03:47:52.936105 9411 rpc-test.cc:394] Status: Network error: Client connection negotiation failed: client connection to 0.0.0.0:0: connect: Connection refused (error 111)
I20260928 03:47:52.937482 9411 rpc-test.cc:394] Status: Network error: Client connection negotiation failed: client connection to 0.0.0.0:0: connect: Connection refused (error 111)
I20260928 03:47:52.938756 9411 rpc-test.cc:394] Status: Network error: Client connection negotiation failed: client connection to 0.0.0.0:0: connect: Connection refused (error 111)
I20260928 03:47:52.940023 9411 rpc-test.cc:394] Status: Network error: Client connection negotiation failed: client connection to 0.0.0.0:0: connect: Connection refused (error 111)
I20260928 03:47:52.941296 9411 rpc-test.cc:394] Status: Network error: Client connection negotiation failed: client connection to 0.0.0.0:0: connect: Connection refused (error 111)
[ OK ] Parameters/TestRpc.TestCallToBadServer/SSL_TCP (39 ms)
[ RUN ] Parameters/TestRpc.TestWrongService/SSL_TCP
I20260928 03:47:52.962504 9509 acceptor_pool.cc:254] collecting diagnostics on the listening RPC socket 0.0.0.0:41419 every 8 connection(s)
I20260928 03:47:52.963299 9510 acceptor_pool.cc:254] collecting diagnostics on the listening RPC socket 0.0.0.0:41419 every 8 connection(s)
I20260928 03:47:53.005483 9508 messenger.cc:345] service WrongServiceName not registered on TestServer
[ OK ] Parameters/TestRpc.TestWrongService/SSL_TCP (70 ms)
[ RUN ] Parameters/TestRpc.TestConnectionKeepalive/SSL_TCP
I20260928 03:47:53.032856 9532 acceptor_pool.cc:254] collecting diagnostics on the listening RPC socket 0.0.0.0:37637 every 8 connection(s)
I20260928 03:47:53.033598 9533 acceptor_pool.cc:254] collecting diagnostics on the listening RPC socket 0.0.0.0:37637 every 8 connection(s)
I20260928 03:47:53.036759 9411 rpc-test.cc:488] Connecting to 0.0.0.0:37637
[ OK ] Parameters/TestRpc.TestConnectionKeepalive/SSL_TCP (1059 ms)
[ RUN ] Parameters/TestRpc.TestClientConnectionMetrics/SSL_TCP
I20260928 03:47:54.103708 9557 acceptor_pool.cc:254] collecting diagnostics on the listening RPC socket 0.0.0.0:38789 every 8 connection(s)
I20260928 03:47:54.104476 9558 acceptor_pool.cc:254] collecting diagnostics on the listening RPC socket 0.0.0.0:38789 every 8 connection(s)
I20260928 03:47:54.107517 9411 rpc-test.cc:569] Connecting to 0.0.0.0:38789
[ OK ] Parameters/TestRpc.TestClientConnectionMetrics/SSL_TCP (114497 ms)
[ RUN ] Parameters/TestRpc.TestCredentialsPolicy/SSL_TCP
I20260928 03:49:48.614827 9591 acceptor_pool.cc:254] collecting diagnostics on the listening RPC socket 0.0.0.0:37459 every 8 connection(s)
I20260928 03:49:48.615666 9592 acceptor_pool.cc:254] collecting diagnostics on the listening RPC socket 0.0.0.0:37459 every 8 connection(s)
I20260928 03:49:48.618880 9411 rpc-test.cc:700] Connecting to 0.0.0.0:37459
[ OK ] Parameters/TestRpc.TestCredentialsPolicy/SSL_TCP (109 ms)
[ RUN ] Parameters/TestRpc.TestCallLongerThanKeepalive/SSL_TCP
I20260928 03:49:48.706326 9616 acceptor_pool.cc:254] collecting diagnostics on the listening RPC socket 0.0.0.0:44071 every 8 connection(s)
I20260928 03:49:48.707054 9617 acceptor_pool.cc:254] collecting diagnostics on the listening RPC socket 0.0.0.0:44071 every 8 connection(s)
I20260928 03:49:48.736577 9620 rpc-test-base.h:222] got call: sleep_micros: 3000000 deferred: true
I20260928 03:49:51.740928 9620 rpcz_store.cc:275] Call kudu.rpc.GenericCalculatorService.Sleep from 127.0.0.1:37496 (request call id 0) took 3004 ms. Trace:
I20260928 03:49:51.741355 9620 rpcz_store.cc:276] 0928 03:49:48.736310 (+ 0us) service_pool.cc:170] Inserting onto call queue
0928 03:49:48.736426 (+ 116us) service_pool.cc:227] Handling call
0928 03:49:51.740765 (+3004339us) inbound_call.cc:173] Queueing success response
Metrics: {}
[ OK ] Parameters/TestRpc.TestCallLongerThanKeepalive/SSL_TCP (3072 ms)
[ RUN ] Parameters/TestRpc.TestRpcSidecar/SSL_TCP
I20260928 03:49:51.782574 9642 acceptor_pool.cc:254] collecting diagnostics on the listening RPC socket 0.0.0.0:36615 every 8 connection(s)
I20260928 03:49:51.783198 9643 acceptor_pool.cc:254] collecting diagnostics on the listening RPC socket 0.0.0.0:36615 every 8 connection(s)
[ OK ] Parameters/TestRpc.TestRpcSidecar/SSL_TCP (523 ms)
[ RUN ] Parameters/TestRpc.TestRpcSidecarLimits/SSL_TCP
I20260928 03:50:08.604882 9668 acceptor_pool.cc:254] collecting diagnostics on the listening RPC socket 0.0.0.0:41997 every 8 connection(s)
I20260928 03:50:08.605675 9669 acceptor_pool.cc:254] collecting diagnostics on the listening RPC socket 0.0.0.0:41997 every 8 connection(s)
W20260928 03:50:08.622272 9411 serialization.cc:72] Serialized kudu.rpc_test.PushStringsRequestPB (2147483654 bytes) is larger than the maximum configured RPC message size (52428800 bytes). Sending anyway, but peer may reject the data.
W20260928 03:50:08.632614 9665 connection.cc:535] server connection from 127.0.0.1:41134 recv error: Network error: RPC frame had a length of 2147483714, but we only support messages up to 52428800 bytes long.
W20260928 03:50:08.632933 9665 connection.cc:158] shutting down server connection from 127.0.0.1:41134 with pending inbound data: 4/2147483714 bytes received; last active 0 ns ago: status Network error: RPC frame had a length of 2147483714, but we only support messages up to 52428800 bytes long.
W20260928 03:50:08.633765 9681 connection.cc:698] client connection to 0.0.0.0:41997 send error: Network error: failed to write to TLS socket: Connection reset by peer
W20260928 03:50:08.634454 9681 connection.cc:196] Error closing socket: Network error: TlsSocket::Close: Success
[ OK ] Parameters/TestRpc.TestRpcSidecarLimits/SSL_TCP (17116 ms)
[ RUN ] Parameters/TestRpc.TestCallTimeoutDoesntAffectNegotiation/SSL_TCP
I20260928 03:50:09.419617 9693 acceptor_pool.cc:254] collecting diagnostics on the listening RPC socket 0.0.0.0:42097 every 8 connection(s)
I20260928 03:50:09.420455 9694 acceptor_pool.cc:254] collecting diagnostics on the listening RPC socket 0.0.0.0:42097 every 8 connection(s)
W20260928 03:50:09.441802 9689 negotiation.cc:266] Injecting 500ms delay in negotiation
I20260928 03:50:09.492506 9411 rpc-test-base.h:595] status: Timed out: connection negotiation to 0.0.0.0:42097 for RPC Sleep timed out after 0.050s (ON_OUTBOUND_QUEUE), seconds elapsed: 0.051586
[ OK ] Parameters/TestRpc.TestCallTimeoutDoesntAffectNegotiation/SSL_TCP (563 ms)
[ RUN ] Parameters/TestRpc.TestRpcHandlerLatencyMetric/SSL_TCP
I20260928 03:50:09.979523 9718 acceptor_pool.cc:254] collecting diagnostics on the listening RPC socket 0.0.0.0:43157 every 8 connection(s)
I20260928 03:50:09.980240 9719 acceptor_pool.cc:254] collecting diagnostics on the listening RPC socket 0.0.0.0:43157 every 8 connection(s)
I20260928 03:50:10.045980 9411 rpc-test.cc:1236] Sleep() min lat: 21566
I20260928 03:50:10.046205 9411 rpc-test.cc:1237] Sleep() mean lat: 21566
I20260928 03:50:10.046398 9411 rpc-test.cc:1238] Sleep() max lat: 21566
I20260928 03:50:10.046567 9411 rpc-test.cc:1239] Sleep() #calls: 1
[ OK ] Parameters/TestRpc.TestRpcHandlerLatencyMetric/SSL_TCP (95 ms)
[ RUN ] Parameters/TestRpc.TimedOutOnResponseMetricServiceQueue/SSL_TCP
I20260928 03:50:10.072695 9744 acceptor_pool.cc:254] collecting diagnostics on the listening RPC socket 0.0.0.0:44433 every 8 connection(s)
I20260928 03:50:10.073408 9745 acceptor_pool.cc:254] collecting diagnostics on the listening RPC socket 0.0.0.0:44433 every 8 connection(s)
W20260928 03:50:10.145190 9746 rpcz_store.cc:267] Call kudu.rpc_test.CalculatorService.Sleep from 127.0.0.1:51812 (request call id 2) took 20 ms (client timeout 20 ms). Trace:
W20260928 03:50:10.145525 9746 rpcz_store.cc:269] 0928 03:50:10.124727 (+ 0us) service_pool.cc:170] Inserting onto call queue
0928 03:50:10.145045 (+ 20318us) service_pool.cc:214] Skipping call since client already timed out
0928 03:50:10.145124 (+ 79us) inbound_call.cc:173] Queueing failure response
Metrics: {}
[ OK ] Parameters/TestRpc.TimedOutOnResponseMetricServiceQueue/SSL_TCP (97 ms)
[ RUN ] Parameters/TestRpc.RpcPendingConnectionsMetric/SSL_TCP
I20260928 03:50:10.162233 9767 acceptor_pool.cc:254] collecting diagnostics on the listening RPC socket 0.0.0.0:45617 every 8 connection(s)
I20260928 03:50:10.162935 9768 acceptor_pool.cc:254] collecting diagnostics on the listening RPC socket 0.0.0.0:45617 every 8 connection(s)
W20260928 03:50:10.167930 9763 negotiation.cc:337] Failed RPC negotiation. Trace:
0928 03:50:10.166672 (+ 0us) reactor.cc:625] Submitting negotiation task for server connection from 127.0.0.1:53326 (local address 127.0.0.1:45617)
0928 03:50:10.167056 (+ 384us) server_negotiation.cc:206] Beginning negotiation
0928 03:50:10.167073 (+ 17us) server_negotiation.cc:399] Waiting for connection header
0928 03:50:10.167307 (+ 234us) negotiation.cc:327] Negotiation complete: Network error: Server connection negotiation failed: server connection from 127.0.0.1:53326: BlockingRecv error: recv got EOF from 127.0.0.1:53326 (error 108)
Metrics: {"server-negotiator.queue_time_us":93}
[ OK ] Parameters/TestRpc.RpcPendingConnectionsMetric/SSL_TCP (28 ms)
[ RUN ] Parameters/TestRpc.TestRpcContextClientDeadline/SSL_TCP
I20260928 03:50:10.222818 9783 acceptor_pool.cc:254] collecting diagnostics on the listening RPC socket 0.0.0.0:41007 every 8 connection(s)
I20260928 03:50:10.223573 9784 acceptor_pool.cc:254] collecting diagnostics on the listening RPC socket 0.0.0.0:41007 every 8 connection(s)
[ OK ] Parameters/TestRpc.TestRpcContextClientDeadline/SSL_TCP (116 ms)
[ RUN ] Parameters/TestRpc.TestApplicationFeatureFlagUnsupportedServer/SSL_TCP
I20260928 03:50:10.320003 9808 acceptor_pool.cc:254] collecting diagnostics on the listening RPC socket 0.0.0.0:35435 every 8 connection(s)
I20260928 03:50:10.320757 9809 acceptor_pool.cc:254] collecting diagnostics on the listening RPC socket 0.0.0.0:35435 every 8 connection(s)
[ OK ] Parameters/TestRpc.TestApplicationFeatureFlagUnsupportedServer/SSL_TCP (61 ms)
[ RUN ] Parameters/TestRpc.TestCancellationAsync/SSL_TCP
I20260928 03:50:10.385820 9833 acceptor_pool.cc:254] collecting diagnostics on the listening RPC socket 0.0.0.0:35981 every 8 connection(s)
I20260928 03:50:10.386549 9834 acceptor_pool.cc:254] collecting diagnostics on the listening RPC socket 0.0.0.0:35981 every 8 connection(s)
I20260928 03:50:10.389726 9411 rpc-test.cc:1716] Connecting to 0.0.0.0:35981
I20260928 03:50:10.404827 9411 test_util.cc:268] Using random seed: -160330296
I20260928 03:50:10.632565 9837 rpc-test-base.h:240] got call: sleep_micros: 500 pattern: 4294967295 num_repetitions: 2097152 sidecar_idx: 0
I20260928 03:50:10.798679 9836 rpc-test-base.h:240] got call: sleep_micros: 500 pattern: 4294967295 num_repetitions: 2097152 sidecar_idx: 0
I20260928 03:50:10.988269 9837 rpc-test-base.h:240] got call: sleep_micros: 500 pattern: 4294967295 num_repetitions: 2097152 sidecar_idx: 0
I20260928 03:50:11.175765 9836 rpc-test-base.h:240] got call: sleep_micros: 500 pattern: 4294967295 num_repetitions: 2097152 sidecar_idx: 0
I20260928 03:50:11.355209 9837 rpc-test-base.h:240] got call: sleep_micros: 500 pattern: 4294967295 num_repetitions: 2097152 sidecar_idx: 0
I20260928 03:50:11.533445 9836 rpc-test-base.h:240] got call: sleep_micros: 500 pattern: 4294967295 num_repetitions: 2097152 sidecar_idx: 0
I20260928 03:50:11.714911 9837 rpc-test-base.h:240] got call: sleep_micros: 500 pattern: 4294967295 num_repetitions: 2097152 sidecar_idx: 0
I20260928 03:50:11.888303 9836 rpc-test-base.h:240] got call: sleep_micros: 500 pattern: 4294967295 num_repetitions: 2097152 sidecar_idx: 0
W20260928 03:50:12.036080 9846 outbound_call.cc:322] RPC callback for RPC call kudu.rpc.GenericCalculatorService.SleepWithSidecar -> {remote=0.0.0.0:35981 (localhost), user_credentials={real_user=slave}} blocked reactor thread for 92796.4us
W20260928 03:50:12.087909 9830 connection.cc:196] Error closing socket: Network error: TlsSocket::Close: Broken pipe
W20260928 03:50:12.167408 9830 connection.cc:441] server connection from 127.0.0.1:53772 torn down before Call kudu.rpc.GenericCalculatorService.SleepWithSidecar from 127.0.0.1:53772 (request call id 8) could send its response
[ OK ] Parameters/TestRpc.TestCancellationAsync/SSL_TCP (1818 ms)
[ RUN ] Parameters/TestRpc.TestPerformanceBySocketType/SSL_TCP
I20260928 03:50:12.265781 9859 acceptor_pool.cc:254] collecting diagnostics on the listening RPC socket 0.0.0.0:37321 every 8 connection(s)
I20260928 03:50:12.266810 9860 acceptor_pool.cc:254] collecting diagnostics on the listening RPC socket 0.0.0.0:37321 every 8 connection(s)
I20260928 03:50:12.270866 9411 rpc-test.cc:1846] Connecting to 0.0.0.0:37321
I20260928 03:50:31.264595 9411 rpc-test.cc:1859] Sending 1024MB via ssl-enabled tcp socket: real 18.971s user 16.701s sys 10.325s
I20260928 03:50:50.196244 9411 rpc-test.cc:1859] Sending 1024MB via ssl-enabled tcp socket: real 18.931s user 16.266s sys 10.612s
I20260928 03:51:09.061259 9411 rpc-test.cc:1859] Sending 1024MB via ssl-enabled tcp socket: real 18.864s user 15.932s sys 10.757s
I20260928 03:51:27.965026 9411 rpc-test.cc:1859] Sending 1024MB via ssl-enabled tcp socket: real 18.903s user 16.315s sys 10.577s
I20260928 03:51:46.744302 9411 rpc-test.cc:1859] Sending 1024MB via ssl-enabled tcp socket: real 18.779s user 15.881s sys 10.691s
[ OK ] Parameters/TestRpc.TestPerformanceBySocketType/SSL_TCP (94584 ms)
[----------] 20 tests from Parameters/TestRpc (235299 ms total)
[----------] 1 test from Parameters/TestRpcSocketTxRxQueue
[ RUN ] Parameters/TestRpcSocketTxRxQueue.OverCapacity/0
W20260928 03:51:47.195130 9903 negotiation.cc:337] Failed RPC negotiation. Trace:
0928 03:51:46.787164 (+ 0us) reactor.cc:625] Submitting negotiation task for client connection to 0.0.0.0:35789 (local address 127.0.0.1:43418)
0928 03:51:46.787716 (+ 552us) negotiation.cc:107] Waiting for socket to connect
0928 03:51:46.787746 (+ 30us) client_negotiation.cc:174] Beginning negotiation
0928 03:51:46.787947 (+ 201us) client_negotiation.cc:252] Sending NEGOTIATE NegotiatePB request
0928 03:51:47.192880 (+404933us) negotiation.cc:327] Negotiation complete: Network error: Client connection negotiation failed: client connection to 0.0.0.0:35789: BlockingRecv error: recv error from unknown peer: Transport endpoint is not connected (error 107)
Metrics: {"client-negotiator.queue_time_us":148}
W20260928 03:51:47.195751 9930 negotiation.cc:337] Failed RPC negotiation. Trace:
0928 03:51:46.823509 (+ 0us) reactor.cc:625] Submitting negotiation task for client connection to 0.0.0.0:35789 (local address 127.0.0.1:43452)
0928 03:51:46.824104 (+ 595us) negotiation.cc:107] Waiting for socket to connect
0928 03:51:46.824133 (+ 29us) client_negotiation.cc:174] Beginning negotiation
0928 03:51:46.824475 (+ 342us) client_negotiation.cc:252] Sending NEGOTIATE NegotiatePB request
0928 03:51:47.193339 (+368864us) negotiation.cc:327] Negotiation complete: Network error: Client connection negotiation failed: client connection to 0.0.0.0:35789: BlockingRecv error: recv error from unknown peer: Transport endpoint is not connected (error 107)
Metrics: {"client-negotiator.queue_time_us":161}
W20260928 03:51:47.196163 9921 negotiation.cc:337] Failed RPC negotiation. Trace:
0928 03:51:46.811265 (+ 0us) reactor.cc:625] Submitting negotiation task for client connection to 0.0.0.0:35789 (local address 127.0.0.1:43436)
0928 03:51:46.811859 (+ 594us) negotiation.cc:107] Waiting for socket to connect
0928 03:51:46.811890 (+ 31us) client_negotiation.cc:174] Beginning negotiation
0928 03:51:46.812090 (+ 200us) client_negotiation.cc:252] Sending NEGOTIATE NegotiatePB request
0928 03:51:47.195205 (+383115us) negotiation.cc:327] Negotiation complete: Network error: Client connection negotiation failed: client connection to 0.0.0.0:35789: BlockingRecv error: recv error from unknown peer: Transport endpoint is not connected (error 107)
Metrics: {"client-negotiator.queue_time_us":151}
W20260928 03:51:47.196578 9912 negotiation.cc:337] Failed RPC negotiation. Trace:
0928 03:51:46.799603 (+ 0us) reactor.cc:625] Submitting negotiation task for client connection to 0.0.0.0:35789 (local address 127.0.0.1:43434)
0928 03:51:46.800174 (+ 571us) negotiation.cc:107] Waiting for socket to connect
0928 03:51:46.800203 (+ 29us) client_negotiation.cc:174] Beginning negotiation
0928 03:51:46.800528 (+ 325us) client_negotiation.cc:252] Sending NEGOTIATE NegotiatePB request
0928 03:51:47.193780 (+393252us) negotiation.cc:327] Negotiation complete: Network error: Client connection negotiation failed: client connection to 0.0.0.0:35789: BlockingRecv error: recv error from unknown peer: Transport endpoint is not connected (error 107)
Metrics: {"client-negotiator.queue_time_us":171}
W20260928 03:51:47.195781 9885 negotiation.cc:337] Failed RPC negotiation. Trace:
0928 03:51:46.773107 (+ 0us) reactor.cc:625] Submitting negotiation task for client connection to 0.0.0.0:35789 (local address 127.0.0.1:43412)
0928 03:51:46.773621 (+ 514us) negotiation.cc:107] Waiting for socket to connect
0928 03:51:46.773651 (+ 30us) client_negotiation.cc:174] Beginning negotiation
0928 03:51:46.773963 (+ 312us) client_negotiation.cc:252] Sending NEGOTIATE NegotiatePB request
0928 03:51:47.192833 (+418870us) negotiation.cc:327] Negotiation complete: Network error: Client connection negotiation failed: client connection to 0.0.0.0:35789: BlockingRecv error: recv error from unknown peer: Transport endpoint is not connected (error 107)
Metrics: {"client-negotiator.queue_time_us":93}
W20260928 03:51:47.197103 9894 negotiation.cc:337] Failed RPC negotiation. Trace:
0928 03:51:46.779840 (+ 0us) reactor.cc:625] Submitting negotiation task for client connection to 0.0.0.0:35789 (local address 127.0.0.1:43416)
0928 03:51:46.780458 (+ 618us) negotiation.cc:107] Waiting for socket to connect
0928 03:51:46.780499 (+ 41us) client_negotiation.cc:174] Beginning negotiation
0928 03:51:46.780839 (+ 340us) client_negotiation.cc:252] Sending NEGOTIATE NegotiatePB request
0928 03:51:47.192880 (+412041us) negotiation.cc:327] Negotiation complete: Network error: Client connection negotiation failed: client connection to 0.0.0.0:35789: BlockingRecv error: recv error from unknown peer: Transport endpoint is not connected (error 107)
Metrics: {"client-negotiator.queue_time_us":146}
[ OK ] Parameters/TestRpcSocketTxRxQueue.OverCapacity/0 (1224 ms)
[----------] 1 test from Parameters/TestRpcSocketTxRxQueue (1225 ms total)
[----------] Global test environment tear-down
[==========] 21 tests from 2 test suites ran. (236525 ms total)
[ PASSED ] 20 tests.
[ FAILED ] 1 test, listed below:
[ FAILED ] Parameters/TestRpc.TestCallWithChainCertAndChainCA/SSL_TCP, where GetParam() = (true, false)
1 FAILED TEST