Parameters/TestRpc.TestCallWithChainCertAndRootCA/SSL_TCP: /data0/somelongdirectorytoavoidrpathissues/src/kudu/src/kudu/rpc/rpc-test.cc:303: Failure
Failed
Bad status: Runtime error: could not verify certificate chain (error with cert: subject=CN = localhost, ST = sadfjas, C = AS, emailAddress = sdflkdsajf, O = lskdfjlsad, OU = sldfkja, issuer=C = AS, ST = ASDfkjdhf, L = lskdjf, O = saldfja, OU = skdjf, CN = localhost, emailAddress = sadjflkadsj): : certificate has expired
Google Test trace:
/data0/somelongdirectorytoavoidrpathissues/src/kudu/src/kudu/rpc/rpc-test.cc:300: Connecting to 0.0.0.0:33389
I20260928 11:43:38.495038 1563 test_util.cc:175] -----------------------------------------------
I20260928 11:43:38.495219 1563 test_util.cc:176] Had fatal failures, leaving test files at /tmp/dist-test-tasky3n73b/test-tmp/rpc-test.1.Parameters_TestRpc.TestCallWithChainCertAndRootCA_SSL_TCP.1790595817109482-1563-0
Note: This is test shard 2 of 8.
[==========] Running 21 tests from 2 test suites.
[----------] Global test environment set-up.
[----------] 1 test from TestRpc
[ RUN ] TestRpc.TestMethodsByName
[ OK ] TestRpc.TestMethodsByName (6 ms)
[----------] 1 test from TestRpc (6 ms total)
[----------] 20 tests from Parameters/TestRpc
[ RUN ] Parameters/TestRpc.TestAcceptorPoolStartStop/SSL_TCP
WARNING: Logging before InitGoogleLogging() is written to STDERR
I20260928 11:43:37.213982 1578 acceptor_pool.cc:254] collecting diagnostics on the listening RPC socket 0.0.0.0:44401 every 8 connection(s)
I20260928 11:43:37.215323 1579 acceptor_pool.cc:254] collecting diagnostics on the listening RPC socket 0.0.0.0:44401 every 8 connection(s)
I20260928 11:43:38.273869 1590 acceptor_pool.cc:254] collecting diagnostics on the listening RPC socket 0.0.0.0:45269 every 8 connection(s)
I20260928 11:43:38.275173 1591 acceptor_pool.cc:254] collecting diagnostics on the listening RPC socket 0.0.0.0:45269 every 8 connection(s)
I20260928 11:43:38.297840 1601 acceptor_pool.cc:254] collecting diagnostics on the listening RPC socket 0.0.0.0:34545 every 8 connection(s)
I20260928 11:43:38.299078 1602 acceptor_pool.cc:254] collecting diagnostics on the listening RPC socket 0.0.0.0:34545 every 8 connection(s)
I20260928 11:43:38.314494 1612 acceptor_pool.cc:254] collecting diagnostics on the listening RPC socket 0.0.0.0:45169 every 8 connection(s)
I20260928 11:43:38.315150 1613 acceptor_pool.cc:254] collecting diagnostics on the listening RPC socket 0.0.0.0:45169 every 8 connection(s)
I20260928 11:43:38.343583 1623 acceptor_pool.cc:254] collecting diagnostics on the listening RPC socket 0.0.0.0:40729 every 8 connection(s)
I20260928 11:43:38.344300 1624 acceptor_pool.cc:254] collecting diagnostics on the listening RPC socket 0.0.0.0:40729 every 8 connection(s)
[ OK ] Parameters/TestRpc.TestAcceptorPoolStartStop/SSL_TCP (1181 ms)
[ RUN ] Parameters/TestRpc.TestCall/SSL_TCP
I20260928 11:43:38.370991 1636 acceptor_pool.cc:254] collecting diagnostics on the listening RPC socket 0.0.0.0:33791 every 8 connection(s)
I20260928 11:43:38.372416 1637 acceptor_pool.cc:254] collecting diagnostics on the listening RPC socket 0.0.0.0:33791 every 8 connection(s)
I20260928 11:43:38.376863 1563 rpc-test.cc:234] Connecting to 0.0.0.0:33791
[ OK ] Parameters/TestRpc.TestCall/SSL_TCP (105 ms)
[ RUN ] Parameters/TestRpc.TestCallWithChainCertAndRootCA/SSL_TCP
I20260928 11:43:38.475893 1661 acceptor_pool.cc:254] collecting diagnostics on the listening RPC socket 0.0.0.0:33389 every 8 connection(s)
I20260928 11:43:38.476619 1662 acceptor_pool.cc:254] collecting diagnostics on the listening RPC socket 0.0.0.0:33389 every 8 connection(s)
/data0/somelongdirectorytoavoidrpathissues/src/kudu/src/kudu/rpc/rpc-test.cc:303: Failure
Failed
Bad status: Runtime error: could not verify certificate chain (error with cert: subject=CN = localhost, ST = sadfjas, C = AS, emailAddress = sdflkdsajf, O = lskdfjlsad, OU = sldfkja, issuer=C = AS, ST = ASDfkjdhf, L = lskdjf, O = saldfja, OU = skdjf, CN = localhost, emailAddress = sadjflkadsj): : certificate has expired
Google Test trace:
/data0/somelongdirectorytoavoidrpathissues/src/kudu/src/kudu/rpc/rpc-test.cc:300: Connecting to 0.0.0.0:33389
I20260928 11:43:38.495038 1563 test_util.cc:175] -----------------------------------------------
I20260928 11:43:38.495219 1563 test_util.cc:176] Had fatal failures, leaving test files at /tmp/dist-test-tasky3n73b/test-tmp/rpc-test.1.Parameters_TestRpc.TestCallWithChainCertAndRootCA_SSL_TCP.1790595817109482-1563-0
[ FAILED ] Parameters/TestRpc.TestCallWithChainCertAndRootCA/SSL_TCP, where GetParam() = (true, false) (41 ms)
[ RUN ] Parameters/TestRpc.TestCallWithBadPasswordProtectedKey/SSL_TCP
[ OK ] Parameters/TestRpc.TestCallWithBadPasswordProtectedKey/SSL_TCP (28 ms)
[ RUN ] Parameters/TestRpc.TestInvalidMethodCall/SSL_TCP
I20260928 11:43:38.550261 1698 acceptor_pool.cc:254] collecting diagnostics on the listening RPC socket 0.0.0.0:33265 every 8 connection(s)
I20260928 11:43:38.551004 1699 acceptor_pool.cc:254] collecting diagnostics on the listening RPC socket 0.0.0.0:33265 every 8 connection(s)
I20260928 11:43:38.554230 1563 rpc-test.cc:406] Connecting to 0.0.0.0:33265
[ OK ] Parameters/TestRpc.TestInvalidMethodCall/SSL_TCP (82 ms)
[ RUN ] Parameters/TestRpc.TestHighFDs/SSL_TCP
I20260928 11:43:38.812137 1723 acceptor_pool.cc:254] collecting diagnostics on the listening RPC socket 0.0.0.0:33171 every 8 connection(s)
I20260928 11:43:38.812795 1724 acceptor_pool.cc:254] collecting diagnostics on the listening RPC socket 0.0.0.0:33171 every 8 connection(s)
[ OK ] Parameters/TestRpc.TestHighFDs/SSL_TCP (257 ms)
[ RUN ] Parameters/TestRpc.TestConnectionAlwaysKeepalive/SSL_TCP
I20260928 11:43:38.877791 1746 acceptor_pool.cc:254] collecting diagnostics on the listening RPC socket 0.0.0.0:39655 every 8 connection(s)
I20260928 11:43:38.878475 1747 acceptor_pool.cc:254] collecting diagnostics on the listening RPC socket 0.0.0.0:39655 every 8 connection(s)
I20260928 11:43:38.881451 1563 rpc-test.cc:532] Connecting to 0.0.0.0:39655
[ OK ] Parameters/TestRpc.TestConnectionAlwaysKeepalive/SSL_TCP (3049 ms)
[ RUN ] Parameters/TestRpc.TestReopenOutboundConnections/SSL_TCP
I20260928 11:43:41.935442 1769 acceptor_pool.cc:254] collecting diagnostics on the listening RPC socket 0.0.0.0:34419 every 8 connection(s)
I20260928 11:43:41.936132 1770 acceptor_pool.cc:254] collecting diagnostics on the listening RPC socket 0.0.0.0:34419 every 8 connection(s)
I20260928 11:43:41.939129 1563 rpc-test.cc:658] Connecting to 0.0.0.0:34419
[ OK ] Parameters/TestRpc.TestReopenOutboundConnections/SSL_TCP (385 ms)
[ RUN ] Parameters/TestRpc.TestConnectionNetworkPlane/SSL_TCP
I20260928 11:43:42.329360 1792 acceptor_pool.cc:254] collecting diagnostics on the listening RPC socket 0.0.0.0:42727 every 8 connection(s)
I20260928 11:43:42.329964 1793 acceptor_pool.cc:254] collecting diagnostics on the listening RPC socket 0.0.0.0:42727 every 8 connection(s)
I20260928 11:43:42.332854 1563 rpc-test.cc:772] Connecting to 0.0.0.0:42727
[ OK ] Parameters/TestRpc.TestConnectionNetworkPlane/SSL_TCP (74 ms)
[ RUN ] Parameters/TestRpc.TestTCPKeepalive/SSL_TCP
I20260928 11:43:42.389050 1817 acceptor_pool.cc:254] collecting diagnostics on the listening RPC socket 0.0.0.0:38729 every 8 connection(s)
I20260928 11:43:42.389717 1818 acceptor_pool.cc:254] collecting diagnostics on the listening RPC socket 0.0.0.0:38729 every 8 connection(s)
I20260928 11:43:42.417821 1821 rpc-test-base.h:222] got call: sleep_micros: 8000000 deferred: true
I20260928 11:43:50.421821 1821 rpcz_store.cc:275] Call kudu.rpc.GenericCalculatorService.Sleep from 127.0.0.1:42842 (request call id 0) took 8004 ms. Trace:
I20260928 11:43:50.422233 1821 rpcz_store.cc:276] 0928 11:43:42.417567 (+ 0us) service_pool.cc:170] Inserting onto call queue
0928 11:43:42.417671 (+ 104us) service_pool.cc:227] Handling call
0928 11:43:50.421656 (+8003985us) inbound_call.cc:173] Queueing success response
Metrics: {}
[ OK ] Parameters/TestRpc.TestTCPKeepalive/SSL_TCP (8063 ms)
[ RUN ] Parameters/TestRpc.TestMaxSmallSidecars/SSL_TCP
I20260928 11:43:50.470484 1843 acceptor_pool.cc:254] collecting diagnostics on the listening RPC socket 0.0.0.0:45097 every 8 connection(s)
I20260928 11:43:50.471206 1844 acceptor_pool.cc:254] collecting diagnostics on the listening RPC socket 0.0.0.0:45097 every 8 connection(s)
[ OK ] Parameters/TestRpc.TestMaxSmallSidecars/SSL_TCP (204 ms)
[ RUN ] Parameters/TestRpc.TestCallTimeout/SSL_TCP
I20260928 11:43:50.671401 1868 acceptor_pool.cc:254] collecting diagnostics on the listening RPC socket 0.0.0.0:44235 every 8 connection(s)
I20260928 11:43:50.672130 1869 acceptor_pool.cc:254] collecting diagnostics on the listening RPC socket 0.0.0.0:44235 every 8 connection(s)
I20260928 11:43:50.693723 1563 rpc-test-base.h:595] status: Timed out: connection negotiation to 0.0.0.0:44235 for RPC Sleep timed out after 0.000s (ON_OUTBOUND_QUEUE), seconds elapsed: 0.00230861
I20260928 11:43:50.700681 1872 rpc-test-base.h:222] got call: sleep_micros: 700000
I20260928 11:43:50.895319 1563 rpc-test-base.h:595] status: Timed out: Sleep RPC to 0.0.0.0:44235 timed out after 0.200s (SENT), seconds elapsed: 0.201255
I20260928 11:43:50.896786 1871 rpc-test-base.h:222] got call: sleep_micros: 2000000
W20260928 11:43:51.401317 1872 rpcz_store.cc:267] Call kudu.rpc.GenericCalculatorService.Sleep from 127.0.0.1:45886 (request call id 1) took 700 ms (client timeout 200 ms). Trace:
W20260928 11:43:51.401643 1872 rpcz_store.cc:269] 0928 11:43:50.700513 (+ 0us) service_pool.cc:170] Inserting onto call queue
0928 11:43:50.700622 (+ 109us) service_pool.cc:227] Handling call
0928 11:43:51.401250 (+700628us) inbound_call.cc:173] Queueing success response
Metrics: {}
I20260928 11:43:52.397198 1563 rpc-test-base.h:595] status: Timed out: Sleep RPC to 0.0.0.0:44235 timed out after 1.500s (SENT), seconds elapsed: 1.50154
W20260928 11:43:52.897300 1871 rpcz_store.cc:267] Call kudu.rpc.GenericCalculatorService.Sleep from 127.0.0.1:45886 (request call id 2) took 2000 ms (client timeout 1500 ms). Trace:
W20260928 11:43:52.897607 1871 rpcz_store.cc:269] 0928 11:43:50.896511 (+ 0us) service_pool.cc:170] Inserting onto call queue
0928 11:43:50.896635 (+ 124us) service_pool.cc:227] Handling call
0928 11:43:52.897246 (+2000611us) inbound_call.cc:173] Queueing success response
Metrics: {}
W20260928 11:43:52.898121 1866 connection.cc:441] server connection from 127.0.0.1:45886 torn down before Call kudu.rpc.GenericCalculatorService.Sleep from 127.0.0.1:45886 (request call id 2) could send its response
[ OK ] Parameters/TestRpc.TestCallTimeout/SSL_TCP (2261 ms)
[ RUN ] Parameters/TestRpc.TestServerShutsDown/SSL_TCP
I20260928 11:43:52.904605 1563 rpc-test.cc:1125] Connecting to 0.0.0.0:43657
W20260928 11:43:52.913837 1885 negotiation.cc:337] Failed RPC negotiation. Trace:
0928 11:43:52.912322 (+ 0us) reactor.cc:625] Submitting negotiation task for client connection to 0.0.0.0:43657 (local address 127.0.0.1:59412)
0928 11:43:52.912767 (+ 445us) negotiation.cc:107] Waiting for socket to connect
0928 11:43:52.912797 (+ 30us) client_negotiation.cc:174] Beginning negotiation
0928 11:43:52.913016 (+ 219us) client_negotiation.cc:252] Sending NEGOTIATE NegotiatePB request
0928 11:43:52.913226 (+ 210us) negotiation.cc:327] Negotiation complete: Network error: Client connection negotiation failed: client connection to 0.0.0.0:43657: BlockingWrite error: write error: Broken pipe (error 32)
Metrics: {"client-negotiator.queue_time_us":98}
[ OK ] Parameters/TestRpc.TestServerShutsDown/SSL_TCP (14 ms)
[ RUN ] Parameters/TestRpc.TimedOutOnResponseMetric/SSL_TCP
I20260928 11:43:52.936579 1902 acceptor_pool.cc:254] collecting diagnostics on the listening RPC socket 0.0.0.0:34203 every 8 connection(s)
I20260928 11:43:52.937256 1903 acceptor_pool.cc:254] collecting diagnostics on the listening RPC socket 0.0.0.0:34203 every 8 connection(s)
W20260928 11:43:53.172771 1906 rpcz_store.cc:267] Call kudu.rpc_test.CalculatorService.Sleep from 127.0.0.1:55940 (request call id 3) took 50 ms (client timeout 25 ms). Trace:
W20260928 11:43:53.173079 1906 rpcz_store.cc:269] 0928 11:43:53.122177 (+ 0us) service_pool.cc:170] Inserting onto call queue
0928 11:43:53.122302 (+ 125us) service_pool.cc:227] Handling call
0928 11:43:53.172690 (+ 50388us) inbound_call.cc:173] Queueing success response
Related trace 'test_child':
Metrics: {"test_sleep_us":50000,"child_traces":[["test_child",{"related_trace_metric":1}]]}
W20260928 11:43:53.232072 1906 rpcz_store.cc:267] Call kudu.rpc_test.CalculatorService.Sleep from 127.0.0.1:55940 (request call id 4) took 50 ms (client timeout 50 ms). Trace:
W20260928 11:43:53.232349 1906 rpcz_store.cc:269] 0928 11:43:53.181542 (+ 0us) service_pool.cc:170] Inserting onto call queue
0928 11:43:53.181649 (+ 107us) service_pool.cc:227] Handling call
0928 11:43:53.232007 (+ 50358us) inbound_call.cc:173] Queueing success response
Related trace 'test_child':
Metrics: {"test_sleep_us":50000,"child_traces":[["test_child",{"related_trace_metric":1}]]}
[ OK ] Parameters/TestRpc.TimedOutOnResponseMetric/SSL_TCP (323 ms)
[ RUN ] Parameters/TestRpc.AcceptorDispatchingTimesMetric/SSL_TCP
I20260928 11:43:53.251773 1927 acceptor_pool.cc:254] collecting diagnostics on the listening RPC socket 0.0.0.0:43517 every 8 connection(s)
I20260928 11:43:53.252408 1928 acceptor_pool.cc:254] collecting diagnostics on the listening RPC socket 0.0.0.0:43517 every 8 connection(s)
W20260928 11:43:53.256814 1923 negotiation.cc:337] Failed RPC negotiation. Trace:
0928 11:43:53.255698 (+ 0us) reactor.cc:625] Submitting negotiation task for server connection from 127.0.0.1:43282 (local address 127.0.0.1:43517)
0928 11:43:53.256131 (+ 433us) server_negotiation.cc:206] Beginning negotiation
0928 11:43:53.256150 (+ 19us) server_negotiation.cc:399] Waiting for connection header
0928 11:43:53.256372 (+ 222us) negotiation.cc:327] Negotiation complete: Network error: Server connection negotiation failed: server connection from 127.0.0.1:43282: BlockingRecv error: recv got EOF from 127.0.0.1:43282 (error 108)
Metrics: {"server-negotiator.queue_time_us":94}
[ OK ] Parameters/TestRpc.AcceptorDispatchingTimesMetric/SSL_TCP (20 ms)
[ RUN ] Parameters/TestRpc.TestRpcCallbackDestroysMessenger/SSL_TCP
[ OK ] Parameters/TestRpc.TestRpcCallbackDestroysMessenger/SSL_TCP (14 ms)
[ RUN ] Parameters/TestRpc.TestApplicationFeatureFlag/SSL_TCP
I20260928 11:43:53.291357 1952 acceptor_pool.cc:254] collecting diagnostics on the listening RPC socket 0.0.0.0:35131 every 8 connection(s)
I20260928 11:43:53.292075 1953 acceptor_pool.cc:254] collecting diagnostics on the listening RPC socket 0.0.0.0:35131 every 8 connection(s)
W20260928 11:43:53.335793 1951 messenger.cc:357] Unable to handle RPC call: Not implemented: call requires unsupported application feature flags: 99
[ OK ] Parameters/TestRpc.TestApplicationFeatureFlag/SSL_TCP (66 ms)
[ RUN ] Parameters/TestRpc.TestCancellation/SSL_TCP
I20260928 11:43:53.367197 1977 acceptor_pool.cc:254] collecting diagnostics on the listening RPC socket 0.0.0.0:37429 every 8 connection(s)
I20260928 11:43:53.367942 1978 acceptor_pool.cc:254] collecting diagnostics on the listening RPC socket 0.0.0.0:37429 every 8 connection(s)
I20260928 11:43:53.371062 1563 rpc-test.cc:1648] Connecting to 0.0.0.0:37429
I20260928 11:43:53.474272 1563 rpc-test-base.h:595] status: Aborted: Sleep RPC to 0.0.0.0:37429 is cancelled in state READY, seconds elapsed: 0.000312402
I20260928 11:43:53.608526 1563 rpc-test-base.h:595] status: Aborted: Sleep RPC to 0.0.0.0:37429 is cancelled in state SENT, seconds elapsed: 0.00109754
I20260928 11:43:53.649574 1980 rpc-test-base.h:222] got call: sleep_micros: 510000
I20260928 11:43:53.773506 1563 rpc-test-base.h:595] status: Aborted: Sleep RPC to 0.0.0.0:37429 is cancelled in state SENT, seconds elapsed: 0.000849393
I20260928 11:43:53.809571 1979 rpc-test-base.h:222] got call: sleep_micros: 510000
I20260928 11:43:53.928891 1563 rpc-test-base.h:595] status: Aborted: Sleep RPC to 0.0.0.0:37429 is cancelled in state SENT, seconds elapsed: 0.000799979
W20260928 11:43:53.965713 1981 rpcz_store.cc:267] Call kudu.rpc.GenericCalculatorService.Sleep from 127.0.0.1:37226 (request call id 11) took 14 ms (client timeout 10 ms). Trace:
W20260928 11:43:53.966025 1981 rpcz_store.cc:269] 0928 11:43:53.951179 (+ 0us) service_pool.cc:170] Inserting onto call queue
0928 11:43:53.965434 (+ 14255us) service_pool.cc:214] Skipping call since client already timed out
0928 11:43:53.965538 (+ 104us) inbound_call.cc:173] Queueing failure response
Metrics: {}
I20260928 11:43:53.966511 1981 rpc-test-base.h:222] got call: sleep_micros: 1500000
W20260928 11:43:54.160220 1980 rpcz_store.cc:267] Call kudu.rpc.GenericCalculatorService.Sleep from 127.0.0.1:37226 (request call id 3) took 510 ms (client timeout 10 ms). Trace:
W20260928 11:43:54.160630 1980 rpcz_store.cc:269] 0928 11:43:53.649423 (+ 0us) service_pool.cc:170] Inserting onto call queue
0928 11:43:53.649517 (+ 94us) service_pool.cc:227] Handling call
0928 11:43:54.160164 (+510647us) inbound_call.cc:173] Queueing success response
Metrics: {}
W20260928 11:43:54.320312 1979 rpcz_store.cc:267] Call kudu.rpc.GenericCalculatorService.Sleep from 127.0.0.1:37226 (request call id 7) took 511 ms (client timeout 10 ms). Trace:
W20260928 11:43:54.320654 1979 rpcz_store.cc:269] 0928 11:43:53.809346 (+ 0us) service_pool.cc:170] Inserting onto call queue
0928 11:43:53.809494 (+ 148us) service_pool.cc:227] Handling call
0928 11:43:54.320250 (+510756us) inbound_call.cc:173] Queueing success response
Metrics: {}
I20260928 11:43:54.930881 1563 rpc-test-base.h:595] status: Timed out: Sleep RPC to 0.0.0.0:37429 timed out after 1.000s (SENT), seconds elapsed: 1.00164
I20260928 11:43:54.932140 1979 rpc-test-base.h:222] got call: sleep_micros: 1500000
W20260928 11:43:55.466952 1981 rpcz_store.cc:267] Call kudu.rpc.GenericCalculatorService.Sleep from 127.0.0.1:37226 (request call id 12) took 1515 ms (client timeout 1000 ms). Trace:
W20260928 11:43:55.467257 1981 rpcz_store.cc:269] 0928 11:43:53.951526 (+ 0us) service_pool.cc:170] Inserting onto call queue
0928 11:43:53.966483 (+ 14957us) service_pool.cc:227] Handling call
0928 11:43:55.466899 (+1500416us) inbound_call.cc:173] Queueing success response
Metrics: {}
I20260928 11:43:55.932232 1563 rpc-test-base.h:595] status: Timed out: Sleep RPC to 0.0.0.0:37429 timed out after 1.000s (SENT), seconds elapsed: 1.00103
W20260928 11:43:55.933532 1976 messenger.cc:357] Unable to handle RPC call: Not implemented: call requires unsupported application feature flags: 99, 1
W20260928 11:43:55.934891 1976 messenger.cc:357] Unable to handle RPC call: Not implemented: call requires unsupported application feature flags: 99, 1
W20260928 11:43:56.432662 1979 rpcz_store.cc:267] Call kudu.rpc.GenericCalculatorService.Sleep from 127.0.0.1:37226 (request call id 13) took 1500 ms (client timeout 1000 ms). Trace:
W20260928 11:43:56.432996 1979 rpcz_store.cc:269] 0928 11:43:54.931958 (+ 0us) service_pool.cc:170] Inserting onto call queue
0928 11:43:54.932089 (+ 131us) service_pool.cc:227] Handling call
0928 11:43:56.432606 (+1500517us) inbound_call.cc:173] Queueing success response
Metrics: {}
W20260928 11:43:56.433557 1976 connection.cc:441] server connection from 127.0.0.1:37226 torn down before Call kudu.rpc.GenericCalculatorService.Sleep from 127.0.0.1:37226 (request call id 13) could send its response
[ OK ] Parameters/TestRpc.TestCancellation/SSL_TCP (3095 ms)
[ RUN ] Parameters/TestRpc.TestCancellationMultiThreads/SSL_TCP
I20260928 11:43:56.467854 2002 acceptor_pool.cc:254] collecting diagnostics on the listening RPC socket 0.0.0.0:39659 every 8 connection(s)
I20260928 11:43:56.468547 2003 acceptor_pool.cc:254] collecting diagnostics on the listening RPC socket 0.0.0.0:39659 every 8 connection(s)
I20260928 11:43:56.471486 1563 rpc-test.cc:1808] Connecting to 0.0.0.0:39659
I20260928 11:43:56.603229 2016 test_util.cc:268] Using random seed: -1798902981
I20260928 11:43:56.604363 2017 test_util.cc:268] Using random seed: -1798901839
I20260928 11:43:56.605713 2018 test_util.cc:268] Using random seed: -1798900490
I20260928 11:43:56.607071 2019 test_util.cc:268] Using random seed: -1798899152
I20260928 11:43:56.608664 2020 test_util.cc:268] Using random seed: -1798897692
I20260928 11:43:56.609954 2021 test_util.cc:268] Using random seed: -1798896382
I20260928 11:43:56.611333 2022 test_util.cc:268] Using random seed: -1798894998
I20260928 11:43:56.612859 2023 test_util.cc:268] Using random seed: -1798893489
I20260928 11:43:56.614321 2024 test_util.cc:268] Using random seed: -1798892016
I20260928 11:43:56.615653 2025 test_util.cc:268] Using random seed: -1798890681
I20260928 11:43:56.617090 2026 test_util.cc:268] Using random seed: -1798889247
I20260928 11:43:56.618423 2027 test_util.cc:268] Using random seed: -1798887957
I20260928 11:43:56.619980 2028 test_util.cc:268] Using random seed: -1798886375
I20260928 11:43:56.622073 2029 test_util.cc:268] Using random seed: -1798884352
I20260928 11:43:56.624462 2030 test_util.cc:268] Using random seed: -1798881899
I20260928 11:43:56.626096 2031 test_util.cc:268] Using random seed: -1798880288
I20260928 11:43:56.627703 2032 test_util.cc:268] Using random seed: -1798878649
I20260928 11:43:56.629272 2033 test_util.cc:268] Using random seed: -1798877021
I20260928 11:43:56.630472 2034 test_util.cc:268] Using random seed: -1798875822
I20260928 11:43:56.631824 2035 test_util.cc:268] Using random seed: -1798874466
I20260928 11:43:56.633353 2036 test_util.cc:268] Using random seed: -1798872979
I20260928 11:43:56.634927 2037 test_util.cc:268] Using random seed: -1798871448
I20260928 11:43:56.636431 2038 test_util.cc:268] Using random seed: -1798869894
I20260928 11:43:56.638363 2039 test_util.cc:268] Using random seed: -1798868012
I20260928 11:43:56.639952 2040 test_util.cc:268] Using random seed: -1798866409
I20260928 11:43:56.641530 2041 test_util.cc:268] Using random seed: -1798864822
I20260928 11:43:56.643069 2042 test_util.cc:268] Using random seed: -1798863297
I20260928 11:43:56.644972 2043 test_util.cc:268] Using random seed: -1798861363
I20260928 11:43:56.646778 2044 test_util.cc:268] Using random seed: -1798859570
I20260928 11:43:56.648330 2045 test_util.cc:268] Using random seed: -1798857999
[ OK ] Parameters/TestRpc.TestCancellationMultiThreads/SSL_TCP (17146 ms)
[ RUN ] Parameters/TestRpc.TestCallId/SSL_TCP
I20260928 11:44:13.623575 2059 acceptor_pool.cc:254] collecting diagnostics on the listening RPC socket 0.0.0.0:33811 every 8 connection(s)
I20260928 11:44:13.624351 2060 acceptor_pool.cc:254] collecting diagnostics on the listening RPC socket 0.0.0.0:33811 every 8 connection(s)
[ OK ] Parameters/TestRpc.TestCallId/SSL_TCP (93 ms)
[----------] 20 tests from Parameters/TestRpc (36512 ms total)
[----------] Global test environment tear-down
[==========] 21 tests from 2 test suites ran. (36520 ms total)
[ PASSED ] 20 tests.
[ FAILED ] 1 test, listed below:
[ FAILED ] Parameters/TestRpc.TestCallWithChainCertAndRootCA/SSL_TCP, where GetParam() = (true, false)
1 FAILED TEST