Diagnosed failure

Parameters/TestRpc.TestCallWithChainCertAndChainCA/SSL_UnixSocket: /data0/somelongdirectorytoavoidrpathissues/src/kudu/src/kudu/rpc/rpc-test.cc:270: Failure
Failed
Bad status: Runtime error: could not verify certificate chain (error with cert: subject=CN = localhost, ST = sadfjas, C = AS, emailAddress = sdflkdsajf, O = lskdfjlsad, OU = sldfkja, issuer=C = AS, ST = ASDfkjdhf, L = lskdjf, O = saldfja, OU = skdjf, CN = localhost, emailAddress = sadjflkadsj): : certificate has expired
Google Test trace:
/data0/somelongdirectorytoavoidrpathissues/src/kudu/src/kudu/rpc/rpc-test.cc:267: Connecting to unix:/tmp/dist-test-taskSDp86n/test-tmp/rpc-test-820e00f713c5445ab5580dda7f70e316.sock
I20260929 18:30:33.765187   383 test_util.cc:175] -----------------------------------------------
I20260929 18:30:33.765246   383 test_util.cc:176] Had fatal failures, leaving test files at /tmp/dist-test-taskSDp86n/test-tmp/rpc-test.6.Parameters_TestRpc.TestCallWithChainCertAndChainCA_SSL_UnixSocket.1790706633693233-383-0

Full log

Note: This is test shard 7 of 8.
[==========] Running 21 tests from 2 test suites.
[----------] Global test environment set-up.
[----------] 20 tests from Parameters/TestRpc
[ RUN      ] Parameters/TestRpc.TestMessengerCreateDestroy/SSL_UnixSocket
WARNING: Logging before InitGoogleLogging() is written to STDERR
I20260929 18:30:33.716578   383 rpc-test.cc:169] started messenger TestCreateDestroy
[       OK ] Parameters/TestRpc.TestMessengerCreateDestroy/SSL_UnixSocket (18 ms)
[ RUN      ] Parameters/TestRpc.TestNegotiationDeadlock/SSL_UnixSocket
I20260929 18:30:33.737104   404 acceptor_pool.cc:254] collecting diagnostics on the listening RPC socket unix:/tmp/dist-test-taskSDp86n/test-tmp/rpc-test-d09dad76555d44dd8fdee5f4209b9234.sock every 8 connection(s)
I20260929 18:30:33.737104   403 acceptor_pool.cc:254] collecting diagnostics on the listening RPC socket unix:/tmp/dist-test-taskSDp86n/test-tmp/rpc-test-d09dad76555d44dd8fdee5f4209b9234.sock every 8 connection(s)
[       OK ] Parameters/TestRpc.TestNegotiationDeadlock/SSL_UnixSocket (29 ms)
[ RUN      ] Parameters/TestRpc.TestCallWithChainCertAndChainCA/SSL_UnixSocket
I20260929 18:30:33.759884   419 acceptor_pool.cc:254] collecting diagnostics on the listening RPC socket unix:/tmp/dist-test-taskSDp86n/test-tmp/rpc-test-820e00f713c5445ab5580dda7f70e316.sock every 8 connection(s)
I20260929 18:30:33.759920   420 acceptor_pool.cc:254] collecting diagnostics on the listening RPC socket unix:/tmp/dist-test-taskSDp86n/test-tmp/rpc-test-820e00f713c5445ab5580dda7f70e316.sock every 8 connection(s)
/data0/somelongdirectorytoavoidrpathissues/src/kudu/src/kudu/rpc/rpc-test.cc:270: Failure
Failed
Bad status: Runtime error: could not verify certificate chain (error with cert: subject=CN = localhost, ST = sadfjas, C = AS, emailAddress = sdflkdsajf, O = lskdfjlsad, OU = sldfkja, issuer=C = AS, ST = ASDfkjdhf, L = lskdjf, O = saldfja, OU = skdjf, CN = localhost, emailAddress = sadjflkadsj): : certificate has expired
Google Test trace:
/data0/somelongdirectorytoavoidrpathissues/src/kudu/src/kudu/rpc/rpc-test.cc:267: Connecting to unix:/tmp/dist-test-taskSDp86n/test-tmp/rpc-test-820e00f713c5445ab5580dda7f70e316.sock
I20260929 18:30:33.765187   383 test_util.cc:175] -----------------------------------------------
I20260929 18:30:33.765246   383 test_util.cc:176] Had fatal failures, leaving test files at /tmp/dist-test-taskSDp86n/test-tmp/rpc-test.6.Parameters_TestRpc.TestCallWithChainCertAndChainCA_SSL_UnixSocket.1790706633693233-383-0
[  FAILED  ] Parameters/TestRpc.TestCallWithChainCertAndChainCA/SSL_UnixSocket, where GetParam() = (true, true) (17 ms)
[ RUN      ] Parameters/TestRpc.TestCallWithPasswordProtectedKey/SSL_UnixSocket
I20260929 18:30:33.780993   444 acceptor_pool.cc:254] collecting diagnostics on the listening RPC socket unix:/tmp/dist-test-taskSDp86n/test-tmp/rpc-test-b59675f7e0654f27800bf38dbb7f14ce.sock every 8 connection(s)
I20260929 18:30:33.781026   445 acceptor_pool.cc:254] collecting diagnostics on the listening RPC socket unix:/tmp/dist-test-taskSDp86n/test-tmp/rpc-test-b59675f7e0654f27800bf38dbb7f14ce.sock every 8 connection(s)
W20260929 18:30:33.795222   441 connection.cc:196] Error closing socket: Network error: TlsSocket::Close: Broken pipe
[       OK ] Parameters/TestRpc.TestCallWithPasswordProtectedKey/SSL_UnixSocket (31 ms)
[ RUN      ] Parameters/TestRpc.TestCallToBadServer/SSL_UnixSocket
I20260929 18:30:33.831270   383 rpc-test.cc:394] Status: Network error: Client connection negotiation failed: client connection to 0.0.0.0:0: connect: Connection refused (error 111)
I20260929 18:30:33.831902   383 rpc-test.cc:394] Status: Network error: Client connection negotiation failed: client connection to 0.0.0.0:0: connect: Connection refused (error 111)
I20260929 18:30:33.832489   383 rpc-test.cc:394] Status: Network error: Client connection negotiation failed: client connection to 0.0.0.0:0: connect: Connection refused (error 111)
I20260929 18:30:33.832959   383 rpc-test.cc:394] Status: Network error: Client connection negotiation failed: client connection to 0.0.0.0:0: connect: Connection refused (error 111)
I20260929 18:30:33.833424   383 rpc-test.cc:394] Status: Network error: Client connection negotiation failed: client connection to 0.0.0.0:0: connect: Connection refused (error 111)
[       OK ] Parameters/TestRpc.TestCallToBadServer/SSL_UnixSocket (37 ms)
[ RUN      ] Parameters/TestRpc.TestWrongService/SSL_UnixSocket
I20260929 18:30:33.844667   480 acceptor_pool.cc:254] collecting diagnostics on the listening RPC socket unix:/tmp/dist-test-taskSDp86n/test-tmp/rpc-test-3d7022e40b5f449f8a4b0f3fd435be51.sock every 8 connection(s)
I20260929 18:30:33.844696   479 acceptor_pool.cc:254] collecting diagnostics on the listening RPC socket unix:/tmp/dist-test-taskSDp86n/test-tmp/rpc-test-3d7022e40b5f449f8a4b0f3fd435be51.sock every 8 connection(s)
I20260929 18:30:33.855484   476 messenger.cc:345] service WrongServiceName not registered on TestServer
[       OK ] Parameters/TestRpc.TestWrongService/SSL_UnixSocket (23 ms)
[ RUN      ] Parameters/TestRpc.TestConnectionKeepalive/SSL_UnixSocket
I20260929 18:30:33.868983   502 acceptor_pool.cc:254] collecting diagnostics on the listening RPC socket unix:/tmp/dist-test-taskSDp86n/test-tmp/rpc-test-0a6f43eda40e43ad883309270b889453.sock every 8 connection(s)
I20260929 18:30:33.869035   503 acceptor_pool.cc:254] collecting diagnostics on the listening RPC socket unix:/tmp/dist-test-taskSDp86n/test-tmp/rpc-test-0a6f43eda40e43ad883309270b889453.sock every 8 connection(s)
I20260929 18:30:33.869306   383 rpc-test.cc:488] Connecting to unix:/tmp/dist-test-taskSDp86n/test-tmp/rpc-test-0a6f43eda40e43ad883309270b889453.sock
W20260929 18:30:34.359825   515 connection.cc:196] Error closing socket: Network error: TlsSocket::Close: Broken pipe
[       OK ] Parameters/TestRpc.TestConnectionKeepalive/SSL_UnixSocket (1044 ms)
[ RUN      ] Parameters/TestRpc.TestClientConnectionMetrics/SSL_UnixSocket
I20260929 18:30:34.920542   527 acceptor_pool.cc:254] collecting diagnostics on the listening RPC socket unix:/tmp/dist-test-taskSDp86n/test-tmp/rpc-test-c72902216f184b49ac33d448cdde6d38.sock every 8 connection(s)
I20260929 18:30:34.920583   528 acceptor_pool.cc:254] collecting diagnostics on the listening RPC socket unix:/tmp/dist-test-taskSDp86n/test-tmp/rpc-test-c72902216f184b49ac33d448cdde6d38.sock every 8 connection(s)
I20260929 18:30:34.920907   383 rpc-test.cc:569] Connecting to unix:/tmp/dist-test-taskSDp86n/test-tmp/rpc-test-c72902216f184b49ac33d448cdde6d38.sock
W20260929 18:30:45.634972   524 connection.cc:196] Error closing socket: Network error: TlsSocket::Close: Broken pipe
[       OK ] Parameters/TestRpc.TestClientConnectionMetrics/SSL_UnixSocket (10733 ms)
[ RUN      ] Parameters/TestRpc.TestCredentialsPolicy/SSL_UnixSocket
I20260929 18:30:45.654629   550 acceptor_pool.cc:254] collecting diagnostics on the listening RPC socket unix:/tmp/dist-test-taskSDp86n/test-tmp/rpc-test-b4a8021096e44501a8da7f74286321da.sock every 8 connection(s)
I20260929 18:30:45.654664   551 acceptor_pool.cc:254] collecting diagnostics on the listening RPC socket unix:/tmp/dist-test-taskSDp86n/test-tmp/rpc-test-b4a8021096e44501a8da7f74286321da.sock every 8 connection(s)
I20260929 18:30:45.655000   383 rpc-test.cc:700] Connecting to unix:/tmp/dist-test-taskSDp86n/test-tmp/rpc-test-b4a8021096e44501a8da7f74286321da.sock
W20260929 18:30:45.690057   549 connection.cc:196] Error closing socket: Network error: TlsSocket::Close: Broken pipe
W20260929 18:30:45.694914   549 connection.cc:196] Error closing socket: Network error: TlsSocket::Close: Broken pipe
[       OK ] Parameters/TestRpc.TestCredentialsPolicy/SSL_UnixSocket (59 ms)
[ RUN      ] Parameters/TestRpc.TestCallLongerThanKeepalive/SSL_UnixSocket
I20260929 18:30:45.711848   575 acceptor_pool.cc:254] collecting diagnostics on the listening RPC socket unix:/tmp/dist-test-taskSDp86n/test-tmp/rpc-test-75fe76b5442348e390b4dbf1b8e2f8a7.sock every 8 connection(s)
I20260929 18:30:45.711882   576 acceptor_pool.cc:254] collecting diagnostics on the listening RPC socket unix:/tmp/dist-test-taskSDp86n/test-tmp/rpc-test-75fe76b5442348e390b4dbf1b8e2f8a7.sock every 8 connection(s)
I20260929 18:30:45.726111   579 rpc-test-base.h:222] got call: sleep_micros: 3000000 deferred: true
I20260929 18:30:48.727038   579 rpcz_store.cc:275] Call kudu.rpc.GenericCalculatorService.Sleep from unix:<unnamed> (request call id 0) took 3001 ms. Trace:
I20260929 18:30:48.727196   579 rpcz_store.cc:276] 0929 18:30:45.726030 (+     0us) service_pool.cc:170] Inserting onto call queue
0929 18:30:45.726092 (+    62us) service_pool.cc:227] Handling call
0929 18:30:48.727018 (+3000926us) inbound_call.cc:173] Queueing success response
Metrics: {}
W20260929 18:30:48.728973   572 connection.cc:196] Error closing socket: Network error: TlsSocket::Close: Broken pipe
[       OK ] Parameters/TestRpc.TestCallLongerThanKeepalive/SSL_UnixSocket (3034 ms)
[ RUN      ] Parameters/TestRpc.TestRpcSidecar/SSL_UnixSocket
I20260929 18:30:48.763759   600 acceptor_pool.cc:254] collecting diagnostics on the listening RPC socket unix:/tmp/dist-test-taskSDp86n/test-tmp/rpc-test-25c4abb32dc44e6f9be8fd98ab235c4f.sock every 8 connection(s)
I20260929 18:30:48.763772   601 acceptor_pool.cc:254] collecting diagnostics on the listening RPC socket unix:/tmp/dist-test-taskSDp86n/test-tmp/rpc-test-25c4abb32dc44e6f9be8fd98ab235c4f.sock every 8 connection(s)
W20260929 18:30:48.817282   597 connection.cc:196] Error closing socket: Network error: TlsSocket::Close: Broken pipe
[       OK ] Parameters/TestRpc.TestRpcSidecar/SSL_UnixSocket (88 ms)
[ RUN      ] Parameters/TestRpc.TestRpcSidecarLimits/SSL_UnixSocket
I20260929 18:30:50.554960   625 acceptor_pool.cc:254] collecting diagnostics on the listening RPC socket unix:/tmp/dist-test-taskSDp86n/test-tmp/rpc-test-4b0c55d6f4694182ba716dfc520791ae.sock every 8 connection(s)
I20260929 18:30:50.554991   626 acceptor_pool.cc:254] collecting diagnostics on the listening RPC socket unix:/tmp/dist-test-taskSDp86n/test-tmp/rpc-test-4b0c55d6f4694182ba716dfc520791ae.sock every 8 connection(s)
W20260929 18:30:50.580120   383 serialization.cc:72] Serialized kudu.rpc_test.PushStringsRequestPB (2147483654 bytes) is larger than the maximum configured RPC message size (52428800 bytes). Sending anyway, but peer may reject the data.
W20260929 18:30:50.583732   622 connection.cc:535] server connection from unix:<unnamed> recv error: Network error: RPC frame had a length of 2147483714, but we only support messages up to 52428800 bytes long.
W20260929 18:30:50.583810   622 connection.cc:158] shutting down server connection from unix:<unnamed> with pending inbound data: 4/2147483714 bytes received; last active 0 ns ago: status Network error: RPC frame had a length of 2147483714, but we only support messages up to 52428800 bytes long.
W20260929 18:30:50.584082   638 connection.cc:196] Error closing socket: Network error: TlsSocket::Close: Broken pipe
I20260929 18:30:50.596426   651 acceptor_pool.cc:254] collecting diagnostics on the listening RPC socket unix:/tmp/dist-test-taskSDp86n/test-tmp/rpc-test-4b0c55d6f4694182ba716dfc520791ae.sock every 8 connection(s)
I20260929 18:30:50.596472   650 acceptor_pool.cc:254] collecting diagnostics on the listening RPC socket unix:/tmp/dist-test-taskSDp86n/test-tmp/rpc-test-4b0c55d6f4694182ba716dfc520791ae.sock every 8 connection(s)
W20260929 18:30:55.426601   647 connection.cc:577] server connection from unix:<unnamed>: received bad data: 'Corruption: Invalid packet: message had a length of 2147483710, but we only support messages up to 2147483647 bytes
'
W20260929 18:30:55.427013   663 connection.cc:196] Error closing socket: Network error: TlsSocket::Close: Broken pipe
[       OK ] Parameters/TestRpc.TestRpcSidecarLimits/SSL_UnixSocket (6611 ms)
[ RUN      ] Parameters/TestRpc.TestCallTimeoutDoesntAffectNegotiation/SSL_UnixSocket
I20260929 18:30:55.450886   675 acceptor_pool.cc:254] collecting diagnostics on the listening RPC socket unix:/tmp/dist-test-taskSDp86n/test-tmp/rpc-test-527446a564034b6bb230183957771dd1.sock every 8 connection(s)
I20260929 18:30:55.450914   676 acceptor_pool.cc:254] collecting diagnostics on the listening RPC socket unix:/tmp/dist-test-taskSDp86n/test-tmp/rpc-test-527446a564034b6bb230183957771dd1.sock every 8 connection(s)
W20260929 18:30:55.473160   671 negotiation.cc:266] Injecting 500ms delay in negotiation
I20260929 18:30:55.523478   383 rpc-test-base.h:595] status: Timed out: connection negotiation to unix:/tmp/dist-test-taskSDp86n/test-tmp/rpc-test-527446a564034b6bb230183957771dd1.sock for RPC Sleep timed out after 0.050s (ON_OUTBOUND_QUEUE), seconds elapsed: 0.0507932
W20260929 18:30:55.978415   672 connection.cc:196] Error closing socket: Network error: TlsSocket::Close: Broken pipe
[       OK ] Parameters/TestRpc.TestCallTimeoutDoesntAffectNegotiation/SSL_UnixSocket (549 ms)
[ RUN      ] Parameters/TestRpc.TestRpcHandlerLatencyMetric/SSL_UnixSocket
I20260929 18:30:56.003701   700 acceptor_pool.cc:254] collecting diagnostics on the listening RPC socket unix:/tmp/dist-test-taskSDp86n/test-tmp/rpc-test-2f7caa917dcf4c63a83dbfec7d86b817.sock every 8 connection(s)
I20260929 18:30:56.003727   701 acceptor_pool.cc:254] collecting diagnostics on the listening RPC socket unix:/tmp/dist-test-taskSDp86n/test-tmp/rpc-test-2f7caa917dcf4c63a83dbfec7d86b817.sock every 8 connection(s)
I20260929 18:30:56.041244   383 rpc-test.cc:1236] Sleep() min lat: 20427
I20260929 18:30:56.041318   383 rpc-test.cc:1237] Sleep() mean lat: 20427
I20260929 18:30:56.041347   383 rpc-test.cc:1238] Sleep() max lat: 20427
I20260929 18:30:56.041361   383 rpc-test.cc:1239] Sleep() #calls: 1
W20260929 18:30:56.042222   697 connection.cc:196] Error closing socket: Network error: TlsSocket::Close: Broken pipe
[       OK ] Parameters/TestRpc.TestRpcHandlerLatencyMetric/SSL_UnixSocket (64 ms)
[ RUN      ] Parameters/TestRpc.TimedOutOnResponseMetricServiceQueue/SSL_UnixSocket
I20260929 18:30:56.061421   726 acceptor_pool.cc:254] collecting diagnostics on the listening RPC socket unix:/tmp/dist-test-taskSDp86n/test-tmp/rpc-test-eb364b41b063403c95146897be7396c1.sock every 8 connection(s)
I20260929 18:30:56.061452   727 acceptor_pool.cc:254] collecting diagnostics on the listening RPC socket unix:/tmp/dist-test-taskSDp86n/test-tmp/rpc-test-eb364b41b063403c95146897be7396c1.sock every 8 connection(s)
W20260929 18:30:56.111620   728 rpcz_store.cc:267] Call kudu.rpc_test.CalculatorService.Sleep from unix:<unnamed> (request call id 2) took 20 ms (client timeout 20 ms). Trace:
W20260929 18:30:56.111735   728 rpcz_store.cc:269] 0929 18:30:56.091230 (+     0us) service_pool.cc:170] Inserting onto call queue
0929 18:30:56.111577 (+ 20347us) service_pool.cc:214] Skipping call since client already timed out
0929 18:30:56.111605 (+    28us) inbound_call.cc:173] Queueing failure response
Metrics: {}
[       OK ] Parameters/TestRpc.TimedOutOnResponseMetricServiceQueue/SSL_UnixSocket (69 ms)
[ RUN      ] Parameters/TestRpc.RpcPendingConnectionsMetric/SSL_UnixSocket
I20260929 18:30:56.116106   749 acceptor_pool.cc:254] collecting diagnostics on the listening RPC socket 0.0.0.0:46281 every 8 connection(s)
I20260929 18:30:56.116115   750 acceptor_pool.cc:254] collecting diagnostics on the listening RPC socket 0.0.0.0:46281 every 8 connection(s)
W20260929 18:30:56.125808   745 negotiation.cc:337] Failed RPC negotiation. Trace:
0929 18:30:56.125156 (+     0us) reactor.cc:625] Submitting negotiation task for server connection from 127.0.0.1:55988 (local address 127.0.0.1:46281)
0929 18:30:56.125320 (+   164us) server_negotiation.cc:206] Beginning negotiation
0929 18:30:56.125327 (+     7us) server_negotiation.cc:399] Waiting for connection header
0929 18:30:56.125489 (+   162us) negotiation.cc:327] Negotiation complete: Network error: Server connection negotiation failed: server connection from 127.0.0.1:55988: BlockingRecv error: recv got EOF from 127.0.0.1:55988 (error 108)
Metrics: {"server-negotiator.queue_time_us":53}
[       OK ] Parameters/TestRpc.RpcPendingConnectionsMetric/SSL_UnixSocket (22 ms)
[ RUN      ] Parameters/TestRpc.TestRpcContextClientDeadline/SSL_UnixSocket
I20260929 18:30:56.176594   765 acceptor_pool.cc:254] collecting diagnostics on the listening RPC socket unix:/tmp/dist-test-taskSDp86n/test-tmp/rpc-test-3458e4e7699f4185848bdf5bded6267b.sock every 8 connection(s)
I20260929 18:30:56.176630   766 acceptor_pool.cc:254] collecting diagnostics on the listening RPC socket unix:/tmp/dist-test-taskSDp86n/test-tmp/rpc-test-3458e4e7699f4185848bdf5bded6267b.sock every 8 connection(s)
W20260929 18:30:56.216488   762 connection.cc:196] Error closing socket: Network error: TlsSocket::Close: Broken pipe
[       OK ] Parameters/TestRpc.TestRpcContextClientDeadline/SSL_UnixSocket (80 ms)
[ RUN      ] Parameters/TestRpc.TestApplicationFeatureFlagUnsupportedServer/SSL_UnixSocket
I20260929 18:30:56.227555   790 acceptor_pool.cc:254] collecting diagnostics on the listening RPC socket unix:/tmp/dist-test-taskSDp86n/test-tmp/rpc-test-9440df874ad445a2bfd5939016481c39.sock every 8 connection(s)
I20260929 18:30:56.227577   791 acceptor_pool.cc:254] collecting diagnostics on the listening RPC socket unix:/tmp/dist-test-taskSDp86n/test-tmp/rpc-test-9440df874ad445a2bfd5939016481c39.sock every 8 connection(s)
W20260929 18:30:56.243993   787 connection.cc:196] Error closing socket: Network error: TlsSocket::Close: Broken pipe
[       OK ] Parameters/TestRpc.TestApplicationFeatureFlagUnsupportedServer/SSL_UnixSocket (27 ms)
[ RUN      ] Parameters/TestRpc.TestCancellationAsync/SSL_UnixSocket
I20260929 18:30:56.255842   815 acceptor_pool.cc:254] collecting diagnostics on the listening RPC socket unix:/tmp/dist-test-taskSDp86n/test-tmp/rpc-test-291f6140adad409ebb75cefe9962f451.sock every 8 connection(s)
I20260929 18:30:56.255893   816 acceptor_pool.cc:254] collecting diagnostics on the listening RPC socket unix:/tmp/dist-test-taskSDp86n/test-tmp/rpc-test-291f6140adad409ebb75cefe9962f451.sock every 8 connection(s)
I20260929 18:30:56.256250   383 rpc-test.cc:1716] Connecting to unix:/tmp/dist-test-taskSDp86n/test-tmp/rpc-test-291f6140adad409ebb75cefe9962f451.sock
I20260929 18:30:56.273617   383 test_util.cc:268] Using random seed: 1646585039
I20260929 18:30:56.290568   819 rpc-test-base.h:240] got call: sleep_micros: 500 pattern: 4294967295 num_repetitions: 2097152 sidecar_idx: 0
I20260929 18:30:56.310545   818 rpc-test-base.h:240] got call: sleep_micros: 500 pattern: 4294967295 num_repetitions: 2097152 sidecar_idx: 0
I20260929 18:30:56.327996   819 rpc-test-base.h:240] got call: sleep_micros: 500 pattern: 4294967295 num_repetitions: 2097152 sidecar_idx: 0
I20260929 18:30:56.344563   818 rpc-test-base.h:240] got call: sleep_micros: 500 pattern: 4294967295 num_repetitions: 2097152 sidecar_idx: 0
I20260929 18:30:56.360513   819 rpc-test-base.h:240] got call: sleep_micros: 500 pattern: 4294967295 num_repetitions: 2097152 sidecar_idx: 0
I20260929 18:30:56.377130   818 rpc-test-base.h:240] got call: sleep_micros: 500 pattern: 4294967295 num_repetitions: 2097152 sidecar_idx: 0
I20260929 18:30:56.393054   819 rpc-test-base.h:240] got call: sleep_micros: 500 pattern: 4294967295 num_repetitions: 2097152 sidecar_idx: 0
I20260929 18:30:56.409154   818 rpc-test-base.h:240] got call: sleep_micros: 500 pattern: 4294967295 num_repetitions: 2097152 sidecar_idx: 0
W20260929 18:30:56.411069   812 connection.cc:196] Error closing socket: Network error: TlsSocket::Close: Broken pipe
W20260929 18:30:56.417002   812 connection.cc:441] server connection from unix:<unnamed> torn down before Call kudu.rpc.GenericCalculatorService.SleepWithSidecar from unix:<unnamed> (request call id 8) could send its response
W20260929 18:30:56.427310   812 connection.cc:441] server connection from unix:<unnamed> torn down before Call kudu.rpc.GenericCalculatorService.SleepWithSidecar from unix:<unnamed> (request call id 9) could send its response
[       OK ] Parameters/TestRpc.TestCancellationAsync/SSL_UnixSocket (183 ms)
[ RUN      ] Parameters/TestRpc.TestPerformanceBySocketType/SSL_UnixSocket
I20260929 18:30:56.447768   840 acceptor_pool.cc:254] collecting diagnostics on the listening RPC socket unix:/tmp/dist-test-taskSDp86n/test-tmp/rpc-test-73c41581eb714b30bf896122990f592a.sock every 8 connection(s)
I20260929 18:30:56.447820   841 acceptor_pool.cc:254] collecting diagnostics on the listening RPC socket unix:/tmp/dist-test-taskSDp86n/test-tmp/rpc-test-73c41581eb714b30bf896122990f592a.sock every 8 connection(s)
I20260929 18:30:56.448145   383 rpc-test.cc:1846] Connecting to unix:/tmp/dist-test-taskSDp86n/test-tmp/rpc-test-73c41581eb714b30bf896122990f592a.sock
I20260929 18:30:58.096504   383 rpc-test.cc:1859] Sending 1024MB via ssl-enabled unix socket: real 1.642s	user 1.953s	sys 1.009s
I20260929 18:30:59.714700   383 rpc-test.cc:1859] Sending 1024MB via ssl-enabled unix socket: real 1.618s	user 2.015s	sys 0.918s
I20260929 18:31:01.215588   383 rpc-test.cc:1859] Sending 1024MB via ssl-enabled unix socket: real 1.501s	user 1.742s	sys 0.973s
I20260929 18:31:02.738467   383 rpc-test.cc:1859] Sending 1024MB via ssl-enabled unix socket: real 1.523s	user 1.828s	sys 0.948s
I20260929 18:31:04.258613   383 rpc-test.cc:1859] Sending 1024MB via ssl-enabled unix socket: real 1.520s	user 1.869s	sys 0.899s
W20260929 18:31:04.259581   837 connection.cc:196] Error closing socket: Network error: TlsSocket::Close: Broken pipe
[       OK ] Parameters/TestRpc.TestPerformanceBySocketType/SSL_UnixSocket (7831 ms)
[----------] 20 tests from Parameters/TestRpc (30561 ms total)

[----------] 1 test from Parameters/TestRpcSocketTxRxQueue
[ RUN      ] Parameters/TestRpcSocketTxRxQueue.AcceptorRxQueueSizeMetric/0
I20260929 18:31:04.263130   865 acceptor_pool.cc:254] collecting diagnostics on the listening RPC socket 0.0.0.0:35355 every 1 connection(s)
I20260929 18:31:04.263216   866 acceptor_pool.cc:254] collecting diagnostics on the listening RPC socket 0.0.0.0:35355 every 1 connection(s)
W20260929 18:31:04.263960   861 negotiation.cc:337] Failed RPC negotiation. Trace:
0929 18:31:04.263737 (+     0us) reactor.cc:625] Submitting negotiation task for server connection from 127.0.0.1:33126 (local address 127.0.0.1:35355)
0929 18:31:04.263823 (+    86us) server_negotiation.cc:206] Beginning negotiation
0929 18:31:04.263827 (+     4us) server_negotiation.cc:399] Waiting for connection header
0929 18:31:04.263899 (+    72us) negotiation.cc:327] Negotiation complete: Network error: Server connection negotiation failed: server connection from 127.0.0.1:33126: BlockingRecv error: recv got EOF from 127.0.0.1:33126 (error 108)
Metrics: {"server-negotiator.queue_time_us":29}
[       OK ] Parameters/TestRpcSocketTxRxQueue.AcceptorRxQueueSizeMetric/0 (5 ms)
[----------] 1 test from Parameters/TestRpcSocketTxRxQueue (5 ms total)

[----------] Global test environment tear-down
[==========] 21 tests from 2 test suites ran. (30566 ms total)
[  PASSED  ] 20 tests.
[  FAILED  ] 1 test, listed below:
[  FAILED  ] Parameters/TestRpc.TestCallWithChainCertAndChainCA/SSL_UnixSocket, where GetParam() = (true, true)

 1 FAILED TEST