Diagnosed failure
Parameters/TestRpc.TestCallWithChainCertAndChainCA/SSL_UnixSocket: /data0/somelongdirectorytoavoidrpathissues/src/kudu/src/kudu/rpc/rpc-test.cc:270: Failure
Failed
Bad status: Runtime error: could not verify certificate chain (error with cert: subject=CN = localhost, ST = sadfjas, C = AS, emailAddress = sdflkdsajf, O = lskdfjlsad, OU = sldfkja, issuer=C = AS, ST = ASDfkjdhf, L = lskdjf, O = saldfja, OU = skdjf, CN = localhost, emailAddress = sadjflkadsj): : certificate has expired
Google Test trace:
/data0/somelongdirectorytoavoidrpathissues/src/kudu/src/kudu/rpc/rpc-test.cc:267: Connecting to unix:/tmp/dist-test-taskLlHFIC/test-tmp/rpc-test-61a0accc815f4d538c1fd7d0167d1691.sock
I20260926 22:01:20.880528 6960 test_util.cc:175] -----------------------------------------------
I20260926 22:01:20.880651 6960 test_util.cc:176] Had fatal failures, leaving test files at /tmp/dist-test-taskLlHFIC/test-tmp/rpc-test.6.Parameters_TestRpc.TestCallWithChainCertAndChainCA_SSL_UnixSocket.1790460080721953-6960-0
Full log
Note: This is test shard 7 of 8.
[==========] Running 21 tests from 2 test suites.
[----------] Global test environment set-up.
[----------] 20 tests from Parameters/TestRpc
[ RUN ] Parameters/TestRpc.TestMessengerCreateDestroy/SSL_UnixSocket
WARNING: Logging before InitGoogleLogging() is written to STDERR
I20260926 22:01:20.774384 6960 rpc-test.cc:169] started messenger TestCreateDestroy
[ OK ] Parameters/TestRpc.TestMessengerCreateDestroy/SSL_UnixSocket (33 ms)
[ RUN ] Parameters/TestRpc.TestNegotiationDeadlock/SSL_UnixSocket
I20260926 22:01:20.802496 6980 acceptor_pool.cc:254] collecting diagnostics on the listening RPC socket unix:/tmp/dist-test-taskLlHFIC/test-tmp/rpc-test-6b0cc69e69c24868a4955e0006374d77.sock every 8 connection(s)
I20260926 22:01:20.802717 6981 acceptor_pool.cc:254] collecting diagnostics on the listening RPC socket unix:/tmp/dist-test-taskLlHFIC/test-tmp/rpc-test-6b0cc69e69c24868a4955e0006374d77.sock every 8 connection(s)
[ OK ] Parameters/TestRpc.TestNegotiationDeadlock/SSL_UnixSocket (52 ms)
[ RUN ] Parameters/TestRpc.TestCallWithChainCertAndChainCA/SSL_UnixSocket
I20260926 22:01:20.867822 6996 acceptor_pool.cc:254] collecting diagnostics on the listening RPC socket unix:/tmp/dist-test-taskLlHFIC/test-tmp/rpc-test-61a0accc815f4d538c1fd7d0167d1691.sock every 8 connection(s)
I20260926 22:01:20.868264 6997 acceptor_pool.cc:254] collecting diagnostics on the listening RPC socket unix:/tmp/dist-test-taskLlHFIC/test-tmp/rpc-test-61a0accc815f4d538c1fd7d0167d1691.sock every 8 connection(s)
/data0/somelongdirectorytoavoidrpathissues/src/kudu/src/kudu/rpc/rpc-test.cc:270: Failure
Failed
Bad status: Runtime error: could not verify certificate chain (error with cert: subject=CN = localhost, ST = sadfjas, C = AS, emailAddress = sdflkdsajf, O = lskdfjlsad, OU = sldfkja, issuer=C = AS, ST = ASDfkjdhf, L = lskdjf, O = saldfja, OU = skdjf, CN = localhost, emailAddress = sadjflkadsj): : certificate has expired
Google Test trace:
/data0/somelongdirectorytoavoidrpathissues/src/kudu/src/kudu/rpc/rpc-test.cc:267: Connecting to unix:/tmp/dist-test-taskLlHFIC/test-tmp/rpc-test-61a0accc815f4d538c1fd7d0167d1691.sock
I20260926 22:01:20.880528 6960 test_util.cc:175] -----------------------------------------------
I20260926 22:01:20.880651 6960 test_util.cc:176] Had fatal failures, leaving test files at /tmp/dist-test-taskLlHFIC/test-tmp/rpc-test.6.Parameters_TestRpc.TestCallWithChainCertAndChainCA_SSL_UnixSocket.1790460080721953-6960-0
[ FAILED ] Parameters/TestRpc.TestCallWithChainCertAndChainCA/SSL_UnixSocket, where GetParam() = (true, true) (49 ms)
[ RUN ] Parameters/TestRpc.TestCallWithPasswordProtectedKey/SSL_UnixSocket
I20260926 22:01:20.908993 7021 acceptor_pool.cc:254] collecting diagnostics on the listening RPC socket unix:/tmp/dist-test-taskLlHFIC/test-tmp/rpc-test-526cc199fdeb47248542e557a83875ee.sock every 8 connection(s)
I20260926 22:01:20.909261 7022 acceptor_pool.cc:254] collecting diagnostics on the listening RPC socket unix:/tmp/dist-test-taskLlHFIC/test-tmp/rpc-test-526cc199fdeb47248542e557a83875ee.sock every 8 connection(s)
W20260926 22:01:20.941999 7018 connection.cc:196] Error closing socket: Network error: TlsSocket::Close: Broken pipe
[ OK ] Parameters/TestRpc.TestCallWithPasswordProtectedKey/SSL_UnixSocket (65 ms)
[ RUN ] Parameters/TestRpc.TestCallToBadServer/SSL_UnixSocket
I20260926 22:01:20.976033 6960 rpc-test.cc:394] Status: Network error: Client connection negotiation failed: client connection to 0.0.0.0:0: connect: Connection refused (error 111)
I20260926 22:01:20.977007 6960 rpc-test.cc:394] Status: Network error: Client connection negotiation failed: client connection to 0.0.0.0:0: connect: Connection refused (error 111)
I20260926 22:01:20.977861 6960 rpc-test.cc:394] Status: Network error: Client connection negotiation failed: client connection to 0.0.0.0:0: connect: Connection refused (error 111)
I20260926 22:01:20.978560 6960 rpc-test.cc:394] Status: Network error: Client connection negotiation failed: client connection to 0.0.0.0:0: connect: Connection refused (error 111)
I20260926 22:01:20.979384 6960 rpc-test.cc:394] Status: Network error: Client connection negotiation failed: client connection to 0.0.0.0:0: connect: Connection refused (error 111)
[ OK ] Parameters/TestRpc.TestCallToBadServer/SSL_UnixSocket (35 ms)
[ RUN ] Parameters/TestRpc.TestWrongService/SSL_UnixSocket
I20260926 22:01:20.998513 7056 acceptor_pool.cc:254] collecting diagnostics on the listening RPC socket unix:/tmp/dist-test-taskLlHFIC/test-tmp/rpc-test-878b7e4899eb46719ccf06d7f4e2eeaa.sock every 8 connection(s)
I20260926 22:01:20.998735 7057 acceptor_pool.cc:254] collecting diagnostics on the listening RPC socket unix:/tmp/dist-test-taskLlHFIC/test-tmp/rpc-test-878b7e4899eb46719ccf06d7f4e2eeaa.sock every 8 connection(s)
I20260926 22:01:21.032655 7053 messenger.cc:345] service WrongServiceName not registered on TestServer
[ OK ] Parameters/TestRpc.TestWrongService/SSL_UnixSocket (56 ms)
[ RUN ] Parameters/TestRpc.TestConnectionKeepalive/SSL_UnixSocket
I20260926 22:01:21.056738 7079 acceptor_pool.cc:254] collecting diagnostics on the listening RPC socket unix:/tmp/dist-test-taskLlHFIC/test-tmp/rpc-test-3ffa610d504a445e9ee1965830a74836.sock every 8 connection(s)
I20260926 22:01:21.057008 7080 acceptor_pool.cc:254] collecting diagnostics on the listening RPC socket unix:/tmp/dist-test-taskLlHFIC/test-tmp/rpc-test-3ffa610d504a445e9ee1965830a74836.sock every 8 connection(s)
I20260926 22:01:21.058015 6960 rpc-test.cc:488] Connecting to unix:/tmp/dist-test-taskLlHFIC/test-tmp/rpc-test-3ffa610d504a445e9ee1965830a74836.sock
W20260926 22:01:21.540583 7092 connection.cc:196] Error closing socket: Network error: TlsSocket::Close: Broken pipe
[ OK ] Parameters/TestRpc.TestConnectionKeepalive/SSL_UnixSocket (1050 ms)
[ RUN ] Parameters/TestRpc.TestClientConnectionMetrics/SSL_UnixSocket
I20260926 22:01:22.109128 7104 acceptor_pool.cc:254] collecting diagnostics on the listening RPC socket unix:/tmp/dist-test-taskLlHFIC/test-tmp/rpc-test-37dce578cd5e4419a33a2ba6685903ef.sock every 8 connection(s)
I20260926 22:01:22.109404 7105 acceptor_pool.cc:254] collecting diagnostics on the listening RPC socket unix:/tmp/dist-test-taskLlHFIC/test-tmp/rpc-test-37dce578cd5e4419a33a2ba6685903ef.sock every 8 connection(s)
I20260926 22:01:22.110365 6960 rpc-test.cc:569] Connecting to unix:/tmp/dist-test-taskLlHFIC/test-tmp/rpc-test-37dce578cd5e4419a33a2ba6685903ef.sock
W20260926 22:01:43.901358 7101 connection.cc:196] Error closing socket: Network error: TlsSocket::Close: Broken pipe
[ OK ] Parameters/TestRpc.TestClientConnectionMetrics/SSL_UnixSocket (21818 ms)
[ RUN ] Parameters/TestRpc.TestCredentialsPolicy/SSL_UnixSocket
I20260926 22:01:43.928958 7127 acceptor_pool.cc:254] collecting diagnostics on the listening RPC socket unix:/tmp/dist-test-taskLlHFIC/test-tmp/rpc-test-4f020ca73913407b81a4638cf65efce3.sock every 8 connection(s)
I20260926 22:01:43.929234 7128 acceptor_pool.cc:254] collecting diagnostics on the listening RPC socket unix:/tmp/dist-test-taskLlHFIC/test-tmp/rpc-test-4f020ca73913407b81a4638cf65efce3.sock every 8 connection(s)
I20260926 22:01:43.930264 6960 rpc-test.cc:700] Connecting to unix:/tmp/dist-test-taskLlHFIC/test-tmp/rpc-test-4f020ca73913407b81a4638cf65efce3.sock
W20260926 22:01:43.955008 7126 connection.cc:196] Error closing socket: Network error: TlsSocket::Close: Broken pipe
[ OK ] Parameters/TestRpc.TestCredentialsPolicy/SSL_UnixSocket (58 ms)
[ RUN ] Parameters/TestRpc.TestCallLongerThanKeepalive/SSL_UnixSocket
I20260926 22:01:43.986979 7152 acceptor_pool.cc:254] collecting diagnostics on the listening RPC socket unix:/tmp/dist-test-taskLlHFIC/test-tmp/rpc-test-a450a27c12ae425db3bb0f8c5b4c9ac4.sock every 8 connection(s)
I20260926 22:01:43.987185 7153 acceptor_pool.cc:254] collecting diagnostics on the listening RPC socket unix:/tmp/dist-test-taskLlHFIC/test-tmp/rpc-test-a450a27c12ae425db3bb0f8c5b4c9ac4.sock every 8 connection(s)
I20260926 22:01:44.016355 7156 rpc-test-base.h:222] got call: sleep_micros: 3000000 deferred: true
I20260926 22:01:47.018441 7156 rpcz_store.cc:275] Call kudu.rpc.GenericCalculatorService.Sleep from unix:<unnamed> (request call id 0) took 3002 ms. Trace:
I20260926 22:01:47.018726 7156 rpcz_store.cc:276] 0926 22:01:44.016247 (+ 0us) service_pool.cc:170] Inserting onto call queue
0926 22:01:44.016308 (+ 61us) service_pool.cc:227] Handling call
0926 22:01:47.018387 (+3002079us) inbound_call.cc:173] Queueing success response
Metrics: {}
[ OK ] Parameters/TestRpc.TestCallLongerThanKeepalive/SSL_UnixSocket (3059 ms)
[ RUN ] Parameters/TestRpc.TestRpcSidecar/SSL_UnixSocket
I20260926 22:01:47.048993 7177 acceptor_pool.cc:254] collecting diagnostics on the listening RPC socket unix:/tmp/dist-test-taskLlHFIC/test-tmp/rpc-test-303d264133134d0e833b0f7980d3d7b7.sock every 8 connection(s)
I20260926 22:01:47.049242 7178 acceptor_pool.cc:254] collecting diagnostics on the listening RPC socket unix:/tmp/dist-test-taskLlHFIC/test-tmp/rpc-test-303d264133134d0e833b0f7980d3d7b7.sock every 8 connection(s)
W20260926 22:01:47.147992 7174 connection.cc:196] Error closing socket: Network error: TlsSocket::Close: Broken pipe
[ OK ] Parameters/TestRpc.TestRpcSidecar/SSL_UnixSocket (126 ms)
[ RUN ] Parameters/TestRpc.TestRpcSidecarLimits/SSL_UnixSocket
I20260926 22:01:49.151913 7202 acceptor_pool.cc:254] collecting diagnostics on the listening RPC socket unix:/tmp/dist-test-taskLlHFIC/test-tmp/rpc-test-ab830eed5ccb490ca47e8e9bd6bd8081.sock every 8 connection(s)
I20260926 22:01:49.152163 7203 acceptor_pool.cc:254] collecting diagnostics on the listening RPC socket unix:/tmp/dist-test-taskLlHFIC/test-tmp/rpc-test-ab830eed5ccb490ca47e8e9bd6bd8081.sock every 8 connection(s)
W20260926 22:01:49.166668 6960 serialization.cc:72] Serialized kudu.rpc_test.PushStringsRequestPB (2147483654 bytes) is larger than the maximum configured RPC message size (52428800 bytes). Sending anyway, but peer may reject the data.
W20260926 22:01:49.172748 7199 connection.cc:535] server connection from unix:<unnamed> recv error: Network error: RPC frame had a length of 2147483714, but we only support messages up to 52428800 bytes long.
W20260926 22:01:49.172869 7199 connection.cc:158] shutting down server connection from unix:<unnamed> with pending inbound data: 4/2147483714 bytes received; last active 0 ns ago: status Network error: RPC frame had a length of 2147483714, but we only support messages up to 52428800 bytes long.
W20260926 22:01:49.173175 7215 connection.cc:698] client connection to unix:/tmp/dist-test-taskLlHFIC/test-tmp/rpc-test-ab830eed5ccb490ca47e8e9bd6bd8081.sock send error: Network error: failed to write to TLS socket: Broken pipe
W20260926 22:01:49.173555 7215 connection.cc:196] Error closing socket: Network error: TlsSocket::Close: Success
I20260926 22:01:49.189738 7227 acceptor_pool.cc:254] collecting diagnostics on the listening RPC socket unix:/tmp/dist-test-taskLlHFIC/test-tmp/rpc-test-ab830eed5ccb490ca47e8e9bd6bd8081.sock every 8 connection(s)
I20260926 22:01:49.189973 7228 acceptor_pool.cc:254] collecting diagnostics on the listening RPC socket unix:/tmp/dist-test-taskLlHFIC/test-tmp/rpc-test-ab830eed5ccb490ca47e8e9bd6bd8081.sock every 8 connection(s)
W20260926 22:01:54.681252 7224 connection.cc:577] server connection from unix:<unnamed>: received bad data: 'Corruption: Invalid packet: message had a length of 2147483710, but we only support messages up to 2147483647 bytes
'
W20260926 22:01:54.681905 7240 connection.cc:196] Error closing socket: Network error: TlsSocket::Close: Broken pipe
[ OK ] Parameters/TestRpc.TestRpcSidecarLimits/SSL_UnixSocket (8028 ms)
[ RUN ] Parameters/TestRpc.TestCallTimeoutDoesntAffectNegotiation/SSL_UnixSocket
I20260926 22:01:55.205169 7252 acceptor_pool.cc:254] collecting diagnostics on the listening RPC socket unix:/tmp/dist-test-taskLlHFIC/test-tmp/rpc-test-794f4fa2f90144eab4bacb212345f099.sock every 8 connection(s)
I20260926 22:01:55.205446 7253 acceptor_pool.cc:254] collecting diagnostics on the listening RPC socket unix:/tmp/dist-test-taskLlHFIC/test-tmp/rpc-test-794f4fa2f90144eab4bacb212345f099.sock every 8 connection(s)
W20260926 22:01:55.222316 7248 negotiation.cc:266] Injecting 500ms delay in negotiation
I20260926 22:01:55.272732 6960 rpc-test-base.h:595] status: Timed out: connection negotiation to unix:/tmp/dist-test-taskLlHFIC/test-tmp/rpc-test-794f4fa2f90144eab4bacb212345f099.sock for RPC Sleep timed out after 0.050s (ON_OUTBOUND_QUEUE), seconds elapsed: 0.0510382
[ OK ] Parameters/TestRpc.TestCallTimeoutDoesntAffectNegotiation/SSL_UnixSocket (551 ms)
[ RUN ] Parameters/TestRpc.TestRpcHandlerLatencyMetric/SSL_UnixSocket
I20260926 22:01:55.744279 7277 acceptor_pool.cc:254] collecting diagnostics on the listening RPC socket unix:/tmp/dist-test-taskLlHFIC/test-tmp/rpc-test-0689270fa570450db1fe714735be9ec2.sock every 8 connection(s)
I20260926 22:01:55.744509 7278 acceptor_pool.cc:254] collecting diagnostics on the listening RPC socket unix:/tmp/dist-test-taskLlHFIC/test-tmp/rpc-test-0689270fa570450db1fe714735be9ec2.sock every 8 connection(s)
I20260926 22:01:55.784111 6960 rpc-test.cc:1236] Sleep() min lat: 20819
I20260926 22:01:55.784214 6960 rpc-test.cc:1237] Sleep() mean lat: 20819
I20260926 22:01:55.784298 6960 rpc-test.cc:1238] Sleep() max lat: 20819
I20260926 22:01:55.784334 6960 rpc-test.cc:1239] Sleep() #calls: 1
[ OK ] Parameters/TestRpc.TestRpcHandlerLatencyMetric/SSL_UnixSocket (57 ms)
[ RUN ] Parameters/TestRpc.TimedOutOnResponseMetricServiceQueue/SSL_UnixSocket
I20260926 22:01:55.815287 7303 acceptor_pool.cc:254] collecting diagnostics on the listening RPC socket unix:/tmp/dist-test-taskLlHFIC/test-tmp/rpc-test-d836c98d8c0e4665b4afae638a5347a2.sock every 8 connection(s)
I20260926 22:01:55.815529 7304 acceptor_pool.cc:254] collecting diagnostics on the listening RPC socket unix:/tmp/dist-test-taskLlHFIC/test-tmp/rpc-test-d836c98d8c0e4665b4afae638a5347a2.sock every 8 connection(s)
W20260926 22:01:55.873811 7305 rpcz_store.cc:267] Call kudu.rpc_test.CalculatorService.Sleep from unix:<unnamed> (request call id 2) took 20 ms (client timeout 20 ms). Trace:
W20260926 22:01:55.874004 7305 rpcz_store.cc:269] 0926 22:01:55.853384 (+ 0us) service_pool.cc:170] Inserting onto call queue
0926 22:01:55.873754 (+ 20370us) service_pool.cc:214] Skipping call since client already timed out
0926 22:01:55.873792 (+ 38us) inbound_call.cc:173] Queueing failure response
Metrics: {}
W20260926 22:01:55.875488 7300 connection.cc:196] Error closing socket: Network error: TlsSocket::Close: Broken pipe
[ OK ] Parameters/TestRpc.TimedOutOnResponseMetricServiceQueue/SSL_UnixSocket (88 ms)
[ RUN ] Parameters/TestRpc.RpcPendingConnectionsMetric/SSL_UnixSocket
I20260926 22:01:55.883458 7326 acceptor_pool.cc:254] collecting diagnostics on the listening RPC socket 0.0.0.0:46689 every 8 connection(s)
I20260926 22:01:55.883704 7327 acceptor_pool.cc:254] collecting diagnostics on the listening RPC socket 0.0.0.0:46689 every 8 connection(s)
W20260926 22:01:55.885800 7322 negotiation.cc:337] Failed RPC negotiation. Trace:
0926 22:01:55.885090 (+ 0us) reactor.cc:625] Submitting negotiation task for server connection from 127.0.0.1:33432 (local address 127.0.0.1:46689)
0926 22:01:55.885277 (+ 187us) server_negotiation.cc:206] Beginning negotiation
0926 22:01:55.885281 (+ 4us) server_negotiation.cc:399] Waiting for connection header
0926 22:01:55.885416 (+ 135us) negotiation.cc:327] Negotiation complete: Network error: Server connection negotiation failed: server connection from 127.0.0.1:33432: BlockingRecv error: recv got EOF from 127.0.0.1:33432 (error 108)
Metrics: {"server-negotiator.queue_time_us":56}
[ OK ] Parameters/TestRpc.RpcPendingConnectionsMetric/SSL_UnixSocket (20 ms)
[ RUN ] Parameters/TestRpc.TestRpcContextClientDeadline/SSL_UnixSocket
I20260926 22:01:55.930500 7342 acceptor_pool.cc:254] collecting diagnostics on the listening RPC socket unix:/tmp/dist-test-taskLlHFIC/test-tmp/rpc-test-6dab25ee5d1b468babbd62d35a295df7.sock every 8 connection(s)
I20260926 22:01:55.930724 7343 acceptor_pool.cc:254] collecting diagnostics on the listening RPC socket unix:/tmp/dist-test-taskLlHFIC/test-tmp/rpc-test-6dab25ee5d1b468babbd62d35a295df7.sock every 8 connection(s)
[ OK ] Parameters/TestRpc.TestRpcContextClientDeadline/SSL_UnixSocket (77 ms)
[ RUN ] Parameters/TestRpc.TestApplicationFeatureFlagUnsupportedServer/SSL_UnixSocket
I20260926 22:01:55.989044 7367 acceptor_pool.cc:254] collecting diagnostics on the listening RPC socket unix:/tmp/dist-test-taskLlHFIC/test-tmp/rpc-test-de59784ac83945d5887a5d0f1f73c2d2.sock every 8 connection(s)
I20260926 22:01:55.989301 7368 acceptor_pool.cc:254] collecting diagnostics on the listening RPC socket unix:/tmp/dist-test-taskLlHFIC/test-tmp/rpc-test-de59784ac83945d5887a5d0f1f73c2d2.sock every 8 connection(s)
[ OK ] Parameters/TestRpc.TestApplicationFeatureFlagUnsupportedServer/SSL_UnixSocket (42 ms)
[ RUN ] Parameters/TestRpc.TestCancellationAsync/SSL_UnixSocket
I20260926 22:01:56.033839 7392 acceptor_pool.cc:254] collecting diagnostics on the listening RPC socket unix:/tmp/dist-test-taskLlHFIC/test-tmp/rpc-test-0cb6134dc11041ae924082073e5f3479.sock every 8 connection(s)
I20260926 22:01:56.034049 7393 acceptor_pool.cc:254] collecting diagnostics on the listening RPC socket unix:/tmp/dist-test-taskLlHFIC/test-tmp/rpc-test-0cb6134dc11041ae924082073e5f3479.sock every 8 connection(s)
I20260926 22:01:56.035023 6960 rpc-test.cc:1716] Connecting to unix:/tmp/dist-test-taskLlHFIC/test-tmp/rpc-test-0cb6134dc11041ae924082073e5f3479.sock
I20260926 22:01:56.045713 6960 test_util.cc:268] Using random seed: -80507012
I20260926 22:01:56.084859 7396 rpc-test-base.h:240] got call: sleep_micros: 500 pattern: 4294967295 num_repetitions: 2097152 sidecar_idx: 0
I20260926 22:01:56.121233 7396 rpc-test-base.h:240] got call: sleep_micros: 500 pattern: 4294967295 num_repetitions: 2097152 sidecar_idx: 0
I20260926 22:01:56.142360 7395 rpc-test-base.h:240] got call: sleep_micros: 500 pattern: 4294967295 num_repetitions: 2097152 sidecar_idx: 0
I20260926 22:01:56.172097 7394 rpc-test-base.h:240] got call: sleep_micros: 500 pattern: 4294967295 num_repetitions: 2097152 sidecar_idx: 0
I20260926 22:01:56.205729 7395 rpc-test-base.h:240] got call: sleep_micros: 500 pattern: 4294967295 num_repetitions: 2097152 sidecar_idx: 0
I20260926 22:01:56.239008 7394 rpc-test-base.h:240] got call: sleep_micros: 500 pattern: 4294967295 num_repetitions: 2097152 sidecar_idx: 0
I20260926 22:01:56.272243 7395 rpc-test-base.h:240] got call: sleep_micros: 500 pattern: 4294967295 num_repetitions: 2097152 sidecar_idx: 0
W20260926 22:01:56.292639 7389 connection.cc:441] server connection from unix:<unnamed> torn down before Call kudu.rpc.GenericCalculatorService.SleepWithSidecar from unix:<unnamed> (request call id 8) could send its response
W20260926 22:01:56.314075 7389 connection.cc:441] server connection from unix:<unnamed> torn down before Call kudu.rpc.GenericCalculatorService.SleepWithSidecar from unix:<unnamed> (request call id 9) could send its response
[ OK ] Parameters/TestRpc.TestCancellationAsync/SSL_UnixSocket (297 ms)
[ RUN ] Parameters/TestRpc.TestPerformanceBySocketType/SSL_UnixSocket
I20260926 22:01:56.333148 7417 acceptor_pool.cc:254] collecting diagnostics on the listening RPC socket unix:/tmp/dist-test-taskLlHFIC/test-tmp/rpc-test-809c24d75a2a45ca841e20083208a987.sock every 8 connection(s)
I20260926 22:01:56.333415 7418 acceptor_pool.cc:254] collecting diagnostics on the listening RPC socket unix:/tmp/dist-test-taskLlHFIC/test-tmp/rpc-test-809c24d75a2a45ca841e20083208a987.sock every 8 connection(s)
I20260926 22:01:56.334280 6960 rpc-test.cc:1846] Connecting to unix:/tmp/dist-test-taskLlHFIC/test-tmp/rpc-test-809c24d75a2a45ca841e20083208a987.sock
I20260926 22:01:59.528666 6960 rpc-test.cc:1859] Sending 1024MB via ssl-enabled unix socket: real 3.177s user 3.220s sys 2.180s
I20260926 22:02:02.775828 6960 rpc-test.cc:1859] Sending 1024MB via ssl-enabled unix socket: real 3.247s user 3.277s sys 2.229s
I20260926 22:02:05.934954 6960 rpc-test.cc:1859] Sending 1024MB via ssl-enabled unix socket: real 3.159s user 3.137s sys 2.218s
I20260926 22:02:09.148706 6960 rpc-test.cc:1859] Sending 1024MB via ssl-enabled unix socket: real 3.214s user 3.225s sys 2.209s
I20260926 22:02:12.357056 6960 rpc-test.cc:1859] Sending 1024MB via ssl-enabled unix socket: real 3.208s user 3.218s sys 2.205s
W20260926 22:02:12.359359 7414 connection.cc:196] Error closing socket: Network error: TlsSocket::Close: Broken pipe
[ OK ] Parameters/TestRpc.TestPerformanceBySocketType/SSL_UnixSocket (16047 ms)
[----------] 20 tests from Parameters/TestRpc (51620 ms total)
[----------] 1 test from Parameters/TestRpcSocketTxRxQueue
[ RUN ] Parameters/TestRpcSocketTxRxQueue.AcceptorRxQueueSizeMetric/0
I20260926 22:02:12.370329 7442 acceptor_pool.cc:254] collecting diagnostics on the listening RPC socket 0.0.0.0:38485 every 1 connection(s)
I20260926 22:02:12.370572 7443 acceptor_pool.cc:254] collecting diagnostics on the listening RPC socket 0.0.0.0:38485 every 1 connection(s)
W20260926 22:02:12.372196 7438 negotiation.cc:337] Failed RPC negotiation. Trace:
0926 22:02:12.371807 (+ 0us) reactor.cc:625] Submitting negotiation task for server connection from 127.0.0.1:54504 (local address 127.0.0.1:38485)
0926 22:02:12.371955 (+ 148us) server_negotiation.cc:206] Beginning negotiation
0926 22:02:12.371959 (+ 4us) server_negotiation.cc:399] Waiting for connection header
0926 22:02:12.372078 (+ 119us) negotiation.cc:327] Negotiation complete: Network error: Server connection negotiation failed: server connection from 127.0.0.1:54504: BlockingRecv error: recv got EOF from 127.0.0.1:54504 (error 108)
Metrics: {"server-negotiator.queue_time_us":51}
[ OK ] Parameters/TestRpcSocketTxRxQueue.AcceptorRxQueueSizeMetric/0 (10 ms)
[----------] 1 test from Parameters/TestRpcSocketTxRxQueue (10 ms total)
[----------] Global test environment tear-down
[==========] 21 tests from 2 test suites ran. (51631 ms total)
[ PASSED ] 20 tests.
[ FAILED ] 1 test, listed below:
[ FAILED ] Parameters/TestRpc.TestCallWithChainCertAndChainCA/SSL_UnixSocket, where GetParam() = (true, true)
1 FAILED TEST