Parameters/TestRpc.TestCallWithChainCertAndRootCA/SSL_UnixSocket: /data0/somelongdirectorytoavoidrpathissues/src/kudu/src/kudu/rpc/rpc-test.cc:303: Failure
Failed
Bad status: Runtime error: could not verify certificate chain (error with cert: subject=CN = localhost, ST = sadfjas, C = AS, emailAddress = sdflkdsajf, O = lskdfjlsad, OU = sldfkja, issuer=C = AS, ST = ASDfkjdhf, L = lskdjf, O = saldfja, OU = skdjf, CN = localhost, emailAddress = sadjflkadsj): : certificate has expired
Google Test trace:
/data0/somelongdirectorytoavoidrpathissues/src/kudu/src/kudu/rpc/rpc-test.cc:300: Connecting to unix:/tmp/dist-test-taskP87NgZ/test-tmp/rpc-test-314db7bad3504aceb8e5a4adfed8f551.sock
I20260925 19:32:24.563984 2492 test_util.cc:175] -----------------------------------------------
I20260925 19:32:24.564157 2492 test_util.cc:176] Had fatal failures, leaving test files at /tmp/dist-test-taskP87NgZ/test-tmp/rpc-test.2.Parameters_TestRpc.TestCallWithChainCertAndRootCA_SSL_UnixSocket.1790364741089251-2492-0
Note: This is test shard 3 of 8.
[==========] Running 21 tests from 2 test suites.
[----------] Global test environment set-up.
[----------] 1 test from TestRpc
[ RUN ] TestRpc.TestNegotiationTimeout
WARNING: Logging before InitGoogleLogging() is written to STDERR
I20260925 19:32:21.276328 2492 rpc-test-base.h:595] status: Timed out: connection negotiation to 0.0.0.0:42123 for RPC Sleep timed out after 0.100s (ON_OUTBOUND_QUEUE), seconds elapsed: 0.100892
W20260925 19:32:24.239773 2502 negotiation.cc:337] Failed RPC negotiation. Trace:
0925 19:32:21.176371 (+ 0us) reactor.cc:625] Submitting negotiation task for client connection to 0.0.0.0:42123 (local address 127.0.0.1:38340)
0925 19:32:21.177244 (+ 873us) negotiation.cc:107] Waiting for socket to connect
0925 19:32:21.177290 (+ 46us) client_negotiation.cc:174] Beginning negotiation
0925 19:32:21.189424 (+ 12134us) client_negotiation.cc:252] Sending NEGOTIATE NegotiatePB request
0925 19:32:24.238197 (+3048773us) negotiation.cc:327] Negotiation complete: Timed out: Client connection negotiation failed: client connection to 0.0.0.0:42123: received 0 of 4 requested bytes
Metrics: {"client-negotiator.queue_time_us":313}
[ OK ] TestRpc.TestNegotiationTimeout (3101 ms)
[----------] 1 test from TestRpc (3102 ms total)
[----------] 20 tests from Parameters/TestRpc
[ RUN ] Parameters/TestRpc.TestAcceptorPoolStartStop/SSL_UnixSocket
I20260925 19:32:24.278644 2518 acceptor_pool.cc:254] collecting diagnostics on the listening RPC socket unix:/tmp/dist-test-taskP87NgZ/test-tmp/rpc-test-e586e905bdf8463b893f79d377615513.sock every 8 connection(s)
I20260925 19:32:24.280356 2519 acceptor_pool.cc:254] collecting diagnostics on the listening RPC socket unix:/tmp/dist-test-taskP87NgZ/test-tmp/rpc-test-e586e905bdf8463b893f79d377615513.sock every 8 connection(s)
I20260925 19:32:24.327776 2529 acceptor_pool.cc:254] collecting diagnostics on the listening RPC socket unix:/tmp/dist-test-taskP87NgZ/test-tmp/rpc-test-e586e905bdf8463b893f79d377615513.sock every 8 connection(s)
I20260925 19:32:24.329227 2530 acceptor_pool.cc:254] collecting diagnostics on the listening RPC socket unix:/tmp/dist-test-taskP87NgZ/test-tmp/rpc-test-e586e905bdf8463b893f79d377615513.sock every 8 connection(s)
I20260925 19:32:24.363489 2540 acceptor_pool.cc:254] collecting diagnostics on the listening RPC socket unix:/tmp/dist-test-taskP87NgZ/test-tmp/rpc-test-e586e905bdf8463b893f79d377615513.sock every 8 connection(s)
I20260925 19:32:24.364300 2541 acceptor_pool.cc:254] collecting diagnostics on the listening RPC socket unix:/tmp/dist-test-taskP87NgZ/test-tmp/rpc-test-e586e905bdf8463b893f79d377615513.sock every 8 connection(s)
I20260925 19:32:24.389920 2551 acceptor_pool.cc:254] collecting diagnostics on the listening RPC socket unix:/tmp/dist-test-taskP87NgZ/test-tmp/rpc-test-e586e905bdf8463b893f79d377615513.sock every 8 connection(s)
I20260925 19:32:24.390651 2552 acceptor_pool.cc:254] collecting diagnostics on the listening RPC socket unix:/tmp/dist-test-taskP87NgZ/test-tmp/rpc-test-e586e905bdf8463b893f79d377615513.sock every 8 connection(s)
I20260925 19:32:24.413419 2562 acceptor_pool.cc:254] collecting diagnostics on the listening RPC socket unix:/tmp/dist-test-taskP87NgZ/test-tmp/rpc-test-e586e905bdf8463b893f79d377615513.sock every 8 connection(s)
I20260925 19:32:24.414145 2563 acceptor_pool.cc:254] collecting diagnostics on the listening RPC socket unix:/tmp/dist-test-taskP87NgZ/test-tmp/rpc-test-e586e905bdf8463b893f79d377615513.sock every 8 connection(s)
[ OK ] Parameters/TestRpc.TestAcceptorPoolStartStop/SSL_UnixSocket (173 ms)
[ RUN ] Parameters/TestRpc.TestCall/SSL_UnixSocket
I20260925 19:32:24.455636 2575 acceptor_pool.cc:254] collecting diagnostics on the listening RPC socket unix:/tmp/dist-test-taskP87NgZ/test-tmp/rpc-test-fc0ec83c7aee40de81a1630be07ad29d.sock every 8 connection(s)
I20260925 19:32:24.457696 2576 acceptor_pool.cc:254] collecting diagnostics on the listening RPC socket unix:/tmp/dist-test-taskP87NgZ/test-tmp/rpc-test-fc0ec83c7aee40de81a1630be07ad29d.sock every 8 connection(s)
I20260925 19:32:24.462786 2492 rpc-test.cc:234] Connecting to unix:/tmp/dist-test-taskP87NgZ/test-tmp/rpc-test-fc0ec83c7aee40de81a1630be07ad29d.sock
W20260925 19:32:24.513520 2572 connection.cc:196] Error closing socket: Network error: TlsSocket::Close: Broken pipe
[ OK ] Parameters/TestRpc.TestCall/SSL_UnixSocket (100 ms)
[ RUN ] Parameters/TestRpc.TestCallWithChainCertAndRootCA/SSL_UnixSocket
I20260925 19:32:24.543409 2600 acceptor_pool.cc:254] collecting diagnostics on the listening RPC socket unix:/tmp/dist-test-taskP87NgZ/test-tmp/rpc-test-314db7bad3504aceb8e5a4adfed8f551.sock every 8 connection(s)
I20260925 19:32:24.544199 2601 acceptor_pool.cc:254] collecting diagnostics on the listening RPC socket unix:/tmp/dist-test-taskP87NgZ/test-tmp/rpc-test-314db7bad3504aceb8e5a4adfed8f551.sock every 8 connection(s)
/data0/somelongdirectorytoavoidrpathissues/src/kudu/src/kudu/rpc/rpc-test.cc:303: Failure
Failed
Bad status: Runtime error: could not verify certificate chain (error with cert: subject=CN = localhost, ST = sadfjas, C = AS, emailAddress = sdflkdsajf, O = lskdfjlsad, OU = sldfkja, issuer=C = AS, ST = ASDfkjdhf, L = lskdjf, O = saldfja, OU = skdjf, CN = localhost, emailAddress = sadjflkadsj): : certificate has expired
Google Test trace:
/data0/somelongdirectorytoavoidrpathissues/src/kudu/src/kudu/rpc/rpc-test.cc:300: Connecting to unix:/tmp/dist-test-taskP87NgZ/test-tmp/rpc-test-314db7bad3504aceb8e5a4adfed8f551.sock
I20260925 19:32:24.563984 2492 test_util.cc:175] -----------------------------------------------
I20260925 19:32:24.564157 2492 test_util.cc:176] Had fatal failures, leaving test files at /tmp/dist-test-taskP87NgZ/test-tmp/rpc-test.2.Parameters_TestRpc.TestCallWithChainCertAndRootCA_SSL_UnixSocket.1790364741089251-2492-0
[ FAILED ] Parameters/TestRpc.TestCallWithChainCertAndRootCA/SSL_UnixSocket, where GetParam() = (true, true) (45 ms)
[ RUN ] Parameters/TestRpc.TestCallWithBadPasswordProtectedKey/SSL_UnixSocket
[ OK ] Parameters/TestRpc.TestCallWithBadPasswordProtectedKey/SSL_UnixSocket (31 ms)
[ RUN ] Parameters/TestRpc.TestInvalidMethodCall/SSL_UnixSocket
I20260925 19:32:24.620337 2637 acceptor_pool.cc:254] collecting diagnostics on the listening RPC socket unix:/tmp/dist-test-taskP87NgZ/test-tmp/rpc-test-e94fd5f614894b548401b6c69096bad5.sock every 8 connection(s)
I20260925 19:32:24.621176 2638 acceptor_pool.cc:254] collecting diagnostics on the listening RPC socket unix:/tmp/dist-test-taskP87NgZ/test-tmp/rpc-test-e94fd5f614894b548401b6c69096bad5.sock every 8 connection(s)
I20260925 19:32:24.624590 2492 rpc-test.cc:406] Connecting to unix:/tmp/dist-test-taskP87NgZ/test-tmp/rpc-test-e94fd5f614894b548401b6c69096bad5.sock
W20260925 19:32:24.673262 2634 connection.cc:196] Error closing socket: Network error: TlsSocket::Close: Broken pipe
[ OK ] Parameters/TestRpc.TestInvalidMethodCall/SSL_UnixSocket (83 ms)
[ RUN ] Parameters/TestRpc.TestHighFDs/SSL_UnixSocket
I20260925 19:32:24.914011 2662 acceptor_pool.cc:254] collecting diagnostics on the listening RPC socket unix:/tmp/dist-test-taskP87NgZ/test-tmp/rpc-test-8d8fb094175a4b8c8328e645b2c882f0.sock every 8 connection(s)
I20260925 19:32:24.914750 2663 acceptor_pool.cc:254] collecting diagnostics on the listening RPC socket unix:/tmp/dist-test-taskP87NgZ/test-tmp/rpc-test-8d8fb094175a4b8c8328e645b2c882f0.sock every 8 connection(s)
W20260925 19:32:24.945982 2659 connection.cc:196] Error closing socket: Network error: TlsSocket::Close: Broken pipe
[ OK ] Parameters/TestRpc.TestHighFDs/SSL_UnixSocket (277 ms)
[ RUN ] Parameters/TestRpc.TestConnectionAlwaysKeepalive/SSL_UnixSocket
I20260925 19:32:24.991077 2685 acceptor_pool.cc:254] collecting diagnostics on the listening RPC socket unix:/tmp/dist-test-taskP87NgZ/test-tmp/rpc-test-bf8e3492218a41e2b83ca1bed78868fc.sock every 8 connection(s)
I20260925 19:32:24.991817 2686 acceptor_pool.cc:254] collecting diagnostics on the listening RPC socket unix:/tmp/dist-test-taskP87NgZ/test-tmp/rpc-test-bf8e3492218a41e2b83ca1bed78868fc.sock every 8 connection(s)
I20260925 19:32:24.995189 2492 rpc-test.cc:532] Connecting to unix:/tmp/dist-test-taskP87NgZ/test-tmp/rpc-test-bf8e3492218a41e2b83ca1bed78868fc.sock
W20260925 19:32:28.031733 2684 connection.cc:196] Error closing socket: Network error: TlsSocket::Close: Broken pipe
[ OK ] Parameters/TestRpc.TestConnectionAlwaysKeepalive/SSL_UnixSocket (3079 ms)
[ RUN ] Parameters/TestRpc.TestReopenOutboundConnections/SSL_UnixSocket
I20260925 19:32:28.065169 2708 acceptor_pool.cc:254] collecting diagnostics on the listening RPC socket unix:/tmp/dist-test-taskP87NgZ/test-tmp/rpc-test-a6a904cda3d24f38bea5b02c9c174964.sock every 8 connection(s)
I20260925 19:32:28.065877 2709 acceptor_pool.cc:254] collecting diagnostics on the listening RPC socket unix:/tmp/dist-test-taskP87NgZ/test-tmp/rpc-test-a6a904cda3d24f38bea5b02c9c174964.sock every 8 connection(s)
I20260925 19:32:28.069105 2492 rpc-test.cc:658] Connecting to unix:/tmp/dist-test-taskP87NgZ/test-tmp/rpc-test-a6a904cda3d24f38bea5b02c9c174964.sock
W20260925 19:32:28.109933 2707 connection.cc:196] Error closing socket: Network error: TlsSocket::Close: Broken pipe
W20260925 19:32:28.120348 2707 connection.cc:196] Error closing socket: Network error: TlsSocket::Close: Broken pipe
W20260925 19:32:28.131004 2707 connection.cc:196] Error closing socket: Network error: TlsSocket::Close: Broken pipe
W20260925 19:32:28.141693 2707 connection.cc:196] Error closing socket: Network error: TlsSocket::Close: Broken pipe
W20260925 19:32:28.152154 2707 connection.cc:196] Error closing socket: Network error: TlsSocket::Close: Broken pipe
W20260925 19:32:28.162667 2707 connection.cc:196] Error closing socket: Network error: TlsSocket::Close: Broken pipe
W20260925 19:32:28.173710 2707 connection.cc:196] Error closing socket: Network error: TlsSocket::Close: Broken pipe
W20260925 19:32:28.184147 2707 connection.cc:196] Error closing socket: Network error: TlsSocket::Close: Broken pipe
W20260925 19:32:28.194933 2707 connection.cc:196] Error closing socket: Network error: TlsSocket::Close: Broken pipe
W20260925 19:32:28.205901 2707 connection.cc:196] Error closing socket: Network error: TlsSocket::Close: Broken pipe
W20260925 19:32:28.215920 2707 connection.cc:196] Error closing socket: Network error: TlsSocket::Close: Broken pipe
W20260925 19:32:28.226091 2707 connection.cc:196] Error closing socket: Network error: TlsSocket::Close: Broken pipe
W20260925 19:32:28.236173 2707 connection.cc:196] Error closing socket: Network error: TlsSocket::Close: Broken pipe
W20260925 19:32:28.245648 2707 connection.cc:196] Error closing socket: Network error: TlsSocket::Close: Broken pipe
W20260925 19:32:28.245648 2708 acceptor_pool.cc:285] unable to collect diagnostics on RPC socket unix:/tmp/dist-test-taskP87NgZ/test-tmp/rpc-test-a6a904cda3d24f38bea5b02c9c174964.sock: Not implemented: netlink diagnostics is currently supported only on IPv4 TCP sockets
W20260925 19:32:28.255592 2707 connection.cc:196] Error closing socket: Network error: TlsSocket::Close: Broken pipe
W20260925 19:32:28.267694 2707 connection.cc:196] Error closing socket: Network error: TlsSocket::Close: Broken pipe
W20260925 19:32:28.278489 2707 connection.cc:196] Error closing socket: Network error: TlsSocket::Close: Broken pipe
W20260925 19:32:28.289034 2707 connection.cc:196] Error closing socket: Network error: TlsSocket::Close: Broken pipe
W20260925 19:32:28.300100 2707 connection.cc:196] Error closing socket: Network error: TlsSocket::Close: Broken pipe
W20260925 19:32:28.310418 2707 connection.cc:196] Error closing socket: Network error: TlsSocket::Close: Broken pipe
W20260925 19:32:28.319957 2707 connection.cc:196] Error closing socket: Network error: TlsSocket::Close: Broken pipe
W20260925 19:32:28.329391 2707 connection.cc:196] Error closing socket: Network error: TlsSocket::Close: Broken pipe
W20260925 19:32:28.338876 2707 connection.cc:196] Error closing socket: Network error: TlsSocket::Close: Broken pipe
W20260925 19:32:28.348642 2707 connection.cc:196] Error closing socket: Network error: TlsSocket::Close: Broken pipe
W20260925 19:32:28.358631 2707 connection.cc:196] Error closing socket: Network error: TlsSocket::Close: Broken pipe
W20260925 19:32:28.368038 2707 connection.cc:196] Error closing socket: Network error: TlsSocket::Close: Broken pipe
W20260925 19:32:28.377372 2707 connection.cc:196] Error closing socket: Network error: TlsSocket::Close: Broken pipe
W20260925 19:32:28.386740 2707 connection.cc:196] Error closing socket: Network error: TlsSocket::Close: Broken pipe
W20260925 19:32:28.396188 2707 connection.cc:196] Error closing socket: Network error: TlsSocket::Close: Broken pipe
W20260925 19:32:28.405810 2707 connection.cc:196] Error closing socket: Network error: TlsSocket::Close: Broken pipe
W20260925 19:32:28.415037 2707 connection.cc:196] Error closing socket: Network error: TlsSocket::Close: Broken pipe
W20260925 19:32:28.426697 2707 connection.cc:196] Error closing socket: Network error: TlsSocket::Close: Broken pipe
[ OK ] Parameters/TestRpc.TestReopenOutboundConnections/SSL_UnixSocket (395 ms)
[ RUN ] Parameters/TestRpc.TestConnectionNetworkPlane/SSL_UnixSocket
I20260925 19:32:28.446889 2731 acceptor_pool.cc:254] collecting diagnostics on the listening RPC socket unix:/tmp/dist-test-taskP87NgZ/test-tmp/rpc-test-a97174a7394a409daf53b75d744ce335.sock every 8 connection(s)
I20260925 19:32:28.447497 2732 acceptor_pool.cc:254] collecting diagnostics on the listening RPC socket unix:/tmp/dist-test-taskP87NgZ/test-tmp/rpc-test-a97174a7394a409daf53b75d744ce335.sock every 8 connection(s)
I20260925 19:32:28.450582 2492 rpc-test.cc:772] Connecting to unix:/tmp/dist-test-taskP87NgZ/test-tmp/rpc-test-a97174a7394a409daf53b75d744ce335.sock
W20260925 19:32:28.495893 2730 connection.cc:196] Error closing socket: Network error: TlsSocket::Close: Broken pipe
W20260925 19:32:28.496690 2730 connection.cc:196] Error closing socket: Network error: TlsSocket::Close: Broken pipe
[ OK ] Parameters/TestRpc.TestConnectionNetworkPlane/SSL_UnixSocket (69 ms)
[ RUN ] Parameters/TestRpc.TestTCPKeepalive/SSL_UnixSocket
I20260925 19:32:28.517637 2756 acceptor_pool.cc:254] collecting diagnostics on the listening RPC socket unix:/tmp/dist-test-taskP87NgZ/test-tmp/rpc-test-92e2ee66ff6f441ab0d6a1703cbe1a4d.sock every 8 connection(s)
I20260925 19:32:28.518330 2757 acceptor_pool.cc:254] collecting diagnostics on the listening RPC socket unix:/tmp/dist-test-taskP87NgZ/test-tmp/rpc-test-92e2ee66ff6f441ab0d6a1703cbe1a4d.sock every 8 connection(s)
I20260925 19:32:28.561431 2760 rpc-test-base.h:222] got call: sleep_micros: 8000000 deferred: true
I20260925 19:32:36.565804 2760 rpcz_store.cc:275] Call kudu.rpc.GenericCalculatorService.Sleep from unix:<unnamed> (request call id 0) took 8004 ms. Trace:
I20260925 19:32:36.566238 2760 rpcz_store.cc:276] 0925 19:32:28.561134 (+ 0us) service_pool.cc:170] Inserting onto call queue
0925 19:32:28.561289 (+ 155us) service_pool.cc:227] Handling call
0925 19:32:36.565634 (+8004345us) inbound_call.cc:173] Queueing success response
Metrics: {}
W20260925 19:32:36.572558 2753 connection.cc:196] Error closing socket: Network error: TlsSocket::Close: Broken pipe
[ OK ] Parameters/TestRpc.TestTCPKeepalive/SSL_UnixSocket (8079 ms)
[ RUN ] Parameters/TestRpc.TestMaxSmallSidecars/SSL_UnixSocket
I20260925 19:32:36.628147 2782 acceptor_pool.cc:254] collecting diagnostics on the listening RPC socket unix:/tmp/dist-test-taskP87NgZ/test-tmp/rpc-test-a6f65604db1f4a9bb840cfcbe65717b8.sock every 8 connection(s)
I20260925 19:32:36.629011 2783 acceptor_pool.cc:254] collecting diagnostics on the listening RPC socket unix:/tmp/dist-test-taskP87NgZ/test-tmp/rpc-test-a6f65604db1f4a9bb840cfcbe65717b8.sock every 8 connection(s)
W20260925 19:32:36.794354 2779 connection.cc:196] Error closing socket: Network error: TlsSocket::Close: Broken pipe
[ OK ] Parameters/TestRpc.TestMaxSmallSidecars/SSL_UnixSocket (218 ms)
[ RUN ] Parameters/TestRpc.TestCallTimeout/SSL_UnixSocket
I20260925 19:32:36.832472 2807 acceptor_pool.cc:254] collecting diagnostics on the listening RPC socket unix:/tmp/dist-test-taskP87NgZ/test-tmp/rpc-test-49701ab178b04c4dbb96f27730c503f1.sock every 8 connection(s)
I20260925 19:32:36.833184 2808 acceptor_pool.cc:254] collecting diagnostics on the listening RPC socket unix:/tmp/dist-test-taskP87NgZ/test-tmp/rpc-test-49701ab178b04c4dbb96f27730c503f1.sock every 8 connection(s)
I20260925 19:32:36.874468 2492 rpc-test-base.h:595] status: Timed out: connection negotiation to unix:/tmp/dist-test-taskP87NgZ/test-tmp/rpc-test-49701ab178b04c4dbb96f27730c503f1.sock for RPC Sleep timed out after 0.000s (ON_OUTBOUND_QUEUE), seconds elapsed: 0.0024302
I20260925 19:32:36.881656 2811 rpc-test-base.h:222] got call: sleep_micros: 700000
I20260925 19:32:37.075588 2492 rpc-test-base.h:595] status: Timed out: Sleep RPC to unix:/tmp/dist-test-taskP87NgZ/test-tmp/rpc-test-49701ab178b04c4dbb96f27730c503f1.sock timed out after 0.200s (SENT), seconds elapsed: 0.200826
I20260925 19:32:37.077481 2810 rpc-test-base.h:222] got call: sleep_micros: 2000000
W20260925 19:32:37.582371 2811 rpcz_store.cc:267] Call kudu.rpc.GenericCalculatorService.Sleep from unix:<unnamed> (request call id 1) took 700 ms (client timeout 200 ms). Trace:
W20260925 19:32:37.582836 2811 rpcz_store.cc:269] 0925 19:32:36.881497 (+ 0us) service_pool.cc:170] Inserting onto call queue
0925 19:32:36.881611 (+ 114us) service_pool.cc:227] Handling call
0925 19:32:37.582313 (+700702us) inbound_call.cc:173] Queueing success response
Metrics: {}
I20260925 19:32:38.578434 2492 rpc-test-base.h:595] status: Timed out: Sleep RPC to unix:/tmp/dist-test-taskP87NgZ/test-tmp/rpc-test-49701ab178b04c4dbb96f27730c503f1.sock timed out after 1.500s (SENT), seconds elapsed: 1.50239
W20260925 19:32:39.078240 2810 rpcz_store.cc:267] Call kudu.rpc.GenericCalculatorService.Sleep from unix:<unnamed> (request call id 2) took 2001 ms (client timeout 1500 ms). Trace:
W20260925 19:32:39.078599 2810 rpcz_store.cc:269] 0925 19:32:37.077145 (+ 0us) service_pool.cc:170] Inserting onto call queue
0925 19:32:37.077293 (+ 148us) service_pool.cc:227] Handling call
0925 19:32:39.078129 (+2000836us) inbound_call.cc:173] Queueing success response
Metrics: {}
W20260925 19:32:39.079290 2804 connection.cc:441] server connection from unix:<unnamed> torn down before Call kudu.rpc.GenericCalculatorService.Sleep from unix:<unnamed> (request call id 2) could send its response
[ OK ] Parameters/TestRpc.TestCallTimeout/SSL_UnixSocket (2285 ms)
[ RUN ] Parameters/TestRpc.TestServerShutsDown/SSL_UnixSocket
I20260925 19:32:39.087252 2492 rpc-test.cc:1125] Connecting to 0.0.0.0:39561
W20260925 19:32:39.097807 2824 negotiation.cc:337] Failed RPC negotiation. Trace:
0925 19:32:39.096145 (+ 0us) reactor.cc:625] Submitting negotiation task for client connection to 0.0.0.0:39561 (local address 127.0.0.1:46510)
0925 19:32:39.096606 (+ 461us) negotiation.cc:107] Waiting for socket to connect
0925 19:32:39.096647 (+ 41us) client_negotiation.cc:174] Beginning negotiation
0925 19:32:39.096901 (+ 254us) client_negotiation.cc:252] Sending NEGOTIATE NegotiatePB request
0925 19:32:39.097112 (+ 211us) negotiation.cc:327] Negotiation complete: Network error: Client connection negotiation failed: client connection to 0.0.0.0:39561: BlockingWrite error: write error: Broken pipe (error 32)
Metrics: {"client-negotiator.queue_time_us":135}
[ OK ] Parameters/TestRpc.TestServerShutsDown/SSL_UnixSocket (15 ms)
[ RUN ] Parameters/TestRpc.TimedOutOnResponseMetric/SSL_UnixSocket
I20260925 19:32:39.122588 2841 acceptor_pool.cc:254] collecting diagnostics on the listening RPC socket unix:/tmp/dist-test-taskP87NgZ/test-tmp/rpc-test-e41ad78a234e49dfaeeca4c68fad07a9.sock every 8 connection(s)
I20260925 19:32:39.123298 2842 acceptor_pool.cc:254] collecting diagnostics on the listening RPC socket unix:/tmp/dist-test-taskP87NgZ/test-tmp/rpc-test-e41ad78a234e49dfaeeca4c68fad07a9.sock every 8 connection(s)
W20260925 19:32:39.361438 2845 rpcz_store.cc:267] Call kudu.rpc_test.CalculatorService.Sleep from unix:<unnamed> (request call id 3) took 50 ms (client timeout 25 ms). Trace:
W20260925 19:32:39.361732 2845 rpcz_store.cc:269] 0925 19:32:39.310863 (+ 0us) service_pool.cc:170] Inserting onto call queue
0925 19:32:39.310969 (+ 106us) service_pool.cc:227] Handling call
0925 19:32:39.361363 (+ 50394us) inbound_call.cc:173] Queueing success response
Related trace 'test_child':
Metrics: {"test_sleep_us":50000,"child_traces":[["test_child",{"related_trace_metric":1}]]}
W20260925 19:32:39.420674 2845 rpcz_store.cc:267] Call kudu.rpc_test.CalculatorService.Sleep from unix:<unnamed> (request call id 4) took 50 ms (client timeout 50 ms). Trace:
W20260925 19:32:39.420969 2845 rpcz_store.cc:269] 0925 19:32:39.370169 (+ 0us) service_pool.cc:170] Inserting onto call queue
0925 19:32:39.370287 (+ 118us) service_pool.cc:227] Handling call
0925 19:32:39.420616 (+ 50329us) inbound_call.cc:173] Queueing success response
Related trace 'test_child':
Metrics: {"test_sleep_us":50000,"child_traces":[["test_child",{"related_trace_metric":1}]]}
[ OK ] Parameters/TestRpc.TimedOutOnResponseMetric/SSL_UnixSocket (328 ms)
[ RUN ] Parameters/TestRpc.AcceptorDispatchingTimesMetric/SSL_UnixSocket
I20260925 19:32:39.441810 2866 acceptor_pool.cc:254] collecting diagnostics on the listening RPC socket 0.0.0.0:38973 every 8 connection(s)
I20260925 19:32:39.442543 2867 acceptor_pool.cc:254] collecting diagnostics on the listening RPC socket 0.0.0.0:38973 every 8 connection(s)
W20260925 19:32:39.448637 2862 negotiation.cc:337] Failed RPC negotiation. Trace:
0925 19:32:39.446404 (+ 0us) reactor.cc:625] Submitting negotiation task for server connection from 127.0.0.1:51088 (local address 127.0.0.1:38973)
0925 19:32:39.447138 (+ 734us) server_negotiation.cc:206] Beginning negotiation
0925 19:32:39.447166 (+ 28us) server_negotiation.cc:399] Waiting for connection header
0925 19:32:39.447499 (+ 333us) negotiation.cc:327] Negotiation complete: Network error: Server connection negotiation failed: server connection from 127.0.0.1:51088: BlockingRecv error: recv got EOF from 127.0.0.1:51088 (error 108)
Metrics: {"server-negotiator.queue_time_us":220}
[ OK ] Parameters/TestRpc.AcceptorDispatchingTimesMetric/SSL_UnixSocket (22 ms)
[ RUN ] Parameters/TestRpc.TestRpcCallbackDestroysMessenger/SSL_UnixSocket
[ OK ] Parameters/TestRpc.TestRpcCallbackDestroysMessenger/SSL_UnixSocket (42 ms)
[ RUN ] Parameters/TestRpc.TestApplicationFeatureFlag/SSL_UnixSocket
I20260925 19:32:39.520684 2891 acceptor_pool.cc:254] collecting diagnostics on the listening RPC socket unix:/tmp/dist-test-taskP87NgZ/test-tmp/rpc-test-9590eb53b4fa4302a8aad1e596988ab6.sock every 8 connection(s)
I20260925 19:32:39.521533 2892 acceptor_pool.cc:254] collecting diagnostics on the listening RPC socket unix:/tmp/dist-test-taskP87NgZ/test-tmp/rpc-test-9590eb53b4fa4302a8aad1e596988ab6.sock every 8 connection(s)
W20260925 19:32:39.557765 2888 messenger.cc:357] Unable to handle RPC call: Not implemented: call requires unsupported application feature flags: 99
[ OK ] Parameters/TestRpc.TestApplicationFeatureFlag/SSL_UnixSocket (70 ms)
[ RUN ] Parameters/TestRpc.TestCancellation/SSL_UnixSocket
I20260925 19:32:39.590199 2916 acceptor_pool.cc:254] collecting diagnostics on the listening RPC socket unix:/tmp/dist-test-taskP87NgZ/test-tmp/rpc-test-93c0540984d74b09bc6d6ebacee48f7a.sock every 8 connection(s)
I20260925 19:32:39.590925 2917 acceptor_pool.cc:254] collecting diagnostics on the listening RPC socket unix:/tmp/dist-test-taskP87NgZ/test-tmp/rpc-test-93c0540984d74b09bc6d6ebacee48f7a.sock every 8 connection(s)
I20260925 19:32:39.594142 2492 rpc-test.cc:1648] Connecting to unix:/tmp/dist-test-taskP87NgZ/test-tmp/rpc-test-93c0540984d74b09bc6d6ebacee48f7a.sock
I20260925 19:32:39.706879 2492 rpc-test-base.h:595] status: Aborted: Sleep RPC to unix:/tmp/dist-test-taskP87NgZ/test-tmp/rpc-test-93c0540984d74b09bc6d6ebacee48f7a.sock is cancelled in state READY, seconds elapsed: 0.000368462
I20260925 19:32:39.883349 2492 rpc-test-base.h:595] status: Aborted: Sleep RPC to unix:/tmp/dist-test-taskP87NgZ/test-tmp/rpc-test-93c0540984d74b09bc6d6ebacee48f7a.sock is cancelled in state SENT, seconds elapsed: 0.000851031
I20260925 19:32:39.883525 2919 rpc-test-base.h:222] got call: sleep_micros: 510000
I20260925 19:32:40.060997 2492 rpc-test-base.h:595] status: Aborted: Sleep RPC to unix:/tmp/dist-test-taskP87NgZ/test-tmp/rpc-test-93c0540984d74b09bc6d6ebacee48f7a.sock is cancelled in state SENT, seconds elapsed: 0.000811065
I20260925 19:32:40.061242 2918 rpc-test-base.h:222] got call: sleep_micros: 510000
I20260925 19:32:40.251853 2492 rpc-test-base.h:595] status: Aborted: Sleep RPC to unix:/tmp/dist-test-taskP87NgZ/test-tmp/rpc-test-93c0540984d74b09bc6d6ebacee48f7a.sock is cancelled in state SENT, seconds elapsed: 0.000871258
W20260925 19:32:40.263778 2920 rpcz_store.cc:267] Call kudu.rpc.GenericCalculatorService.Sleep from unix:<unnamed> (request call id 11) took 11 ms (client timeout 10 ms). Trace:
W20260925 19:32:40.264050 2920 rpcz_store.cc:269] 0925 19:32:40.251903 (+ 0us) service_pool.cc:170] Inserting onto call queue
0925 19:32:40.263558 (+ 11655us) service_pool.cc:214] Skipping call since client already timed out
0925 19:32:40.263634 (+ 76us) inbound_call.cc:173] Queueing failure response
Metrics: {}
I20260925 19:32:40.264514 2920 rpc-test-base.h:222] got call: sleep_micros: 1500000
W20260925 19:32:40.394151 2919 rpcz_store.cc:267] Call kudu.rpc.GenericCalculatorService.Sleep from unix:<unnamed> (request call id 3) took 510 ms (client timeout 10 ms). Trace:
W20260925 19:32:40.394510 2919 rpcz_store.cc:269] 0925 19:32:39.883357 (+ 0us) service_pool.cc:170] Inserting onto call queue
0925 19:32:39.883482 (+ 125us) service_pool.cc:227] Handling call
0925 19:32:40.394100 (+510618us) inbound_call.cc:173] Queueing success response
Metrics: {}
W20260925 19:32:40.571923 2918 rpcz_store.cc:267] Call kudu.rpc.GenericCalculatorService.Sleep from unix:<unnamed> (request call id 7) took 510 ms (client timeout 10 ms). Trace:
W20260925 19:32:40.572240 2918 rpcz_store.cc:269] 0925 19:32:40.061051 (+ 0us) service_pool.cc:170] Inserting onto call queue
0925 19:32:40.061180 (+ 129us) service_pool.cc:227] Handling call
0925 19:32:40.571811 (+510631us) inbound_call.cc:173] Queueing success response
Metrics: {}
I20260925 19:32:41.254240 2492 rpc-test-base.h:595] status: Timed out: Sleep RPC to unix:/tmp/dist-test-taskP87NgZ/test-tmp/rpc-test-93c0540984d74b09bc6d6ebacee48f7a.sock timed out after 1.000s (SENT), seconds elapsed: 1.0019
I20260925 19:32:41.256251 2918 rpc-test-base.h:222] got call: sleep_micros: 1500000
W20260925 19:32:41.765233 2920 rpcz_store.cc:267] Call kudu.rpc.GenericCalculatorService.Sleep from unix:<unnamed> (request call id 12) took 1512 ms (client timeout 1000 ms). Trace:
W20260925 19:32:41.765595 2920 rpcz_store.cc:269] 0925 19:32:40.252942 (+ 0us) service_pool.cc:170] Inserting onto call queue
0925 19:32:40.264477 (+ 11535us) service_pool.cc:227] Handling call
0925 19:32:41.765098 (+1500621us) inbound_call.cc:173] Queueing success response
Metrics: {}
I20260925 19:32:42.256966 2492 rpc-test-base.h:595] status: Timed out: Sleep RPC to unix:/tmp/dist-test-taskP87NgZ/test-tmp/rpc-test-93c0540984d74b09bc6d6ebacee48f7a.sock timed out after 1.000s (SENT), seconds elapsed: 1.00226
W20260925 19:32:42.258772 2913 messenger.cc:357] Unable to handle RPC call: Not implemented: call requires unsupported application feature flags: 99, 1
W20260925 19:32:42.260315 2913 messenger.cc:357] Unable to handle RPC call: Not implemented: call requires unsupported application feature flags: 99, 1
W20260925 19:32:42.484133 2913 connection.cc:196] Error closing socket: Network error: TlsSocket::Close: Broken pipe
W20260925 19:32:42.756917 2918 rpcz_store.cc:267] Call kudu.rpc.GenericCalculatorService.Sleep from unix:<unnamed> (request call id 13) took 1501 ms (client timeout 1000 ms). Trace:
W20260925 19:32:42.757287 2918 rpcz_store.cc:269] 0925 19:32:41.255889 (+ 0us) service_pool.cc:170] Inserting onto call queue
0925 19:32:41.256119 (+ 230us) service_pool.cc:227] Handling call
0925 19:32:42.756863 (+1500744us) inbound_call.cc:173] Queueing success response
Metrics: {}
W20260925 19:32:42.757939 2913 connection.cc:441] server connection from unix:<unnamed> torn down before Call kudu.rpc.GenericCalculatorService.Sleep from unix:<unnamed> (request call id 13) could send its response
[ OK ] Parameters/TestRpc.TestCancellation/SSL_UnixSocket (3200 ms)
[ RUN ] Parameters/TestRpc.TestCancellationMultiThreads/SSL_UnixSocket
I20260925 19:32:42.802246 2942 acceptor_pool.cc:254] collecting diagnostics on the listening RPC socket unix:/tmp/dist-test-taskP87NgZ/test-tmp/rpc-test-026a0d40cef64badbb48a05e9aef72fc.sock every 8 connection(s)
I20260925 19:32:42.803138 2943 acceptor_pool.cc:254] collecting diagnostics on the listening RPC socket unix:/tmp/dist-test-taskP87NgZ/test-tmp/rpc-test-026a0d40cef64badbb48a05e9aef72fc.sock every 8 connection(s)
I20260925 19:32:42.806226 2492 rpc-test.cc:1808] Connecting to unix:/tmp/dist-test-taskP87NgZ/test-tmp/rpc-test-026a0d40cef64badbb48a05e9aef72fc.sock
I20260925 19:32:42.954841 2956 test_util.cc:268] Using random seed: -944317456
I20260925 19:32:42.955933 2957 test_util.cc:268] Using random seed: -944316282
I20260925 19:32:42.958045 2958 test_util.cc:268] Using random seed: -944314292
I20260925 19:32:42.959368 2959 test_util.cc:268] Using random seed: -944312871
I20260925 19:32:42.960918 2960 test_util.cc:268] Using random seed: -944311453
I20260925 19:32:42.962633 2961 test_util.cc:268] Using random seed: -944309727
I20260925 19:32:42.964099 2962 test_util.cc:268] Using random seed: -944308256
I20260925 19:32:42.965826 2963 test_util.cc:268] Using random seed: -944306535
I20260925 19:32:42.967181 2964 test_util.cc:268] Using random seed: -944305171
I20260925 19:32:42.968888 2965 test_util.cc:268] Using random seed: -944303491
I20260925 19:32:42.970844 2966 test_util.cc:268] Using random seed: -944301501
I20260925 19:32:42.972196 2967 test_util.cc:268] Using random seed: -944300164
I20260925 19:32:42.973678 2968 test_util.cc:268] Using random seed: -944298642
I20260925 19:32:42.975399 2969 test_util.cc:268] Using random seed: -944296961
I20260925 19:32:42.978518 2970 test_util.cc:268] Using random seed: -944294710
I20260925 19:32:42.980516 2971 test_util.cc:268] Using random seed: -944291886
I20260925 19:32:42.982262 2972 test_util.cc:268] Using random seed: -944290122
I20260925 19:32:42.983922 2973 test_util.cc:268] Using random seed: -944288478
I20260925 19:32:42.985849 2974 test_util.cc:268] Using random seed: -944286575
I20260925 19:32:42.987831 2975 test_util.cc:268] Using random seed: -944284718
I20260925 19:32:42.989451 2976 test_util.cc:268] Using random seed: -944282912
I20260925 19:32:42.990885 2977 test_util.cc:268] Using random seed: -944281460
I20260925 19:32:42.992858 2978 test_util.cc:268] Using random seed: -944279531
I20260925 19:32:42.994416 2979 test_util.cc:268] Using random seed: -944277927
I20260925 19:32:42.996125 2980 test_util.cc:268] Using random seed: -944276253
I20260925 19:32:42.997900 2981 test_util.cc:268] Using random seed: -944274453
I20260925 19:32:43.000196 2982 test_util.cc:268] Using random seed: -944272232
I20260925 19:32:43.001945 2983 test_util.cc:268] Using random seed: -944270429
I20260925 19:32:43.003729 2984 test_util.cc:268] Using random seed: -944268635
I20260925 19:32:43.005499 2985 test_util.cc:268] Using random seed: -944266840
W20260925 19:33:02.866741 2939 connection.cc:196] Error closing socket: Network error: TlsSocket::Close: Broken pipe
[ OK ] Parameters/TestRpc.TestCancellationMultiThreads/SSL_UnixSocket (20117 ms)
[ RUN ] Parameters/TestRpc.TestCallId/SSL_UnixSocket
I20260925 19:33:02.902133 2999 acceptor_pool.cc:254] collecting diagnostics on the listening RPC socket unix:/tmp/dist-test-taskP87NgZ/test-tmp/rpc-test-407330e2e0e6404ba35e097c869f0f7b.sock every 8 connection(s)
I20260925 19:33:02.903034 3000 acceptor_pool.cc:254] collecting diagnostics on the listening RPC socket unix:/tmp/dist-test-taskP87NgZ/test-tmp/rpc-test-407330e2e0e6404ba35e097c869f0f7b.sock every 8 connection(s)
[ OK ] Parameters/TestRpc.TestCallId/SSL_UnixSocket (75 ms)
[----------] 20 tests from Parameters/TestRpc (38716 ms total)
[----------] Global test environment tear-down
[==========] 21 tests from 2 test suites ran. (41819 ms total)
[ PASSED ] 20 tests.
[ FAILED ] 1 test, listed below:
[ FAILED ] Parameters/TestRpc.TestCallWithChainCertAndRootCA/SSL_UnixSocket, where GetParam() = (true, true)
1 FAILED TEST
I20260925 19:33:02.977120 2492 logging.cc:424] LogThrottler /data0/somelongdirectorytoavoidrpathissues/src/kudu/src/kudu/rpc/acceptor_pool.cc:285: suppressed but not reported on 3 messages since previous log ~34 seconds ago