Diagnosed failure

Parameters/TestRpc.TestCallWithChainCertAndChainCA/SSL_TCP: /data0/somelongdirectorytoavoidrpathissues/src/kudu/src/kudu/rpc/rpc-test.cc:270: Failure
Failed
Bad status: Runtime error: could not verify certificate chain (error with cert: subject=CN = localhost, ST = sadfjas, C = AS, emailAddress = sdflkdsajf, O = lskdfjlsad, OU = sldfkja, issuer=C = AS, ST = ASDfkjdhf, L = lskdjf, O = saldfja, OU = skdjf, CN = localhost, emailAddress = sadjflkadsj): : certificate has expired
Google Test trace:
/data0/somelongdirectorytoavoidrpathissues/src/kudu/src/kudu/rpc/rpc-test.cc:267: Connecting to 0.0.0.0:43863
I20260929 20:17:31.766233  5843 test_util.cc:175] -----------------------------------------------
I20260929 20:17:31.766347  5843 test_util.cc:176] Had fatal failures, leaving test files at /tmp/dist-test-taskW5PjB3/test-tmp/rpc-test.5.Parameters_TestRpc.TestCallWithChainCertAndChainCA_SSL_TCP.1790713051627260-5843-0

Full log

Note: This is test shard 6 of 8.
[==========] Running 21 tests from 2 test suites.
[----------] Global test environment set-up.
[----------] 20 tests from Parameters/TestRpc
[ RUN      ] Parameters/TestRpc.TestMessengerCreateDestroy/SSL_TCP
WARNING: Logging before InitGoogleLogging() is written to STDERR
I20260929 20:17:31.698875  5843 rpc-test.cc:169] started messenger TestCreateDestroy
[       OK ] Parameters/TestRpc.TestMessengerCreateDestroy/SSL_TCP (55 ms)
[ RUN      ] Parameters/TestRpc.TestNegotiationDeadlock/SSL_TCP
I20260929 20:17:31.716244  5863 acceptor_pool.cc:254] collecting diagnostics on the listening RPC socket 0.0.0.0:36087 every 8 connection(s)
I20260929 20:17:31.716562  5864 acceptor_pool.cc:254] collecting diagnostics on the listening RPC socket 0.0.0.0:36087 every 8 connection(s)
[       OK ] Parameters/TestRpc.TestNegotiationDeadlock/SSL_TCP (36 ms)
[ RUN      ] Parameters/TestRpc.TestCallWithChainCertAndChainCA/SSL_TCP
I20260929 20:17:31.752753  5879 acceptor_pool.cc:254] collecting diagnostics on the listening RPC socket 0.0.0.0:43863 every 8 connection(s)
I20260929 20:17:31.753139  5880 acceptor_pool.cc:254] collecting diagnostics on the listening RPC socket 0.0.0.0:43863 every 8 connection(s)
/data0/somelongdirectorytoavoidrpathissues/src/kudu/src/kudu/rpc/rpc-test.cc:270: Failure
Failed
Bad status: Runtime error: could not verify certificate chain (error with cert: subject=CN = localhost, ST = sadfjas, C = AS, emailAddress = sdflkdsajf, O = lskdfjlsad, OU = sldfkja, issuer=C = AS, ST = ASDfkjdhf, L = lskdjf, O = saldfja, OU = skdjf, CN = localhost, emailAddress = sadjflkadsj): : certificate has expired
Google Test trace:
/data0/somelongdirectorytoavoidrpathissues/src/kudu/src/kudu/rpc/rpc-test.cc:267: Connecting to 0.0.0.0:43863
I20260929 20:17:31.766233  5843 test_util.cc:175] -----------------------------------------------
I20260929 20:17:31.766347  5843 test_util.cc:176] Had fatal failures, leaving test files at /tmp/dist-test-taskW5PjB3/test-tmp/rpc-test.5.Parameters_TestRpc.TestCallWithChainCertAndChainCA_SSL_TCP.1790713051627260-5843-0
[  FAILED  ] Parameters/TestRpc.TestCallWithChainCertAndChainCA/SSL_TCP, where GetParam() = (true, false) (27 ms)
[ RUN      ] Parameters/TestRpc.TestCallWithPasswordProtectedKey/SSL_TCP
I20260929 20:17:31.793601  5904 acceptor_pool.cc:254] collecting diagnostics on the listening RPC socket 0.0.0.0:33743 every 8 connection(s)
I20260929 20:17:31.794000  5905 acceptor_pool.cc:254] collecting diagnostics on the listening RPC socket 0.0.0.0:33743 every 8 connection(s)
[       OK ] Parameters/TestRpc.TestCallWithPasswordProtectedKey/SSL_TCP (69 ms)
[ RUN      ] Parameters/TestRpc.TestCallToBadServer/SSL_TCP
I20260929 20:17:31.857059  5843 rpc-test.cc:394] Status: Network error: Client connection negotiation failed: client connection to 0.0.0.0:0: connect: Connection refused (error 111)
I20260929 20:17:31.857946  5843 rpc-test.cc:394] Status: Network error: Client connection negotiation failed: client connection to 0.0.0.0:0: connect: Connection refused (error 111)
I20260929 20:17:31.858767  5843 rpc-test.cc:394] Status: Network error: Client connection negotiation failed: client connection to 0.0.0.0:0: connect: Connection refused (error 111)
I20260929 20:17:31.859445  5843 rpc-test.cc:394] Status: Network error: Client connection negotiation failed: client connection to 0.0.0.0:0: connect: Connection refused (error 111)
I20260929 20:17:31.860090  5843 rpc-test.cc:394] Status: Network error: Client connection negotiation failed: client connection to 0.0.0.0:0: connect: Connection refused (error 111)
[       OK ] Parameters/TestRpc.TestCallToBadServer/SSL_TCP (26 ms)
[ RUN      ] Parameters/TestRpc.TestWrongService/SSL_TCP
I20260929 20:17:31.883670  5939 acceptor_pool.cc:254] collecting diagnostics on the listening RPC socket 0.0.0.0:37821 every 8 connection(s)
I20260929 20:17:31.883929  5940 acceptor_pool.cc:254] collecting diagnostics on the listening RPC socket 0.0.0.0:37821 every 8 connection(s)
I20260929 20:17:31.903271  5936 messenger.cc:345] service WrongServiceName not registered on TestServer
[       OK ] Parameters/TestRpc.TestWrongService/SSL_TCP (47 ms)
[ RUN      ] Parameters/TestRpc.TestConnectionKeepalive/SSL_TCP
I20260929 20:17:31.948056  5962 acceptor_pool.cc:254] collecting diagnostics on the listening RPC socket 0.0.0.0:36773 every 8 connection(s)
I20260929 20:17:31.948369  5963 acceptor_pool.cc:254] collecting diagnostics on the listening RPC socket 0.0.0.0:36773 every 8 connection(s)
I20260929 20:17:31.949457  5843 rpc-test.cc:488] Connecting to 0.0.0.0:36773
[       OK ] Parameters/TestRpc.TestConnectionKeepalive/SSL_TCP (1074 ms)
[ RUN      ] Parameters/TestRpc.TestClientConnectionMetrics/SSL_TCP
I20260929 20:17:32.998726  5987 acceptor_pool.cc:254] collecting diagnostics on the listening RPC socket 0.0.0.0:44737 every 8 connection(s)
I20260929 20:17:32.999022  5988 acceptor_pool.cc:254] collecting diagnostics on the listening RPC socket 0.0.0.0:44737 every 8 connection(s)
I20260929 20:17:33.000061  5843 rpc-test.cc:569] Connecting to 0.0.0.0:44737
[       OK ] Parameters/TestRpc.TestClientConnectionMetrics/SSL_TCP (21303 ms)
[ RUN      ] Parameters/TestRpc.TestCredentialsPolicy/SSL_TCP
I20260929 20:17:54.304318  6010 acceptor_pool.cc:254] collecting diagnostics on the listening RPC socket 0.0.0.0:46561 every 8 connection(s)
I20260929 20:17:54.304555  6011 acceptor_pool.cc:254] collecting diagnostics on the listening RPC socket 0.0.0.0:46561 every 8 connection(s)
I20260929 20:17:54.305598  5843 rpc-test.cc:700] Connecting to 0.0.0.0:46561
[       OK ] Parameters/TestRpc.TestCredentialsPolicy/SSL_TCP (61 ms)
[ RUN      ] Parameters/TestRpc.TestCallLongerThanKeepalive/SSL_TCP
I20260929 20:17:54.366873  6035 acceptor_pool.cc:254] collecting diagnostics on the listening RPC socket 0.0.0.0:40953 every 8 connection(s)
I20260929 20:17:54.367159  6036 acceptor_pool.cc:254] collecting diagnostics on the listening RPC socket 0.0.0.0:40953 every 8 connection(s)
I20260929 20:17:54.385684  6039 rpc-test-base.h:222] got call: sleep_micros: 3000000 deferred: true
I20260929 20:17:57.387890  6039 rpcz_store.cc:275] Call kudu.rpc.GenericCalculatorService.Sleep from 127.0.0.1:35202 (request call id 0) took 3002 ms. Trace:
I20260929 20:17:57.388195  6039 rpcz_store.cc:276] 0929 20:17:54.385562 (+     0us) service_pool.cc:170] Inserting onto call queue
0929 20:17:54.385634 (+    72us) service_pool.cc:227] Handling call
0929 20:17:57.387796 (+3002162us) inbound_call.cc:173] Queueing success response
Metrics: {}
[       OK ] Parameters/TestRpc.TestCallLongerThanKeepalive/SSL_TCP (3046 ms)
[ RUN      ] Parameters/TestRpc.TestRpcSidecar/SSL_TCP
I20260929 20:17:57.415454  6060 acceptor_pool.cc:254] collecting diagnostics on the listening RPC socket 0.0.0.0:45973 every 8 connection(s)
I20260929 20:17:57.415763  6061 acceptor_pool.cc:254] collecting diagnostics on the listening RPC socket 0.0.0.0:45973 every 8 connection(s)
[       OK ] Parameters/TestRpc.TestRpcSidecar/SSL_TCP (134 ms)
[ RUN      ] Parameters/TestRpc.TestRpcSidecarLimits/SSL_TCP
I20260929 20:17:59.811932  6085 acceptor_pool.cc:254] collecting diagnostics on the listening RPC socket 0.0.0.0:34063 every 8 connection(s)
I20260929 20:17:59.812292  6086 acceptor_pool.cc:254] collecting diagnostics on the listening RPC socket 0.0.0.0:34063 every 8 connection(s)
W20260929 20:17:59.820842  5843 serialization.cc:72] Serialized kudu.rpc_test.PushStringsRequestPB (2147483654 bytes) is larger than the maximum configured RPC message size (52428800 bytes). Sending anyway, but peer may reject the data.
W20260929 20:17:59.827755  6084 connection.cc:535] server connection from 127.0.0.1:37080 recv error: Network error: RPC frame had a length of 2147483714, but we only support messages up to 52428800 bytes long.
W20260929 20:17:59.827883  6084 connection.cc:158] shutting down server connection from 127.0.0.1:37080 with pending inbound data: 4/2147483714 bytes received; last active 0 ns ago: status Network error: RPC frame had a length of 2147483714, but we only support messages up to 52428800 bytes long.
W20260929 20:17:59.828533  6098 connection.cc:196] Error closing socket: Network error: TlsSocket::Close: Connection reset by peer
I20260929 20:17:59.849954  6110 acceptor_pool.cc:254] collecting diagnostics on the listening RPC socket 0.0.0.0:44985 every 8 connection(s)
I20260929 20:17:59.850237  6111 acceptor_pool.cc:254] collecting diagnostics on the listening RPC socket 0.0.0.0:44985 every 8 connection(s)
W20260929 20:18:05.420773  6107 connection.cc:577] server connection from 127.0.0.1:45196: received bad data: 'Corruption: Invalid packet: message had a length of 2147483710, but we only support messages up to 2147483647 bytes
'
[       OK ] Parameters/TestRpc.TestRpcSidecarLimits/SSL_TCP (8452 ms)
[ RUN      ] Parameters/TestRpc.TestCallTimeoutDoesntAffectNegotiation/SSL_TCP
I20260929 20:18:06.007974  6135 acceptor_pool.cc:254] collecting diagnostics on the listening RPC socket 0.0.0.0:35323 every 8 connection(s)
I20260929 20:18:06.008337  6136 acceptor_pool.cc:254] collecting diagnostics on the listening RPC socket 0.0.0.0:35323 every 8 connection(s)
W20260929 20:18:06.025321  6131 negotiation.cc:266] Injecting 500ms delay in negotiation
I20260929 20:18:06.075950  5843 rpc-test-base.h:595] status: Timed out: connection negotiation to 0.0.0.0:35323 for RPC Sleep timed out after 0.050s (ON_OUTBOUND_QUEUE), seconds elapsed: 0.0515594
[       OK ] Parameters/TestRpc.TestCallTimeoutDoesntAffectNegotiation/SSL_TCP (554 ms)
[ RUN      ] Parameters/TestRpc.TestRpcHandlerLatencyMetric/SSL_TCP
I20260929 20:18:06.550762  6160 acceptor_pool.cc:254] collecting diagnostics on the listening RPC socket 0.0.0.0:43097 every 8 connection(s)
I20260929 20:18:06.551005  6161 acceptor_pool.cc:254] collecting diagnostics on the listening RPC socket 0.0.0.0:43097 every 8 connection(s)
I20260929 20:18:06.601248  5843 rpc-test.cc:1236] Sleep() min lat: 20759
I20260929 20:18:06.601348  5843 rpc-test.cc:1237] Sleep() mean lat: 20759
I20260929 20:18:06.601387  5843 rpc-test.cc:1238] Sleep() max lat: 20759
I20260929 20:18:06.601408  5843 rpc-test.cc:1239] Sleep() #calls: 1
[       OK ] Parameters/TestRpc.TestRpcHandlerLatencyMetric/SSL_TCP (69 ms)
[ RUN      ] Parameters/TestRpc.TimedOutOnResponseMetricServiceQueue/SSL_TCP
I20260929 20:18:06.631649  6186 acceptor_pool.cc:254] collecting diagnostics on the listening RPC socket 0.0.0.0:39437 every 8 connection(s)
I20260929 20:18:06.631887  6187 acceptor_pool.cc:254] collecting diagnostics on the listening RPC socket 0.0.0.0:39437 every 8 connection(s)
W20260929 20:18:06.690945  6188 rpcz_store.cc:267] Call kudu.rpc_test.CalculatorService.Sleep from 127.0.0.1:53782 (request call id 2) took 20 ms (client timeout 20 ms). Trace:
W20260929 20:18:06.691216  6188 rpcz_store.cc:269] 0929 20:18:06.670208 (+     0us) service_pool.cc:170] Inserting onto call queue
0929 20:18:06.690810 (+ 20602us) service_pool.cc:214] Skipping call since client already timed out
0929 20:18:06.690899 (+    89us) inbound_call.cc:173] Queueing failure response
Metrics: {}
[       OK ] Parameters/TestRpc.TimedOutOnResponseMetricServiceQueue/SSL_TCP (90 ms)
[ RUN      ] Parameters/TestRpc.RpcPendingConnectionsMetric/SSL_TCP
I20260929 20:18:06.704783  6209 acceptor_pool.cc:254] collecting diagnostics on the listening RPC socket 0.0.0.0:39871 every 8 connection(s)
I20260929 20:18:06.705077  6210 acceptor_pool.cc:254] collecting diagnostics on the listening RPC socket 0.0.0.0:39871 every 8 connection(s)
W20260929 20:18:06.707732  6205 negotiation.cc:337] Failed RPC negotiation. Trace:
0929 20:18:06.706961 (+     0us) reactor.cc:625] Submitting negotiation task for server connection from 127.0.0.1:48282 (local address 127.0.0.1:39871)
0929 20:18:06.707158 (+   197us) server_negotiation.cc:206] Beginning negotiation
0929 20:18:06.707163 (+     5us) server_negotiation.cc:399] Waiting for connection header
0929 20:18:06.707352 (+   189us) negotiation.cc:327] Negotiation complete: Network error: Server connection negotiation failed: server connection from 127.0.0.1:48282: BlockingRecv error: recv got EOF from 127.0.0.1:48282 (error 108)
Metrics: {"server-negotiator.queue_time_us":73}
[       OK ] Parameters/TestRpc.RpcPendingConnectionsMetric/SSL_TCP (23 ms)
[ RUN      ] Parameters/TestRpc.TestRpcContextClientDeadline/SSL_TCP
I20260929 20:18:06.739459  6225 acceptor_pool.cc:254] collecting diagnostics on the listening RPC socket 0.0.0.0:45409 every 8 connection(s)
I20260929 20:18:06.739737  6226 acceptor_pool.cc:254] collecting diagnostics on the listening RPC socket 0.0.0.0:45409 every 8 connection(s)
[       OK ] Parameters/TestRpc.TestRpcContextClientDeadline/SSL_TCP (66 ms)
[ RUN      ] Parameters/TestRpc.TestApplicationFeatureFlagUnsupportedServer/SSL_TCP
I20260929 20:18:06.802084  6250 acceptor_pool.cc:254] collecting diagnostics on the listening RPC socket 0.0.0.0:33867 every 8 connection(s)
I20260929 20:18:06.802345  6251 acceptor_pool.cc:254] collecting diagnostics on the listening RPC socket 0.0.0.0:33867 every 8 connection(s)
[       OK ] Parameters/TestRpc.TestApplicationFeatureFlagUnsupportedServer/SSL_TCP (53 ms)
[ RUN      ] Parameters/TestRpc.TestCancellationAsync/SSL_TCP
I20260929 20:18:06.867233  6275 acceptor_pool.cc:254] collecting diagnostics on the listening RPC socket 0.0.0.0:42067 every 8 connection(s)
I20260929 20:18:06.867537  6276 acceptor_pool.cc:254] collecting diagnostics on the listening RPC socket 0.0.0.0:42067 every 8 connection(s)
I20260929 20:18:06.868665  5843 rpc-test.cc:1716] Connecting to 0.0.0.0:42067
I20260929 20:18:06.898694  5843 test_util.cc:268] Using random seed: -512724515
I20260929 20:18:06.944340  6279 rpc-test-base.h:240] got call: sleep_micros: 500 pattern: 4294967295 num_repetitions: 2097152 sidecar_idx: 0
I20260929 20:18:06.975385  6278 rpc-test-base.h:240] got call: sleep_micros: 500 pattern: 4294967295 num_repetitions: 2097152 sidecar_idx: 0
I20260929 20:18:07.000835  6277 rpc-test-base.h:240] got call: sleep_micros: 500 pattern: 4294967295 num_repetitions: 2097152 sidecar_idx: 0
I20260929 20:18:07.027005  6279 rpc-test-base.h:240] got call: sleep_micros: 500 pattern: 4294967295 num_repetitions: 2097152 sidecar_idx: 0
I20260929 20:18:07.052973  6278 rpc-test-base.h:240] got call: sleep_micros: 500 pattern: 4294967295 num_repetitions: 2097152 sidecar_idx: 0
I20260929 20:18:07.095377  6279 rpc-test-base.h:240] got call: sleep_micros: 500 pattern: 4294967295 num_repetitions: 2097152 sidecar_idx: 0
I20260929 20:18:07.131335  6278 rpc-test-base.h:240] got call: sleep_micros: 500 pattern: 4294967295 num_repetitions: 2097152 sidecar_idx: 0
W20260929 20:18:07.167742  6273 connection.cc:196] Error closing socket: Network error: TlsSocket::Close: Broken pipe
W20260929 20:18:07.169041  6273 connection.cc:441] server connection from 127.0.0.1:56374 torn down before Call kudu.rpc.GenericCalculatorService.SleepWithSidecar from 127.0.0.1:56374 (request call id 8) could send its response
[       OK ] Parameters/TestRpc.TestCancellationAsync/SSL_TCP (330 ms)
[ RUN      ] Parameters/TestRpc.TestPerformanceBySocketType/SSL_TCP
I20260929 20:18:07.186954  6300 acceptor_pool.cc:254] collecting diagnostics on the listening RPC socket 0.0.0.0:45427 every 8 connection(s)
I20260929 20:18:07.187196  6301 acceptor_pool.cc:254] collecting diagnostics on the listening RPC socket 0.0.0.0:45427 every 8 connection(s)
I20260929 20:18:07.188169  5843 rpc-test.cc:1846] Connecting to 0.0.0.0:45427
I20260929 20:18:10.652526  5843 rpc-test.cc:1859] Sending 1024MB via ssl-enabled tcp socket: real 3.454s	user 3.086s	sys 2.710s
I20260929 20:18:14.079464  5843 rpc-test.cc:1859] Sending 1024MB via ssl-enabled tcp socket: real 3.427s	user 2.897s	sys 2.857s
I20260929 20:18:17.523481  5843 rpc-test.cc:1859] Sending 1024MB via ssl-enabled tcp socket: real 3.444s	user 2.927s	sys 2.809s
I20260929 20:18:20.984844  5843 rpc-test.cc:1859] Sending 1024MB via ssl-enabled tcp socket: real 3.461s	user 3.091s	sys 2.774s
I20260929 20:18:24.415238  5843 rpc-test.cc:1859] Sending 1024MB via ssl-enabled tcp socket: real 3.430s	user 2.933s	sys 2.812s
[       OK ] Parameters/TestRpc.TestPerformanceBySocketType/SSL_TCP (17250 ms)
[----------] 20 tests from Parameters/TestRpc (52776 ms total)

[----------] 1 test from Parameters/TestRpcSocketTxRxQueue
[ RUN      ] Parameters/TestRpcSocketTxRxQueue.OverCapacity/0
W20260929 20:18:24.731050  6326 negotiation.cc:337] Failed RPC negotiation. Trace:
0929 20:18:24.431486 (+     0us) reactor.cc:625] Submitting negotiation task for client connection to 0.0.0.0:41905 (local address 127.0.0.1:57968)
0929 20:18:24.431674 (+   188us) negotiation.cc:107] Waiting for socket to connect
0929 20:18:24.431694 (+    20us) client_negotiation.cc:174] Beginning negotiation
0929 20:18:24.431787 (+    93us) client_negotiation.cc:252] Sending NEGOTIATE NegotiatePB request
0929 20:18:24.730494 (+298707us) negotiation.cc:327] Negotiation complete: Network error: Client connection negotiation failed: client connection to 0.0.0.0:41905: BlockingRecv error: recv error from unknown peer: Transport endpoint is not connected (error 107)
Metrics: {"client-negotiator.queue_time_us":53}
W20260929 20:18:24.731671  6353 negotiation.cc:337] Failed RPC negotiation. Trace:
0929 20:18:24.441026 (+     0us) reactor.cc:625] Submitting negotiation task for client connection to 0.0.0.0:41905 (local address 127.0.0.1:57984)
0929 20:18:24.441267 (+   241us) negotiation.cc:107] Waiting for socket to connect
0929 20:18:24.441290 (+    23us) client_negotiation.cc:174] Beginning negotiation
0929 20:18:24.441464 (+   174us) client_negotiation.cc:252] Sending NEGOTIATE NegotiatePB request
0929 20:18:24.730856 (+289392us) negotiation.cc:327] Negotiation complete: Network error: Client connection negotiation failed: client connection to 0.0.0.0:41905: BlockingRecv error: recv error from unknown peer: Transport endpoint is not connected (error 107)
Metrics: {"client-negotiator.queue_time_us":65}
W20260929 20:18:24.732188  6335 negotiation.cc:337] Failed RPC negotiation. Trace:
0929 20:18:24.434575 (+     0us) reactor.cc:625] Submitting negotiation task for client connection to 0.0.0.0:41905 (local address 127.0.0.1:57970)
0929 20:18:24.434812 (+   237us) negotiation.cc:107] Waiting for socket to connect
0929 20:18:24.434836 (+    24us) client_negotiation.cc:174] Beginning negotiation
0929 20:18:24.434973 (+   137us) client_negotiation.cc:252] Sending NEGOTIATE NegotiatePB request
0929 20:18:24.730436 (+295463us) negotiation.cc:327] Negotiation complete: Network error: Client connection negotiation failed: client connection to 0.0.0.0:41905: BlockingRecv error: recv error from unknown peer: Transport endpoint is not connected (error 107)
Metrics: {"client-negotiator.queue_time_us":64}
W20260929 20:18:24.732323  6317 negotiation.cc:337] Failed RPC negotiation. Trace:
0929 20:18:24.428482 (+     0us) reactor.cc:625] Submitting negotiation task for client connection to 0.0.0.0:41905 (local address 127.0.0.1:57954)
0929 20:18:24.428651 (+   169us) negotiation.cc:107] Waiting for socket to connect
0929 20:18:24.428669 (+    18us) client_negotiation.cc:174] Beginning negotiation
0929 20:18:24.428795 (+   126us) client_negotiation.cc:252] Sending NEGOTIATE NegotiatePB request
0929 20:18:24.730494 (+301699us) negotiation.cc:327] Negotiation complete: Network error: Client connection negotiation failed: client connection to 0.0.0.0:41905: BlockingRecv error: recv error from unknown peer: Transport endpoint is not connected (error 107)
Metrics: {"client-negotiator.queue_time_us":48}
W20260929 20:18:24.732470  6362 negotiation.cc:337] Failed RPC negotiation. Trace:
0929 20:18:24.444813 (+     0us) reactor.cc:625] Submitting negotiation task for client connection to 0.0.0.0:41905 (local address 127.0.0.1:57998)
0929 20:18:24.445050 (+   237us) negotiation.cc:107] Waiting for socket to connect
0929 20:18:24.445070 (+    20us) client_negotiation.cc:174] Beginning negotiation
0929 20:18:24.445189 (+   119us) client_negotiation.cc:252] Sending NEGOTIATE NegotiatePB request
0929 20:18:24.731671 (+286482us) negotiation.cc:327] Negotiation complete: Network error: Client connection negotiation failed: client connection to 0.0.0.0:41905: BlockingRecv error: recv error from unknown peer: Transport endpoint is not connected (error 107)
Metrics: {"client-negotiator.queue_time_us":65}
W20260929 20:18:24.732496  6344 negotiation.cc:337] Failed RPC negotiation. Trace:
0929 20:18:24.437662 (+     0us) reactor.cc:625] Submitting negotiation task for client connection to 0.0.0.0:41905 (local address 127.0.0.1:57982)
0929 20:18:24.437870 (+   208us) negotiation.cc:107] Waiting for socket to connect
0929 20:18:24.437891 (+    21us) client_negotiation.cc:174] Beginning negotiation
0929 20:18:24.438015 (+   124us) client_negotiation.cc:252] Sending NEGOTIATE NegotiatePB request
0929 20:18:24.731162 (+293147us) negotiation.cc:327] Negotiation complete: Network error: Client connection negotiation failed: client connection to 0.0.0.0:41905: BlockingRecv error: recv error from unknown peer: Transport endpoint is not connected (error 107)
Metrics: {"client-negotiator.queue_time_us":62}
[       OK ] Parameters/TestRpcSocketTxRxQueue.OverCapacity/0 (1083 ms)
[----------] 1 test from Parameters/TestRpcSocketTxRxQueue (1083 ms total)

[----------] Global test environment tear-down
[==========] 21 tests from 2 test suites ran. (53860 ms total)
[  PASSED  ] 20 tests.
[  FAILED  ] 1 test, listed below:
[  FAILED  ] Parameters/TestRpc.TestCallWithChainCertAndChainCA/SSL_TCP, where GetParam() = (true, false)

 1 FAILED TEST